{"text_format":"1","workbook":"xlsx","n_sheets":12,"sheets":["HM","Lichtpunkt","Schüler","Jugend","Junioren I","Junioren II","UK-König","LP-König","Sammler","Daten","Ergebnis 1","Ergebnis 2"],"not_rendered":{"charts":0,"images":30,"macros":1,"external_links":0,"defined_names":8,"comments":0,"pivot_tables":0},"unopened":[],"bounds":{"document_bytes":16777216,"sheet_cells":100000,"rows_first":2000,"rows_last":500,"rows_between":2000,"halvings":0,"cell_chars":16384,"cell_head_chars":4096},"cells_cut":0,"cells_raw":0,"read":"whole","date_system":"1900"}

{"sheet":"HM","index":0,"n_rows":31,"n_cols":12,"rows_kept":31,"cut":false,"hidden":false,"merged":[[14,7,14,12],[23,8,23,10],[24,8,24,10],[15,11,15,12],[16,11,16,12],[17,11,17,12],[18,11,18,12],[19,11,19,12],[20,11,20,12],[21,11,21,12],[22,11,22,12],[23,11,23,12],[24,11,24,12],[1,1,5,14],[26,7,26,14],[30,3,30,5],[30,6,30,14],[27,7,27,8],[30,1,30,2],[6,2,6,5],[6,7,6,8],[15,8,15,10],[16,8,16,10],[17,8,17,10],[18,8,18,10],[19,8,19,10],[20,8,20,10],[21,8,21,10],[22,8,22,10]]}
[]
[null,"Unterkreis III - Schießen der Jugend"]
[]
[]
[]
[]
[null,"in  ","Garstedt",null,null,null,"Datum:","28.09.2019"]
[]
[]
[]
[]
[]
[]
[]
[null,null,null,null,null,null,null,"Klasseneinteilung:"]
[null,null,null,null,null,null,null,20,"LG Schüler I  männlich",null,null,"10 - 14 Jahre"]
[null,null,null,null,null,null,null,21,"LG Schüler I  weiblich",null,null,"10 - 14 Jahre"]
[null,null,null,null,null,null,null,24,"Lichtpunkt Schüler II  männlich",null,null,"< 12 Jahre"]
[null,null,null,null,null,null,null,25,"Lichtpunkt Schüler II  weiblich",null,null,"< 12 Jahre"]
[null,null,null,null,null,null,null,30,"Jugend  männlich",null,null,"15 - 16 Jahre"]
[null,null,null,null,null,null,null,31,"Jugend  weiblich",null,null,"15 - 16 Jahre"]
[null,null,null,null,null,null,null,40,"Junioren I  männlich",null,null,"19 - 20 Jahre"]
[null,null,null,null,null,null,null,41,"Junioren I  weiblich",null,null,"19 - 20 Jahre"]
[null,null,null,null,null,null,null,42,"Junioren II  männlich",null,null,"17 - 18 Jahre"]
[null,null,null,null,null,null,null,43,"Junioren II  weiblich",null,null,"17 - 18 Jahre"]
[]
[null,null,null,null,null,null,null,"2023 © R. Marquardt, Version 1.5"]
[]
[]
[]
[null,null,null,"Heute ist:  ",null,null,{"$f":"CONCATENATE(TEXT(NOW(),\"TTTT, TT. MMMM JJJJ\"))","v":"Samstag, 05. August 2023"}]

{"sheet":"Lichtpunkt","index":1,"n_rows":54,"n_cols":21,"rows_kept":54,"cut":false,"hidden":false,"merged":[[0,0,0,4],[0,6,0,10],[0,12,0,14],[0,16,0,18]]}
["Schüler II\nLichtpunkt Auflage (8 - 11 Jahre)\n10 Schuss\n",null,null,null,null,null,"Schüler II\nLichtpunkt Freihand (8 - 11 Jahre)\n10 Schuss\n",null,null,null,null,null,"Mannschaft Schüler II\nLichtpunkt Auflage (8 - 11 Jahre)\n",null,null,null,"Mannschaft Schüler II\nLichtpunkt Freihand (8 - 11 Jahre)\n",null,null,null,"Klassen"]
["Klasse:","Name:","Verein:","Ringe:","Teiler:",null,"Klasse:","Name:","Verein:","Ringe:","Teiler:",null,"Verein:","Ringe:","Teiler:",null,"Verein:","Ringe:","Teiler:",null,24]
[null,null,null,null,null,null,null,null,null,null,null,null,null,null,null,null,null,null,null,null,25]
[]
[]
[]
[]
[]
[]
[]
[]
[]
[]
[]
[]
[]
[]
[]
[]
[]
[]
[]
[]
[]
[]
[]
[]
[]
[]
[]
[]
[]
[]
[]
[]
[]
[]
[]
[]
[]
[]
[]
[]
[]
[]
[]
[]
[]
[]
[]
[]
[]
[]
[null,"Ende der Liste !",null,null,null,null,null,"Ende der Liste !",null,null,null,null,"Ende der Liste !",null,null,null,"Ende der Liste !"]

{"sheet":"Schüler","index":2,"n_rows":54,"n_cols":21,"rows_kept":54,"cut":false,"hidden":false,"merged":[[0,0,0,4],[0,6,0,10],[0,12,0,14],[0,16,0,18]]}
["Schüler I\nLG Auflage (12 - 14 Jahre)\n10 Schuss\n",null,null,null,null,null,"Schüler I\nLG Freihand (12 - 14 Jahre)\n10 Schuss\n",null,null,null,null,null,"Mannschaft Schüler I\nLG Auflage (12 - 14 Jahre)\n",null,null,null,"Mannschaft Schüler I\nLG Freihand (12 - 14 Jahre)\n",null,null,null,"Klassen"]
["Klasse:","Name:","Verein:","Ringe:","Teiler:",null,"Klasse:","Name:","Verein:","Ringe:","Teiler:",null,"Verein:","Ringe:","Teiler:",null,"Verein:","Ringe:","Teiler:",null,20]
[null,null,null,null,null,null,null,null,null,null,null,null,null,null,null,null,null,null,null,null,21]
[]
[]
[]
[]
[]
[]
[]
[]
[]
[]
[]
[]
[]
[]
[]
[]
[]
[]
[]
[]
[]
[]
[]
[]
[]
[]
[]
[]
[]
[]
[]
[]
[]
[]
[]
[]
[]
[]
[]
[]
[]
[]
[]
[]
[]
[]
[]
[]
[]
[]
[null,"Ende der Liste !",null,null,null,null,null,"Ende der Liste !",null,null,null,null,"Ende der Liste !",null,null,null,"Ende der Liste !"]

{"sheet":"Jugend","index":3,"n_rows":54,"n_cols":21,"rows_kept":54,"cut":false,"hidden":false,"merged":[[0,0,0,4],[0,6,0,10],[0,12,0,14],[0,16,0,18]]}
["Jugend LG Freihand (15 - 16 Jahre)\n20 Schuss\n",null,null,null,null,null,"Jugend KK Auflage (15 - 16 Jahre)\n10 Schuss\n",null,null,null,null,null,"Mannschaft Jugend\nKK Auflage (15 - 16 Jahre)\n",null,null,null,"Mannschaft Jugend\nLG Freihand (15 - 16 Jahre)\n",null,null,null,"Klassen"]
["Klasse:","Name:","Verein:","Ringe:","Teiler:",null,"Klasse:","Name:","Verein:","Ringe:","Teiler:",null,"Verein:","Ringe:","Teiler:",null,"Verein:","Ringe:","Teiler:",null,30]
[null,null,null,null,null,null,null,null,null,null,null,null,null,null,null,null,null,null,null,null,31]
[]
[]
[]
[]
[]
[]
[]
[]
[]
[]
[]
[]
[]
[]
[]
[]
[]
[]
[]
[]
[]
[]
[]
[]
[]
[]
[]
[]
[]
[]
[]
[]
[]
[]
[]
[]
[]
[]
[]
[]
[]
[]
[]
[]
[]
[]
[]
[]
[]
[]
[null,"Ende der Liste !",null,null,null,null,null,"Ende der Liste !",null,null,null,null,"Ende der Liste !",null,null,null,"Ende der Liste !"]

{"sheet":"Junioren I","index":4,"n_rows":54,"n_cols":21,"rows_kept":54,"cut":false,"hidden":false,"merged":[[0,0,0,4],[0,6,0,10],[0,12,0,14],[0,16,0,18]]}
["Junioren I\nLG Freihand (19 - 20 Jahre)\n20 Schuss\n",null,null,null,null,null,"Junioren I\nKK Auflage (19 - 20 Jahre)\n10 Schuss\n",null,null,null,null,null,"Mannschaft Junioren I\nKK Auflage (19 - 20 Jahre)",null,null,null,"Mannschaft Junioren I\nLG Freihand (19 - 20 Jahre)",null,null,null,"Klassen"]
["Klasse:","Name:","Verein:","Ringe:","Teiler:",null,"Klasse:","Name:","Verein:","Ringe:","Teiler:",null,"Verein:","Ringe:","Teiler:",null,"Verein:","Ringe:","Teiler:",null,40]
[null,null,null,null,null,null,null,null,null,null,null,null,null,null,null,null,null,null,null,null,41]
[]
[]
[]
[]
[]
[]
[]
[]
[]
[]
[]
[]
[]
[]
[]
[]
[]
[]
[]
[]
[]
[]
[]
[]
[]
[]
[]
[]
[]
[]
[]
[]
[]
[]
[]
[]
[]
[]
[]
[]
[]
[]
[]
[]
[]
[]
[]
[]
[]
[]
[null,"Ende der Liste !",null,null,null,null,null,"Ende der Liste !",null,null,null,null,"Ende der Liste !",null,null,null,"Ende der Liste !"]

{"sheet":"Junioren II","index":5,"n_rows":54,"n_cols":21,"rows_kept":54,"cut":false,"hidden":false,"merged":[[0,0,0,4],[0,6,0,10],[0,12,0,14],[0,16,0,18]]}
["Junioren II\nLG Freihand (17 - 18 Jahre)\n20 Schuss\n",null,null,null,null,null,"Junioren II\nKK Auflage (17 - 18 Jahre)\n10 Schuss\n",null,null,null,null,null,"Mannschaft Junioren II\nKK Auflage (17 - 18 Jahre)",null,null,null,"Mannschaft Junioren II\nLG Freihand (17 - 18 Jahre)",null,null,null,"Klassen"]
["Klasse:","Name:","Verein:","Ringe:","Teiler:",null,"Klasse:","Name:","Verein:","Ringe:","Teiler:",null,"Verein:","Ringe:","Teiler:",null,"Verein:","Ringe:","Teiler:",null,42]
[null,null,null,null,null,null,null,null,null,null,null,null,null,null,null,null,null,null,null,null,43]
[]
[]
[]
[]
[]
[]
[]
[]
[]
[]
[]
[]
[]
[]
[]
[]
[]
[]
[]
[]
[]
[]
[]
[]
[]
[]
[]
[]
[]
[]
[]
[]
[]
[]
[]
[]
[]
[]
[]
[]
[]
[]
[]
[]
[]
[]
[]
[]
[]
[]
[null,"Ende der Liste !",null,null,null,null,null,"Ende der Liste !",null,null,null,null,"Ende der Liste !",null,null,null,"Ende der Liste !"]

{"sheet":"UK-König","index":6,"n_rows":54,"n_cols":4,"rows_kept":54,"cut":false,"hidden":false,"merged":[[0,0,0,2]]}
["UK-III König-/in"]
["Name:","Verein:","Teiler:","Lfd. Nr.:"]
[null,null,null,1]
[null,null,null,2]
[null,null,null,3]
[null,null,null,4]
[null,null,null,5]
[null,null,null,6]
[null,null,null,7]
[null,null,null,8]
[null,null,null,9]
[null,null,null,10]
[null,null,null,11]
[null,null,null,12]
[null,null,null,13]
[null,null,null,14]
[null,null,null,15]
[null,null,null,16]
[null,null,null,17]
[null,null,null,18]
[null,null,null,19]
[null,null,null,20]
[null,null,null,21]
[null,null,null,22]
[null,null,null,23]
[null,null,null,24]
[null,null,null,25]
[null,null,null,26]
[null,null,null,27]
[null,null,null,28]
[null,null,null,29]
[null,null,null,30]
[null,null,null,31]
[null,null,null,32]
[null,null,null,33]
[null,null,null,34]
[null,null,null,35]
[null,null,null,36]
[null,null,null,37]
[null,null,null,38]
[null,null,null,39]
[null,null,null,40]
[null,null,null,41]
[null,null,null,42]
[null,null,null,43]
[null,null,null,44]
[null,null,null,45]
[null,null,null,46]
[null,null,null,47]
[null,null,null,48]
[null,null,null,49]
[null,null,null,50]
[]
["Ende der Liste !"]

{"sheet":"LP-König","index":7,"n_rows":54,"n_cols":4,"rows_kept":54,"cut":false,"hidden":false,"merged":[[0,0,0,2]]}
["Lichtpunkt König-/in"]
["Name:","Verein:","Teiler:","Lfd. Nr.:"]
[null,null,null,1]
[null,null,null,2]
[null,null,null,3]
[null,null,null,4]
[null,null,null,5]
[null,null,null,6]
[null,null,null,7]
[null,null,null,8]
[null,null,null,9]
[null,null,null,10]
[null,null,null,11]
[null,null,null,12]
[null,null,null,13]
[null,null,null,14]
[null,null,null,15]
[null,null,null,16]
[null,null,null,17]
[null,null,null,18]
[null,null,null,19]
[null,null,null,20]
[null,null,null,21]
[null,null,null,22]
[null,null,null,23]
[null,null,null,24]
[null,null,null,25]
[null,null,null,26]
[null,null,null,27]
[null,null,null,28]
[null,null,null,29]
[null,null,null,30]
[null,null,null,31]
[null,null,null,32]
[null,null,null,33]
[null,null,null,34]
[null,null,null,35]
[null,null,null,36]
[null,null,null,37]
[null,null,null,38]
[null,null,null,39]
[null,null,null,40]
[null,null,null,41]
[null,null,null,42]
[null,null,null,43]
[null,null,null,44]
[null,null,null,45]
[null,null,null,46]
[null,null,null,47]
[null,null,null,48]
[null,null,null,49]
[null,null,null,50]
[]
["Ende der Liste !"]

{"sheet":"Sammler","index":8,"n_rows":52,"n_cols":107,"rows_kept":52,"cut":false,"hidden":false,"merged":[[0,104,0,106],[0,96,0,98],[0,100,0,102],[0,70,0,74],[0,76,0,78],[0,80,0,82],[0,84,0,88],[0,90,0,94],[0,26,0,30],[0,0,0,4],[0,6,0,10],[0,12,0,14],[0,16,0,18],[0,20,0,24],[0,64,0,68],[0,60,0,62],[0,32,0,34],[0,36,0,38],[0,40,0,44],[0,46,0,50],[0,52,0,54],[0,56,0,58]]}
["Schüler I\n LG Auflage (12 - 14 Jahre)\n10 Schuss",null,null,null,null,null,"Schüler I\nLG Freihand (12 - 14 Jahre)\n10 Schuss",null,null,null,null,null,"Mannschaft Schüler I\nLG Auflage (12 - 14 Jahre)",null,null,null,"Mannschaft Schüler I\nLG Freihand (12 - 14 Jahre)",null,null,null,"Jugend LG Freihand (15 - 16 Jahre)\n20 Schuss",null,null,null,null,null,"Jugend KK Auflage (15 - 16 Jahre)\n10 Schuss",null,null,null,null,null,"Mannschaft Jugend\nKK Auflage (15 - 16 Jahre)",null,null,null,"Mannschaft Jugend\nLG Freihand (15 - 16 Jahre)",null,null,null,"Junioren II\nLG Freihand (17 - 18 Jahre)\n20 Schuss",null,null,null,null,null,"Junioren II\nKK Auflage (17 - 18 Jahre)\n10 Schuss",null,null,null,null,null,"Mannschaft Junioren II\nKK Auflage (17 - 18 Jahre)",null,null,null,"Mannschaft Junioren II\nLG Freihand (17 - 18 Jahre)",null,null,null,"UK-III König-/in",null,null,null,"Junioren I\nLG Freihand (19 - 20 Jahre)\n20 Schuss",null,null,null,null,null,"Junioren I\nKK Auflage (19 - 20 Jahre)\n10 Schuss",null,null,null,null,null,"Mannschaft Junioren I\nKK Auflage (19 - 20 Jahre)",null,null,null,"Mannschaft Junioren I\nLG Freihand (19 - 20 Jahre)",null,null,null,"Schüler II Lichtpunkt\n Auflage (8 - 11 Jahre)\n10 Schuss",null,null,null,null,null,"Schüler II Lichtpunkt\nFreihand (8 - 11 Jahre)\n10 Schuss",null,null,null,null,null,"Mannschaft Schüler II\nLichtpunkt Auflage (8 - 11 Jahre)",null,null,null,"Mannschaft Schüler II\nLichtpunkt Freihand (8 - 11 Jahre)",null,null,null,"Lichtpunkt König-/in"]
["Klasse:","Name:","Verein:","Ringe:","Teiler:",null,"Klasse:","Name:","Verein:","Ringe:","Teiler:",null,"Verein:","Ringe:","Teiler:",null,"Verein:","Ringe:","Teiler:",null,"Klasse:","Name:","Verein:","Ringe:","Teiler:",null,"Klasse:","Name:","Verein:","Ringe:","Teiler:",null,"Verein:","Ringe:","Teiler:",null,"Verein:","Ringe:","Teiler:",null,"Klasse:","Name:","Verein:","Ringe:","Teiler:",null,"Klasse:","Name:","Verein:","Ringe:","Teiler:",null,"Verein:","Ringe:","Teiler:",null,"Verein:","Ringe:","Teiler:",null,"Name:","Verein:","Teiler:",null,"Klasse:","Name:","Verein:","Ringe:","Teiler:",null,"Klasse:","Name:","Verein:","Ringe:","Teiler:",null,"Verein:","Ringe:","Teiler:",null,"Verein:","Ringe:","Teiler:",null,"Klasse:","Name:","Verein:","Ringe:","Teiler:",null,"Klasse:","Name:","Verein:","Ringe:","Teiler:",null,"Verein:","Ringe:","Teiler:",null,"Verein:","Ringe:","Teiler:",null,"Name:","Verein:","Teiler:"]
[{"$f":"IF(D3=\"\",\"\",Schüler!A3)","v":0},{"$f":"IF(D3=\"\",\"\",Schüler!B3)","v":0},{"$f":"IF(D3=\"\",\"\",Schüler!C3)","v":0},{"$f":"IF(Schüler!D3=\"\",0,Schüler!D3)","v":0},{"$f":"IF(Schüler!E3=\"\",0,Schüler!E3)","v":0},null,{"$f":"IF(J3=\"\",\"\",Schüler!G3)","v":0},{"$f":"IF(J3=\"\",\"\",Schüler!H3)","v":0},{"$f":"IF(J3=\"\",\"\",Schüler!I3)","v":0},{"$f":"IF(Schüler!J3=\"\",0,Schüler!J3)","v":0},{"$f":"IF(Schüler!K3=\"\",0,Schüler!K3)","v":0},null,{"$f":"IF(N3=\"\",\"\",Schüler!M3)","v":0},{"$f":"IF(Schüler!N3=\"\",0,Schüler!N3)","v":0},{"$f":"IF(Schüler!O3=\"\",0,Schüler!O3)","v":0},null,{"$f":"IF(R3=\"\",\"\",Schüler!Q3)","v":0},{"$f":"IF(Schüler!R3=\"\",0,Schüler!R3)","v":0},{"$f":"IF(Schüler!S3=\"\",0,Schüler!S3)","v":0},null,{"$f":"IF(X3=\"\",\"\",Jugend!A3)","v":0},{"$f":"IF(X3=\"\",\"\",Jugend!B3)","v":0},{"$f":"IF(X3=\"\",\"\",Jugend!C3)","v":0},{"$f":"IF(Jugend!D3=\"\",0,Jugend!D3)","v":0},{"$f":"IF(Jugend!E3=\"\",0,Jugend!E3)","v":0},null,{"$f":"IF(AD3=\"\",\"\",Jugend!G3)","v":0},{"$f":"IF(AD3=\"\",\"\",Jugend!H3)","v":0},{"$f":"IF(AD3=\"\",\"\",Jugend!I3)","v":0},{"$f":"IF(Jugend!J3=\"\",0,Jugend!J3)","v":0},{"$f":"IF(Jugend!K3=\"\",0,Jugend!K3)","v":0},null,{"$f":"IF(AH3=\"\",\"\",Jugend!M3)","v":0},{"$f":"IF(Jugend!N3=\"\",0,Jugend!N3)","v":0},{"$f":"IF(Jugend!O3=\"\",0,Jugend!O3)","v":0},null,{"$f":"IF(AL3=\"\",\"\",Jugend!Q3)","v":0},{"$f":"IF(Jugend!R3=\"\",0,Jugend!R3)","v":0},{"$f":"IF(Jugend!S3=\"\",0,Jugend!S3)","v":0},null,{"$f":"IF(AR3=\"\",\"\",'Junioren II'!A3)","v":0},{"$f":"IF(AR3=\"\",\"\",'Junioren II'!B3)","v":0},{"$f":"IF(AR3=\"\",\"\",'Junioren II'!C3)","v":0},{"$f":"IF('Junioren II'!D3=\"\",0,'Junioren II'!D3)","v":0},{"$f":"IF('Junioren II'!E3=\"\",0,'Junioren II'!E3)","v":0},null,{"$f":"IF(AX3=\"\",\"\",'Junioren II'!G3)","v":0},{"$f":"IF(AX3=\"\",\"\",'Junioren II'!H3)","v":0},{"$f":"IF(AX3=\"\",\"\",'Junioren II'!I3)","v":0},{"$f":"IF('Junioren II'!J3=\"\",0,'Junioren II'!J3)","v":0},{"$f":"IF('Junioren II'!K3=\"\",0,'Junioren II'!K3)","v":0},null,{"$f":"IF(BB3=\"\",\"\",'Junioren II'!M3)","v":0},{"$f":"IF('Junioren II'!N3=\"\",0,'Junioren II'!N3)","v":0},{"$f":"IF('Junioren II'!O3=\"\",0,'Junioren II'!O3)","v":0},null,{"$f":"IF(BF3=\"\",\"\",'Junioren II'!Q3)","v":0},{"$f":"IF('Junioren II'!R3=\"\",0,'Junioren II'!R3)","v":0},{"$f":"IF('Junioren II'!S3=\"\",0,'Junioren II'!S3)","v":0},null,{"$f":"IF('UK-König'!A3=\"\",\"\",'UK-König'!A3)","v":""},{"$f":"IF('UK-König'!B3=\"\",\"\",'UK-König'!B3)","v":""},{"$f":"IF('UK-König'!C3=\"\",\"\",'UK-König'!C3)","v":""},null,{"$f":"IF(BP3=\"\",\"\",'Junioren I'!A3)","v":0},{"$f":"IF(BP3=\"\",\"\",'Junioren I'!B3)","v":0},{"$f":"IF(BP3=\"\",\"\",'Junioren I'!C3)","v":0},{"$f":"IF('Junioren I'!D3=\"\",0,'Junioren I'!D3)","v":0},{"$f":"IF('Junioren I'!E3=\"\",0,'Junioren I'!E3)","v":0},null,{"$f":"IF(BV3=\"\",\"\",'Junioren I'!G3)","v":0},{"$f":"IF(BV3=\"\",\"\",'Junioren I'!H3)","v":0},{"$f":"IF(BV3=\"\",\"\",'Junioren I'!I3)","v":0},{"$f":"IF('Junioren I'!J3=\"\",0,'Junioren I'!J3)","v":0},{"$f":"IF('Junioren I'!K3=\"\",0,'Junioren I'!K3)","v":0},null,{"$f":"IF(BZ3=\"\",\"\",'Junioren I'!M3)","v":0},{"$f":"IF('Junioren I'!N3=\"\",0,'Junioren I'!N3)","v":0},{"$f":"IF('Junioren I'!O3=\"\",0,'Junioren I'!O3)","v":0},null,{"$f":"IF(CD3=\"\",\"\",'Junioren I'!Q3)","v":0},{"$f":"IF('Junioren I'!R3=\"\",0,'Junioren I'!R3)","v":0},{"$f":"IF('Junioren I'!S3=\"\",0,'Junioren I'!S3)","v":0},null,{"$f":"IF(CJ3=\"\",\"\",Lichtpunkt!A3)","v":0},{"$f":"IF(CJ3=\"\",\"\",Lichtpunkt!B3)","v":0},{"$f":"IF(CJ3=\"\",\"\",Lichtpunkt!C3)","v":0},{"$f":"IF(Lichtpunkt!D3=\"\",0,Lichtpunkt!D3)","v":0},{"$f":"IF(Lichtpunkt!E3=\"\",0,Lichtpunkt!E3)","v":0},null,{"$f":"IF(CP3=\"\",\"\",Lichtpunkt!G3)","v":0},{"$f":"IF(CP3=\"\",\"\",Lichtpunkt!H3)","v":0},{"$f":"IF(CP3=\"\",\"\",Lichtpunkt!I3)","v":0},{"$f":"IF(Lichtpunkt!J3=\"\",0,Lichtpunkt!J3)","v":0},{"$f":"IF(Lichtpunkt!K3=\"\",0,Lichtpunkt!K3)","v":0},null,{"$f":"IF(CT3=\"\",\"\",Lichtpunkt!M3)","v":0},{"$f":"IF(Lichtpunkt!N3=\"\",0,Lichtpunkt!N3)","v":0},{"$f":"IF(Lichtpunkt!O3=\"\",0,Lichtpunkt!O3)","v":0},null,{"$f":"IF(CX3=\"\",\"\",Lichtpunkt!Q3)","v":0},{"$f":"IF(Lichtpunkt!R3=\"\",0,Lichtpunkt!R3)","v":0},{"$f":"IF(Lichtpunkt!S3=\"\",0,Lichtpunkt!S3)","v":0},null,{"$f":"IF('LP-König'!A3=\"\",\"\",'LP-König'!A3)","v":""},{"$f":"IF('LP-König'!B3=\"\",\"\",'LP-König'!B3)","v":""},{"$f":"IF('LP-König'!C3=\"\",\"\",'LP-König'!C3)","v":""}]
[{"$f":"IF(D4=\"\",\"\",Schüler!A4)","v":0},{"$f":"IF(D4=\"\",\"\",Schüler!B4)","v":0},{"$f":"IF(D4=\"\",\"\",Schüler!C4)","v":0},{"$f":"IF(Schüler!D4=\"\",0,Schüler!D4)","v":0},{"$f":"IF(Schüler!E4=\"\",0,Schüler!E4)","v":0},null,{"$f":"IF(J4=\"\",\"\",Schüler!G4)","v":0},{"$f":"IF(J4=\"\",\"\",Schüler!H4)","v":0},{"$f":"IF(J4=\"\",\"\",Schüler!I4)","v":0},{"$f":"IF(Schüler!J4=\"\",0,Schüler!J4)","v":0},{"$f":"IF(Schüler!K4=\"\",0,Schüler!K4)","v":0},null,{"$f":"IF(N4=\"\",\"\",Schüler!M4)","v":0},{"$f":"IF(Schüler!N4=\"\",0,Schüler!N4)","v":0},{"$f":"IF(Schüler!O4=\"\",0,Schüler!O4)","v":0},null,{"$f":"IF(R4=\"\",\"\",Schüler!Q4)","v":0},{"$f":"IF(Schüler!R4=\"\",0,Schüler!R4)","v":0},{"$f":"IF(Schüler!S4=\"\",0,Schüler!S4)","v":0},null,{"$f":"IF(X4=\"\",\"\",Jugend!A4)","v":0},{"$f":"IF(X4=\"\",\"\",Jugend!B4)","v":0},{"$f":"IF(X4=\"\",\"\",Jugend!C4)","v":0},{"$f":"IF(Jugend!D4=\"\",0,Jugend!D4)","v":0},{"$f":"IF(Jugend!E4=\"\",0,Jugend!E4)","v":0},null,{"$f":"IF(AD4=\"\",\"\",Jugend!G4)","v":0},{"$f":"IF(AD4=\"\",\"\",Jugend!H4)","v":0},{"$f":"IF(AD4=\"\",\"\",Jugend!I4)","v":0},{"$f":"IF(Jugend!J4=\"\",0,Jugend!J4)","v":0},{"$f":"IF(Jugend!K4=\"\",0,Jugend!K4)","v":0},null,{"$f":"IF(AH4=\"\",\"\",Jugend!M4)","v":0},{"$f":"IF(Jugend!N4=\"\",0,Jugend!N4)","v":0},{"$f":"IF(Jugend!O4=\"\",0,Jugend!O4)","v":0},null,{"$f":"IF(AL4=\"\",\"\",Jugend!Q4)","v":0},{"$f":"IF(Jugend!R4=\"\",0,Jugend!R4)","v":0},{"$f":"IF(Jugend!S4=\"\",0,Jugend!S4)","v":0},null,{"$f":"IF(AR4=\"\",\"\",'Junioren II'!A4)","v":0},{"$f":"IF(AR4=\"\",\"\",'Junioren II'!B4)","v":0},{"$f":"IF(AR4=\"\",\"\",'Junioren II'!C4)","v":0},{"$f":"IF('Junioren II'!D4=\"\",0,'Junioren II'!D4)","v":0},{"$f":"IF('Junioren II'!E4=\"\",0,'Junioren II'!E4)","v":0},null,{"$f":"IF(AX4=\"\",\"\",'Junioren II'!G4)","v":0},{"$f":"IF(AX4=\"\",\"\",'Junioren II'!H4)","v":0},{"$f":"IF(AX4=\"\",\"\",'Junioren II'!I4)","v":0},{"$f":"IF('Junioren II'!J4=\"\",0,'Junioren II'!J4)","v":0},{"$f":"IF('Junioren II'!K4=\"\",0,'Junioren II'!K4)","v":0},null,{"$f":"IF(BB4=\"\",\"\",'Junioren II'!M4)","v":0},{"$f":"IF('Junioren II'!N4=\"\",0,'Junioren II'!N4)","v":0},{"$f":"IF('Junioren II'!O4=\"\",0,'Junioren II'!O4)","v":0},null,{"$f":"IF(BF4=\"\",\"\",'Junioren II'!Q4)","v":0},{"$f":"IF('Junioren II'!R4=\"\",0,'Junioren II'!R4)","v":0},{"$f":"IF('Junioren II'!S4=\"\",0,'Junioren II'!S4)","v":0},null,{"$f":"IF('UK-König'!A4=\"\",\"\",'UK-König'!A4)","v":""},{"$f":"IF('UK-König'!B4=\"\",\"\",'UK-König'!B4)","v":""},{"$f":"IF('UK-König'!C4=\"\",\"\",'UK-König'!C4)","v":""},null,{"$f":"IF(BP4=\"\",\"\",'Junioren I'!A4)","v":0},{"$f":"IF(BP4=\"\",\"\",'Junioren I'!B4)","v":0},{"$f":"IF(BP4=\"\",\"\",'Junioren I'!C4)","v":0},{"$f":"IF('Junioren I'!D4=\"\",0,'Junioren I'!D4)","v":0},{"$f":"IF('Junioren I'!E4=\"\",0,'Junioren I'!E4)","v":0},null,{"$f":"IF(BV4=\"\",\"\",'Junioren I'!G4)","v":0},{"$f":"IF(BV4=\"\",\"\",'Junioren I'!H4)","v":0},{"$f":"IF(BV4=\"\",\"\",'Junioren I'!I4)","v":0},{"$f":"IF('Junioren I'!J4=\"\",0,'Junioren I'!J4)","v":0},{"$f":"IF('Junioren I'!K4=\"\",0,'Junioren I'!K4)","v":0},null,{"$f":"IF(BZ4=\"\",\"\",'Junioren I'!M4)","v":0},{"$f":"IF('Junioren I'!N4=\"\",0,'Junioren I'!N4)","v":0},{"$f":"IF('Junioren I'!O4=\"\",0,'Junioren I'!O4)","v":0},null,{"$f":"IF(CD4=\"\",\"\",'Junioren I'!Q4)","v":0},{"$f":"IF('Junioren I'!R4=\"\",0,'Junioren I'!R4)","v":0},{"$f":"IF('Junioren I'!S4=\"\",0,'Junioren I'!S4)","v":0},null,{"$f":"IF(CJ4=\"\",\"\",Lichtpunkt!A4)","v":0},{"$f":"IF(CJ4=\"\",\"\",Lichtpunkt!B4)","v":0},{"$f":"IF(CJ4=\"\",\"\",Lichtpunkt!C4)","v":0},{"$f":"IF(Lichtpunkt!D4=\"\",0,Lichtpunkt!D4)","v":0},{"$f":"IF(Lichtpunkt!E4=\"\",0,Lichtpunkt!E4)","v":0},null,{"$f":"IF(CP4=\"\",\"\",Lichtpunkt!G4)","v":0},{"$f":"IF(CP4=\"\",\"\",Lichtpunkt!H4)","v":0},{"$f":"IF(CP4=\"\",\"\",Lichtpunkt!I4)","v":0},{"$f":"IF(Lichtpunkt!J4=\"\",0,Lichtpunkt!J4)","v":0},{"$f":"IF(Lichtpunkt!K4=\"\",0,Lichtpunkt!K4)","v":0},null,{"$f":"IF(CT4=\"\",\"\",Lichtpunkt!M4)","v":0},{"$f":"IF(Lichtpunkt!N4=\"\",0,Lichtpunkt!N4)","v":0},{"$f":"IF(Lichtpunkt!O4=\"\",0,Lichtpunkt!O4)","v":0},null,{"$f":"IF(CX4=\"\",\"\",Lichtpunkt!Q4)","v":0},{"$f":"IF(Lichtpunkt!R4=\"\",0,Lichtpunkt!R4)","v":0},{"$f":"IF(Lichtpunkt!S4=\"\",0,Lichtpunkt!S4)","v":0},null,{"$f":"IF('LP-König'!A4=\"\",\"\",'LP-König'!A4)","v":""},{"$f":"IF('LP-König'!B4=\"\",\"\",'LP-König'!B4)","v":""},{"$f":"IF('LP-König'!C4=\"\",\"\",'LP-König'!C4)","v":""}]
[{"$f":"IF(D5=\"\",\"\",Schüler!A5)","v":0},{"$f":"IF(D5=\"\",\"\",Schüler!B5)","v":0},{"$f":"IF(D5=\"\",\"\",Schüler!C5)","v":0},{"$f":"IF(Schüler!D5=\"\",0,Schüler!D5)","v":0},{"$f":"IF(Schüler!E5=\"\",0,Schüler!E5)","v":0},null,{"$f":"IF(J5=\"\",\"\",Schüler!G5)","v":0},{"$f":"IF(J5=\"\",\"\",Schüler!H5)","v":0},{"$f":"IF(J5=\"\",\"\",Schüler!I5)","v":0},{"$f":"IF(Schüler!J5=\"\",0,Schüler!J5)","v":0},{"$f":"IF(Schüler!K5=\"\",0,Schüler!K5)","v":0},null,{"$f":"IF(N5=\"\",\"\",Schüler!M5)","v":0},{"$f":"IF(Schüler!N5=\"\",0,Schüler!N5)","v":0},{"$f":"IF(Schüler!O5=\"\",0,Schüler!O5)","v":0},null,{"$f":"IF(R5=\"\",\"\",Schüler!Q5)","v":0},{"$f":"IF(Schüler!R5=\"\",0,Schüler!R5)","v":0},{"$f":"IF(Schüler!S5=\"\",0,Schüler!S5)","v":0},null,{"$f":"IF(X5=\"\",\"\",Jugend!A5)","v":0},{"$f":"IF(X5=\"\",\"\",Jugend!B5)","v":0},{"$f":"IF(X5=\"\",\"\",Jugend!C5)","v":0},{"$f":"IF(Jugend!D5=\"\",0,Jugend!D5)","v":0},{"$f":"IF(Jugend!E5=\"\",0,Jugend!E5)","v":0},null,{"$f":"IF(AD5=\"\",\"\",Jugend!G5)","v":0},{"$f":"IF(AD5=\"\",\"\",Jugend!H5)","v":0},{"$f":"IF(AD5=\"\",\"\",Jugend!I5)","v":0},{"$f":"IF(Jugend!J5=\"\",0,Jugend!J5)","v":0},{"$f":"IF(Jugend!K5=\"\",0,Jugend!K5)","v":0},null,{"$f":"IF(AH5=\"\",\"\",Jugend!M5)","v":0},{"$f":"IF(Jugend!N5=\"\",0,Jugend!N5)","v":0},{"$f":"IF(Jugend!O5=\"\",0,Jugend!O5)","v":0},null,{"$f":"IF(AL5=\"\",\"\",Jugend!Q5)","v":0},{"$f":"IF(Jugend!R5=\"\",0,Jugend!R5)","v":0},{"$f":"IF(Jugend!S5=\"\",0,Jugend!S5)","v":0},null,{"$f":"IF(AR5=\"\",\"\",'Junioren II'!A5)","v":0},{"$f":"IF(AR5=\"\",\"\",'Junioren II'!B5)","v":0},{"$f":"IF(AR5=\"\",\"\",'Junioren II'!C5)","v":0},{"$f":"IF('Junioren II'!D5=\"\",0,'Junioren II'!D5)","v":0},{"$f":"IF('Junioren II'!E5=\"\",0,'Junioren II'!E5)","v":0},null,{"$f":"IF(AX5=\"\",\"\",'Junioren II'!G5)","v":0},{"$f":"IF(AX5=\"\",\"\",'Junioren II'!H5)","v":0},{"$f":"IF(AX5=\"\",\"\",'Junioren II'!I5)","v":0},{"$f":"IF('Junioren II'!J5=\"\",0,'Junioren II'!J5)","v":0},{"$f":"IF('Junioren II'!K5=\"\",0,'Junioren II'!K5)","v":0},null,{"$f":"IF(BB5=\"\",\"\",'Junioren II'!M5)","v":0},{"$f":"IF('Junioren II'!N5=\"\",0,'Junioren II'!N5)","v":0},{"$f":"IF('Junioren II'!O5=\"\",0,'Junioren II'!O5)","v":0},null,{"$f":"IF(BF5=\"\",\"\",'Junioren II'!Q5)","v":0},{"$f":"IF('Junioren II'!R5=\"\",0,'Junioren II'!R5)","v":0},{"$f":"IF('Junioren II'!S5=\"\",0,'Junioren II'!S5)","v":0},null,{"$f":"IF('UK-König'!A5=\"\",\"\",'UK-König'!A5)","v":""},{"$f":"IF('UK-König'!B5=\"\",\"\",'UK-König'!B5)","v":""},{"$f":"IF('UK-König'!C5=\"\",\"\",'UK-König'!C5)","v":""},null,{"$f":"IF(BP5=\"\",\"\",'Junioren I'!A5)","v":0},{"$f":"IF(BP5=\"\",\"\",'Junioren I'!B5)","v":0},{"$f":"IF(BP5=\"\",\"\",'Junioren I'!C5)","v":0},{"$f":"IF('Junioren I'!D5=\"\",0,'Junioren I'!D5)","v":0},{"$f":"IF('Junioren I'!E5=\"\",0,'Junioren I'!E5)","v":0},null,{"$f":"IF(BV5=\"\",\"\",'Junioren I'!G5)","v":0},{"$f":"IF(BV5=\"\",\"\",'Junioren I'!H5)","v":0},{"$f":"IF(BV5=\"\",\"\",'Junioren I'!I5)","v":0},{"$f":"IF('Junioren I'!J5=\"\",0,'Junioren I'!J5)","v":0},{"$f":"IF('Junioren I'!K5=\"\",0,'Junioren I'!K5)","v":0},null,{"$f":"IF(BZ5=\"\",\"\",'Junioren I'!M5)","v":0},{"$f":"IF('Junioren I'!N5=\"\",0,'Junioren I'!N5)","v":0},{"$f":"IF('Junioren I'!O5=\"\",0,'Junioren I'!O5)","v":0},null,{"$f":"IF(CD5=\"\",\"\",'Junioren I'!Q5)","v":0},{"$f":"IF('Junioren I'!R5=\"\",0,'Junioren I'!R5)","v":0},{"$f":"IF('Junioren I'!S5=\"\",0,'Junioren I'!S5)","v":0},null,{"$f":"IF(CJ5=\"\",\"\",Lichtpunkt!A5)","v":0},{"$f":"IF(CJ5=\"\",\"\",Lichtpunkt!B5)","v":0},{"$f":"IF(CJ5=\"\",\"\",Lichtpunkt!C5)","v":0},{"$f":"IF(Lichtpunkt!D5=\"\",0,Lichtpunkt!D5)","v":0},{"$f":"IF(Lichtpunkt!E5=\"\",0,Lichtpunkt!E5)","v":0},null,{"$f":"IF(CP5=\"\",\"\",Lichtpunkt!G5)","v":0},{"$f":"IF(CP5=\"\",\"\",Lichtpunkt!H5)","v":0},{"$f":"IF(CP5=\"\",\"\",Lichtpunkt!I5)","v":0},{"$f":"IF(Lichtpunkt!J5=\"\",0,Lichtpunkt!J5)","v":0},{"$f":"IF(Lichtpunkt!K5=\"\",0,Lichtpunkt!K5)","v":0},null,{"$f":"IF(CT5=\"\",\"\",Lichtpunkt!M5)","v":0},{"$f":"IF(Lichtpunkt!N5=\"\",0,Lichtpunkt!N5)","v":0},{"$f":"IF(Lichtpunkt!O5=\"\",0,Lichtpunkt!O5)","v":0},null,{"$f":"IF(CX5=\"\",\"\",Lichtpunkt!Q5)","v":0},{"$f":"IF(Lichtpunkt!R5=\"\",0,Lichtpunkt!R5)","v":0},{"$f":"IF(Lichtpunkt!S5=\"\",0,Lichtpunkt!S5)","v":0},null,{"$f":"IF('LP-König'!A5=\"\",\"\",'LP-König'!A5)","v":""},{"$f":"IF('LP-König'!B5=\"\",\"\",'LP-König'!B5)","v":""},{"$f":"IF('LP-König'!C5=\"\",\"\",'LP-König'!C5)","v":""}]
[{"$f":"IF(D6=\"\",\"\",Schüler!A6)","v":0},{"$f":"IF(D6=\"\",\"\",Schüler!B6)","v":0},{"$f":"IF(D6=\"\",\"\",Schüler!C6)","v":0},{"$f":"IF(Schüler!D6=\"\",0,Schüler!D6)","v":0},{"$f":"IF(Schüler!E6=\"\",0,Schüler!E6)","v":0},null,{"$f":"IF(J6=\"\",\"\",Schüler!G6)","v":0},{"$f":"IF(J6=\"\",\"\",Schüler!H6)","v":0},{"$f":"IF(J6=\"\",\"\",Schüler!I6)","v":0},{"$f":"IF(Schüler!J6=\"\",0,Schüler!J6)","v":0},{"$f":"IF(Schüler!K6=\"\",0,Schüler!K6)","v":0},null,{"$f":"IF(N6=\"\",\"\",Schüler!M6)","v":0},{"$f":"IF(Schüler!N6=\"\",0,Schüler!N6)","v":0},{"$f":"IF(Schüler!O6=\"\",0,Schüler!O6)","v":0},null,{"$f":"IF(R6=\"\",\"\",Schüler!Q6)","v":0},{"$f":"IF(Schüler!R6=\"\",0,Schüler!R6)","v":0},{"$f":"IF(Schüler!S6=\"\",0,Schüler!S6)","v":0},null,{"$f":"IF(X6=\"\",\"\",Jugend!A6)","v":0},{"$f":"IF(X6=\"\",\"\",Jugend!B6)","v":0},{"$f":"IF(X6=\"\",\"\",Jugend!C6)","v":0},{"$f":"IF(Jugend!D6=\"\",0,Jugend!D6)","v":0},{"$f":"IF(Jugend!E6=\"\",0,Jugend!E6)","v":0},null,{"$f":"IF(AD6=\"\",\"\",Jugend!G6)","v":0},{"$f":"IF(AD6=\"\",\"\",Jugend!H6)","v":0},{"$f":"IF(AD6=\"\",\"\",Jugend!I6)","v":0},{"$f":"IF(Jugend!J6=\"\",0,Jugend!J6)","v":0},{"$f":"IF(Jugend!K6=\"\",0,Jugend!K6)","v":0},null,{"$f":"IF(AH6=\"\",\"\",Jugend!M6)","v":0},{"$f":"IF(Jugend!N6=\"\",0,Jugend!N6)","v":0},{"$f":"IF(Jugend!O6=\"\",0,Jugend!O6)","v":0},null,{"$f":"IF(AL6=\"\",\"\",Jugend!Q6)","v":0},{"$f":"IF(Jugend!R6=\"\",0,Jugend!R6)","v":0},{"$f":"IF(Jugend!S6=\"\",0,Jugend!S6)","v":0},null,{"$f":"IF(AR6=\"\",\"\",'Junioren II'!A6)","v":0},{"$f":"IF(AR6=\"\",\"\",'Junioren II'!B6)","v":0},{"$f":"IF(AR6=\"\",\"\",'Junioren II'!C6)","v":0},{"$f":"IF('Junioren II'!D6=\"\",0,'Junioren II'!D6)","v":0},{"$f":"IF('Junioren II'!E6=\"\",0,'Junioren II'!E6)","v":0},null,{"$f":"IF(AX6=\"\",\"\",'Junioren II'!G6)","v":0},{"$f":"IF(AX6=\"\",\"\",'Junioren II'!H6)","v":0},{"$f":"IF(AX6=\"\",\"\",'Junioren II'!I6)","v":0},{"$f":"IF('Junioren II'!J6=\"\",0,'Junioren II'!J6)","v":0},{"$f":"IF('Junioren II'!K6=\"\",0,'Junioren II'!K6)","v":0},null,{"$f":"IF(BB6=\"\",\"\",'Junioren II'!M6)","v":0},{"$f":"IF('Junioren II'!N6=\"\",0,'Junioren II'!N6)","v":0},{"$f":"IF('Junioren II'!O6=\"\",0,'Junioren II'!O6)","v":0},null,{"$f":"IF(BF6=\"\",\"\",'Junioren II'!Q6)","v":0},{"$f":"IF('Junioren II'!R6=\"\",0,'Junioren II'!R6)","v":0},{"$f":"IF('Junioren II'!S6=\"\",0,'Junioren II'!S6)","v":0},null,{"$f":"IF('UK-König'!A6=\"\",\"\",'UK-König'!A6)","v":""},{"$f":"IF('UK-König'!B6=\"\",\"\",'UK-König'!B6)","v":""},{"$f":"IF('UK-König'!C6=\"\",\"\",'UK-König'!C6)","v":""},null,{"$f":"IF(BP6=\"\",\"\",'Junioren I'!A6)","v":0},{"$f":"IF(BP6=\"\",\"\",'Junioren I'!B6)","v":0},{"$f":"IF(BP6=\"\",\"\",'Junioren I'!C6)","v":0},{"$f":"IF('Junioren I'!D6=\"\",0,'Junioren I'!D6)","v":0},{"$f":"IF('Junioren I'!E6=\"\",0,'Junioren I'!E6)","v":0},null,{"$f":"IF(BV6=\"\",\"\",'Junioren I'!G6)","v":0},{"$f":"IF(BV6=\"\",\"\",'Junioren I'!H6)","v":0},{"$f":"IF(BV6=\"\",\"\",'Junioren I'!I6)","v":0},{"$f":"IF('Junioren I'!J6=\"\",0,'Junioren I'!J6)","v":0},{"$f":"IF('Junioren I'!K6=\"\",0,'Junioren I'!K6)","v":0},null,{"$f":"IF(BZ6=\"\",\"\",'Junioren I'!M6)","v":0},{"$f":"IF('Junioren I'!N6=\"\",0,'Junioren I'!N6)","v":0},{"$f":"IF('Junioren I'!O6=\"\",0,'Junioren I'!O6)","v":0},null,{"$f":"IF(CD6=\"\",\"\",'Junioren I'!Q6)","v":0},{"$f":"IF('Junioren I'!R6=\"\",0,'Junioren I'!R6)","v":0},{"$f":"IF('Junioren I'!S6=\"\",0,'Junioren I'!S6)","v":0},null,{"$f":"IF(CJ6=\"\",\"\",Lichtpunkt!A6)","v":0},{"$f":"IF(CJ6=\"\",\"\",Lichtpunkt!B6)","v":0},{"$f":"IF(CJ6=\"\",\"\",Lichtpunkt!C6)","v":0},{"$f":"IF(Lichtpunkt!D6=\"\",0,Lichtpunkt!D6)","v":0},{"$f":"IF(Lichtpunkt!E6=\"\",0,Lichtpunkt!E6)","v":0},null,{"$f":"IF(CP6=\"\",\"\",Lichtpunkt!G6)","v":0},{"$f":"IF(CP6=\"\",\"\",Lichtpunkt!H6)","v":0},{"$f":"IF(CP6=\"\",\"\",Lichtpunkt!I6)","v":0},{"$f":"IF(Lichtpunkt!J6=\"\",0,Lichtpunkt!J6)","v":0},{"$f":"IF(Lichtpunkt!K6=\"\",0,Lichtpunkt!K6)","v":0},null,{"$f":"IF(CT6=\"\",\"\",Lichtpunkt!M6)","v":0},{"$f":"IF(Lichtpunkt!N6=\"\",0,Lichtpunkt!N6)","v":0},{"$f":"IF(Lichtpunkt!O6=\"\",0,Lichtpunkt!O6)","v":0},null,{"$f":"IF(CX6=\"\",\"\",Lichtpunkt!Q6)","v":0},{"$f":"IF(Lichtpunkt!R6=\"\",0,Lichtpunkt!R6)","v":0},{"$f":"IF(Lichtpunkt!S6=\"\",0,Lichtpunkt!S6)","v":0},null,{"$f":"IF('LP-König'!A6=\"\",\"\",'LP-König'!A6)","v":""},{"$f":"IF('LP-König'!B6=\"\",\"\",'LP-König'!B6)","v":""},{"$f":"IF('LP-König'!C6=\"\",\"\",'LP-König'!C6)","v":""}]
[{"$f":"IF(D7=\"\",\"\",Schüler!A7)","v":0},{"$f":"IF(D7=\"\",\"\",Schüler!B7)","v":0},{"$f":"IF(D7=\"\",\"\",Schüler!C7)","v":0},{"$f":"IF(Schüler!D7=\"\",0,Schüler!D7)","v":0},{"$f":"IF(Schüler!E7=\"\",0,Schüler!E7)","v":0},null,{"$f":"IF(J7=\"\",\"\",Schüler!G7)","v":0},{"$f":"IF(J7=\"\",\"\",Schüler!H7)","v":0},{"$f":"IF(J7=\"\",\"\",Schüler!I7)","v":0},{"$f":"IF(Schüler!J7=\"\",0,Schüler!J7)","v":0},{"$f":"IF(Schüler!K7=\"\",0,Schüler!K7)","v":0},null,{"$f":"IF(N7=\"\",\"\",Schüler!M7)","v":0},{"$f":"IF(Schüler!N7=\"\",0,Schüler!N7)","v":0},{"$f":"IF(Schüler!O7=\"\",0,Schüler!O7)","v":0},null,{"$f":"IF(R7=\"\",\"\",Schüler!Q7)","v":0},{"$f":"IF(Schüler!R7=\"\",0,Schüler!R7)","v":0},{"$f":"IF(Schüler!S7=\"\",0,Schüler!S7)","v":0},null,{"$f":"IF(X7=\"\",\"\",Jugend!A7)","v":0},{"$f":"IF(X7=\"\",\"\",Jugend!B7)","v":0},{"$f":"IF(X7=\"\",\"\",Jugend!C7)","v":0},{"$f":"IF(Jugend!D7=\"\",0,Jugend!D7)","v":0},{"$f":"IF(Jugend!E7=\"\",0,Jugend!E7)","v":0},null,{"$f":"IF(AD7=\"\",\"\",Jugend!G7)","v":0},{"$f":"IF(AD7=\"\",\"\",Jugend!H7)","v":0},{"$f":"IF(AD7=\"\",\"\",Jugend!I7)","v":0},{"$f":"IF(Jugend!J7=\"\",0,Jugend!J7)","v":0},{"$f":"IF(Jugend!K7=\"\",0,Jugend!K7)","v":0},null,{"$f":"IF(AH7=\"\",\"\",Jugend!M7)","v":0},{"$f":"IF(Jugend!N7=\"\",0,Jugend!N7)","v":0},{"$f":"IF(Jugend!O7=\"\",0,Jugend!O7)","v":0},null,{"$f":"IF(AL7=\"\",\"\",Jugend!Q7)","v":0},{"$f":"IF(Jugend!R7=\"\",0,Jugend!R7)","v":0},{"$f":"IF(Jugend!S7=\"\",0,Jugend!S7)","v":0},null,{"$f":"IF(AR7=\"\",\"\",'Junioren II'!A7)","v":0},{"$f":"IF(AR7=\"\",\"\",'Junioren II'!B7)","v":0},{"$f":"IF(AR7=\"\",\"\",'Junioren II'!C7)","v":0},{"$f":"IF('Junioren II'!D7=\"\",0,'Junioren II'!D7)","v":0},{"$f":"IF('Junioren II'!E7=\"\",0,'Junioren II'!E7)","v":0},null,{"$f":"IF(AX7=\"\",\"\",'Junioren II'!G7)","v":0},{"$f":"IF(AX7=\"\",\"\",'Junioren II'!H7)","v":0},{"$f":"IF(AX7=\"\",\"\",'Junioren II'!I7)","v":0},{"$f":"IF('Junioren II'!J7=\"\",0,'Junioren II'!J7)","v":0},{"$f":"IF('Junioren II'!K7=\"\",0,'Junioren II'!K7)","v":0},null,{"$f":"IF(BB7=\"\",\"\",'Junioren II'!M7)","v":0},{"$f":"IF('Junioren II'!N7=\"\",0,'Junioren II'!N7)","v":0},{"$f":"IF('Junioren II'!O7=\"\",0,'Junioren II'!O7)","v":0},null,{"$f":"IF(BF7=\"\",\"\",'Junioren II'!Q7)","v":0},{"$f":"IF('Junioren II'!R7=\"\",0,'Junioren II'!R7)","v":0},{"$f":"IF('Junioren II'!S7=\"\",0,'Junioren II'!S7)","v":0},null,{"$f":"IF('UK-König'!A7=\"\",\"\",'UK-König'!A7)","v":""},{"$f":"IF('UK-König'!B7=\"\",\"\",'UK-König'!B7)","v":""},{"$f":"IF('UK-König'!C7=\"\",\"\",'UK-König'!C7)","v":""},null,{"$f":"IF(BP7=\"\",\"\",'Junioren I'!A7)","v":0},{"$f":"IF(BP7=\"\",\"\",'Junioren I'!B7)","v":0},{"$f":"IF(BP7=\"\",\"\",'Junioren I'!C7)","v":0},{"$f":"IF('Junioren I'!D7=\"\",0,'Junioren I'!D7)","v":0},{"$f":"IF('Junioren I'!E7=\"\",0,'Junioren I'!E7)","v":0},null,{"$f":"IF(BV7=\"\",\"\",'Junioren I'!G7)","v":0},{"$f":"IF(BV7=\"\",\"\",'Junioren I'!H7)","v":0},{"$f":"IF(BV7=\"\",\"\",'Junioren I'!I7)","v":0},{"$f":"IF('Junioren I'!J7=\"\",0,'Junioren I'!J7)","v":0},{"$f":"IF('Junioren I'!K7=\"\",0,'Junioren I'!K7)","v":0},null,{"$f":"IF(BZ7=\"\",\"\",'Junioren I'!M7)","v":0},{"$f":"IF('Junioren I'!N7=\"\",0,'Junioren I'!N7)","v":0},{"$f":"IF('Junioren I'!O7=\"\",0,'Junioren I'!O7)","v":0},null,{"$f":"IF(CD7=\"\",\"\",'Junioren I'!Q7)","v":0},{"$f":"IF('Junioren I'!R7=\"\",0,'Junioren I'!R7)","v":0},{"$f":"IF('Junioren I'!S7=\"\",0,'Junioren I'!S7)","v":0},null,{"$f":"IF(CJ7=\"\",\"\",Lichtpunkt!A7)","v":0},{"$f":"IF(CJ7=\"\",\"\",Lichtpunkt!B7)","v":0},{"$f":"IF(CJ7=\"\",\"\",Lichtpunkt!C7)","v":0},{"$f":"IF(Lichtpunkt!D7=\"\",0,Lichtpunkt!D7)","v":0},{"$f":"IF(Lichtpunkt!E7=\"\",0,Lichtpunkt!E7)","v":0},null,{"$f":"IF(CP7=\"\",\"\",Lichtpunkt!G7)","v":0},{"$f":"IF(CP7=\"\",\"\",Lichtpunkt!H7)","v":0},{"$f":"IF(CP7=\"\",\"\",Lichtpunkt!I7)","v":0},{"$f":"IF(Lichtpunkt!J7=\"\",0,Lichtpunkt!J7)","v":0},{"$f":"IF(Lichtpunkt!K7=\"\",0,Lichtpunkt!K7)","v":0},null,{"$f":"IF(CT7=\"\",\"\",Lichtpunkt!M7)","v":0},{"$f":"IF(Lichtpunkt!N7=\"\",0,Lichtpunkt!N7)","v":0},{"$f":"IF(Lichtpunkt!O7=\"\",0,Lichtpunkt!O7)","v":0},null,{"$f":"IF(CX7=\"\",\"\",Lichtpunkt!Q7)","v":0},{"$f":"IF(Lichtpunkt!R7=\"\",0,Lichtpunkt!R7)","v":0},{"$f":"IF(Lichtpunkt!S7=\"\",0,Lichtpunkt!S7)","v":0},null,{"$f":"IF('LP-König'!A7=\"\",\"\",'LP-König'!A7)","v":""},{"$f":"IF('LP-König'!B7=\"\",\"\",'LP-König'!B7)","v":""},{"$f":"IF('LP-König'!C7=\"\",\"\",'LP-König'!C7)","v":""}]
[{"$f":"IF(D8=\"\",\"\",Schüler!A8)","v":0},{"$f":"IF(D8=\"\",\"\",Schüler!B8)","v":0},{"$f":"IF(D8=\"\",\"\",Schüler!C8)","v":0},{"$f":"IF(Schüler!D8=\"\",0,Schüler!D8)","v":0},{"$f":"IF(Schüler!E8=\"\",0,Schüler!E8)","v":0},null,{"$f":"IF(J8=\"\",\"\",Schüler!G8)","v":0},{"$f":"IF(J8=\"\",\"\",Schüler!H8)","v":0},{"$f":"IF(J8=\"\",\"\",Schüler!I8)","v":0},{"$f":"IF(Schüler!J8=\"\",0,Schüler!J8)","v":0},{"$f":"IF(Schüler!K8=\"\",0,Schüler!K8)","v":0},null,{"$f":"IF(N8=\"\",\"\",Schüler!M8)","v":0},{"$f":"IF(Schüler!N8=\"\",0,Schüler!N8)","v":0},{"$f":"IF(Schüler!O8=\"\",0,Schüler!O8)","v":0},null,{"$f":"IF(R8=\"\",\"\",Schüler!Q8)","v":0},{"$f":"IF(Schüler!R8=\"\",0,Schüler!R8)","v":0},{"$f":"IF(Schüler!S8=\"\",0,Schüler!S8)","v":0},null,{"$f":"IF(X8=\"\",\"\",Jugend!A8)","v":0},{"$f":"IF(X8=\"\",\"\",Jugend!B8)","v":0},{"$f":"IF(X8=\"\",\"\",Jugend!C8)","v":0},{"$f":"IF(Jugend!D8=\"\",0,Jugend!D8)","v":0},{"$f":"IF(Jugend!E8=\"\",0,Jugend!E8)","v":0},null,{"$f":"IF(AD8=\"\",\"\",Jugend!G8)","v":0},{"$f":"IF(AD8=\"\",\"\",Jugend!H8)","v":0},{"$f":"IF(AD8=\"\",\"\",Jugend!I8)","v":0},{"$f":"IF(Jugend!J8=\"\",0,Jugend!J8)","v":0},{"$f":"IF(Jugend!K8=\"\",0,Jugend!K8)","v":0},null,{"$f":"IF(AH8=\"\",\"\",Jugend!M8)","v":0},{"$f":"IF(Jugend!N8=\"\",0,Jugend!N8)","v":0},{"$f":"IF(Jugend!O8=\"\",0,Jugend!O8)","v":0},null,{"$f":"IF(AL8=\"\",\"\",Jugend!Q8)","v":0},{"$f":"IF(Jugend!R8=\"\",0,Jugend!R8)","v":0},{"$f":"IF(Jugend!S8=\"\",0,Jugend!S8)","v":0},null,{"$f":"IF(AR8=\"\",\"\",'Junioren II'!A8)","v":0},{"$f":"IF(AR8=\"\",\"\",'Junioren II'!B8)","v":0},{"$f":"IF(AR8=\"\",\"\",'Junioren II'!C8)","v":0},{"$f":"IF('Junioren II'!D8=\"\",0,'Junioren II'!D8)","v":0},{"$f":"IF('Junioren II'!E8=\"\",0,'Junioren II'!E8)","v":0},null,{"$f":"IF(AX8=\"\",\"\",'Junioren II'!G8)","v":0},{"$f":"IF(AX8=\"\",\"\",'Junioren II'!H8)","v":0},{"$f":"IF(AX8=\"\",\"\",'Junioren II'!I8)","v":0},{"$f":"IF('Junioren II'!J8=\"\",0,'Junioren II'!J8)","v":0},{"$f":"IF('Junioren II'!K8=\"\",0,'Junioren II'!K8)","v":0},null,{"$f":"IF(BB8=\"\",\"\",'Junioren II'!M8)","v":0},{"$f":"IF('Junioren II'!N8=\"\",0,'Junioren II'!N8)","v":0},{"$f":"IF('Junioren II'!O8=\"\",0,'Junioren II'!O8)","v":0},null,{"$f":"IF(BF8=\"\",\"\",'Junioren II'!Q8)","v":0},{"$f":"IF('Junioren II'!R8=\"\",0,'Junioren II'!R8)","v":0},{"$f":"IF('Junioren II'!S8=\"\",0,'Junioren II'!S8)","v":0},null,{"$f":"IF('UK-König'!A8=\"\",\"\",'UK-König'!A8)","v":""},{"$f":"IF('UK-König'!B8=\"\",\"\",'UK-König'!B8)","v":""},{"$f":"IF('UK-König'!C8=\"\",\"\",'UK-König'!C8)","v":""},null,{"$f":"IF(BP8=\"\",\"\",'Junioren I'!A8)","v":0},{"$f":"IF(BP8=\"\",\"\",'Junioren I'!B8)","v":0},{"$f":"IF(BP8=\"\",\"\",'Junioren I'!C8)","v":0},{"$f":"IF('Junioren I'!D8=\"\",0,'Junioren I'!D8)","v":0},{"$f":"IF('Junioren I'!E8=\"\",0,'Junioren I'!E8)","v":0},null,{"$f":"IF(BV8=\"\",\"\",'Junioren I'!G8)","v":0},{"$f":"IF(BV8=\"\",\"\",'Junioren I'!H8)","v":0},{"$f":"IF(BV8=\"\",\"\",'Junioren I'!I8)","v":0},{"$f":"IF('Junioren I'!J8=\"\",0,'Junioren I'!J8)","v":0},{"$f":"IF('Junioren I'!K8=\"\",0,'Junioren I'!K8)","v":0},null,{"$f":"IF(BZ8=\"\",\"\",'Junioren I'!M8)","v":0},{"$f":"IF('Junioren I'!N8=\"\",0,'Junioren I'!N8)","v":0},{"$f":"IF('Junioren I'!O8=\"\",0,'Junioren I'!O8)","v":0},null,{"$f":"IF(CD8=\"\",\"\",'Junioren I'!Q8)","v":0},{"$f":"IF('Junioren I'!R8=\"\",0,'Junioren I'!R8)","v":0},{"$f":"IF('Junioren I'!S8=\"\",0,'Junioren I'!S8)","v":0},null,{"$f":"IF(CJ8=\"\",\"\",Lichtpunkt!A8)","v":0},{"$f":"IF(CJ8=\"\",\"\",Lichtpunkt!B8)","v":0},{"$f":"IF(CJ8=\"\",\"\",Lichtpunkt!C8)","v":0},{"$f":"IF(Lichtpunkt!D8=\"\",0,Lichtpunkt!D8)","v":0},{"$f":"IF(Lichtpunkt!E8=\"\",0,Lichtpunkt!E8)","v":0},null,{"$f":"IF(CP8=\"\",\"\",Lichtpunkt!G8)","v":0},{"$f":"IF(CP8=\"\",\"\",Lichtpunkt!H8)","v":0},{"$f":"IF(CP8=\"\",\"\",Lichtpunkt!I8)","v":0},{"$f":"IF(Lichtpunkt!J8=\"\",0,Lichtpunkt!J8)","v":0},{"$f":"IF(Lichtpunkt!K8=\"\",0,Lichtpunkt!K8)","v":0},null,{"$f":"IF(CT8=\"\",\"\",Lichtpunkt!M8)","v":0},{"$f":"IF(Lichtpunkt!N8=\"\",0,Lichtpunkt!N8)","v":0},{"$f":"IF(Lichtpunkt!O8=\"\",0,Lichtpunkt!O8)","v":0},null,{"$f":"IF(CX8=\"\",\"\",Lichtpunkt!Q8)","v":0},{"$f":"IF(Lichtpunkt!R8=\"\",0,Lichtpunkt!R8)","v":0},{"$f":"IF(Lichtpunkt!S8=\"\",0,Lichtpunkt!S8)","v":0},null,{"$f":"IF('LP-König'!A8=\"\",\"\",'LP-König'!A8)","v":""},{"$f":"IF('LP-König'!B8=\"\",\"\",'LP-König'!B8)","v":""},{"$f":"IF('LP-König'!C8=\"\",\"\",'LP-König'!C8)","v":""}]
[{"$f":"IF(D9=\"\",\"\",Schüler!A9)","v":0},{"$f":"IF(D9=\"\",\"\",Schüler!B9)","v":0},{"$f":"IF(D9=\"\",\"\",Schüler!C9)","v":0},{"$f":"IF(Schüler!D9=\"\",0,Schüler!D9)","v":0},{"$f":"IF(Schüler!E9=\"\",0,Schüler!E9)","v":0},null,{"$f":"IF(J9=\"\",\"\",Schüler!G9)","v":0},{"$f":"IF(J9=\"\",\"\",Schüler!H9)","v":0},{"$f":"IF(J9=\"\",\"\",Schüler!I9)","v":0},{"$f":"IF(Schüler!J9=\"\",0,Schüler!J9)","v":0},{"$f":"IF(Schüler!K9=\"\",0,Schüler!K9)","v":0},null,{"$f":"IF(N9=\"\",\"\",Schüler!M9)","v":0},{"$f":"IF(Schüler!N9=\"\",0,Schüler!N9)","v":0},{"$f":"IF(Schüler!O9=\"\",0,Schüler!O9)","v":0},null,{"$f":"IF(R9=\"\",\"\",Schüler!Q9)","v":0},{"$f":"IF(Schüler!R9=\"\",0,Schüler!R9)","v":0},{"$f":"IF(Schüler!S9=\"\",0,Schüler!S9)","v":0},null,{"$f":"IF(X9=\"\",\"\",Jugend!A9)","v":0},{"$f":"IF(X9=\"\",\"\",Jugend!B9)","v":0},{"$f":"IF(X9=\"\",\"\",Jugend!C9)","v":0},{"$f":"IF(Jugend!D9=\"\",0,Jugend!D9)","v":0},{"$f":"IF(Jugend!E9=\"\",0,Jugend!E9)","v":0},null,{"$f":"IF(AD9=\"\",\"\",Jugend!G9)","v":0},{"$f":"IF(AD9=\"\",\"\",Jugend!H9)","v":0},{"$f":"IF(AD9=\"\",\"\",Jugend!I9)","v":0},{"$f":"IF(Jugend!J9=\"\",0,Jugend!J9)","v":0},{"$f":"IF(Jugend!K9=\"\",0,Jugend!K9)","v":0},null,{"$f":"IF(AH9=\"\",\"\",Jugend!M9)","v":0},{"$f":"IF(Jugend!N9=\"\",0,Jugend!N9)","v":0},{"$f":"IF(Jugend!O9=\"\",0,Jugend!O9)","v":0},null,{"$f":"IF(AL9=\"\",\"\",Jugend!Q9)","v":0},{"$f":"IF(Jugend!R9=\"\",0,Jugend!R9)","v":0},{"$f":"IF(Jugend!S9=\"\",0,Jugend!S9)","v":0},null,{"$f":"IF(AR9=\"\",\"\",'Junioren II'!A9)","v":0},{"$f":"IF(AR9=\"\",\"\",'Junioren II'!B9)","v":0},{"$f":"IF(AR9=\"\",\"\",'Junioren II'!C9)","v":0},{"$f":"IF('Junioren II'!D9=\"\",0,'Junioren II'!D9)","v":0},{"$f":"IF('Junioren II'!E9=\"\",0,'Junioren II'!E9)","v":0},null,{"$f":"IF(AX9=\"\",\"\",'Junioren II'!G9)","v":0},{"$f":"IF(AX9=\"\",\"\",'Junioren II'!H9)","v":0},{"$f":"IF(AX9=\"\",\"\",'Junioren II'!I9)","v":0},{"$f":"IF('Junioren II'!J9=\"\",0,'Junioren II'!J9)","v":0},{"$f":"IF('Junioren II'!K9=\"\",0,'Junioren II'!K9)","v":0},null,{"$f":"IF(BB9=\"\",\"\",'Junioren II'!M9)","v":0},{"$f":"IF('Junioren II'!N9=\"\",0,'Junioren II'!N9)","v":0},{"$f":"IF('Junioren II'!O9=\"\",0,'Junioren II'!O9)","v":0},null,{"$f":"IF(BF9=\"\",\"\",'Junioren II'!Q9)","v":0},{"$f":"IF('Junioren II'!R9=\"\",0,'Junioren II'!R9)","v":0},{"$f":"IF('Junioren II'!S9=\"\",0,'Junioren II'!S9)","v":0},null,{"$f":"IF('UK-König'!A9=\"\",\"\",'UK-König'!A9)","v":""},{"$f":"IF('UK-König'!B9=\"\",\"\",'UK-König'!B9)","v":""},{"$f":"IF('UK-König'!C9=\"\",\"\",'UK-König'!C9)","v":""},null,{"$f":"IF(BP9=\"\",\"\",'Junioren I'!A9)","v":0},{"$f":"IF(BP9=\"\",\"\",'Junioren I'!B9)","v":0},{"$f":"IF(BP9=\"\",\"\",'Junioren I'!C9)","v":0},{"$f":"IF('Junioren I'!D9=\"\",0,'Junioren I'!D9)","v":0},{"$f":"IF('Junioren I'!E9=\"\",0,'Junioren I'!E9)","v":0},null,{"$f":"IF(BV9=\"\",\"\",'Junioren I'!G9)","v":0},{"$f":"IF(BV9=\"\",\"\",'Junioren I'!H9)","v":0},{"$f":"IF(BV9=\"\",\"\",'Junioren I'!I9)","v":0},{"$f":"IF('Junioren I'!J9=\"\",0,'Junioren I'!J9)","v":0},{"$f":"IF('Junioren I'!K9=\"\",0,'Junioren I'!K9)","v":0},null,{"$f":"IF(BZ9=\"\",\"\",'Junioren I'!M9)","v":0},{"$f":"IF('Junioren I'!N9=\"\",0,'Junioren I'!N9)","v":0},{"$f":"IF('Junioren I'!O9=\"\",0,'Junioren I'!O9)","v":0},null,{"$f":"IF(CD9=\"\",\"\",'Junioren I'!Q9)","v":0},{"$f":"IF('Junioren I'!R9=\"\",0,'Junioren I'!R9)","v":0},{"$f":"IF('Junioren I'!S9=\"\",0,'Junioren I'!S9)","v":0},null,{"$f":"IF(CJ9=\"\",\"\",Lichtpunkt!A9)","v":0},{"$f":"IF(CJ9=\"\",\"\",Lichtpunkt!B9)","v":0},{"$f":"IF(CJ9=\"\",\"\",Lichtpunkt!C9)","v":0},{"$f":"IF(Lichtpunkt!D9=\"\",0,Lichtpunkt!D9)","v":0},{"$f":"IF(Lichtpunkt!E9=\"\",0,Lichtpunkt!E9)","v":0},null,{"$f":"IF(CP9=\"\",\"\",Lichtpunkt!G9)","v":0},{"$f":"IF(CP9=\"\",\"\",Lichtpunkt!H9)","v":0},{"$f":"IF(CP9=\"\",\"\",Lichtpunkt!I9)","v":0},{"$f":"IF(Lichtpunkt!J9=\"\",0,Lichtpunkt!J9)","v":0},{"$f":"IF(Lichtpunkt!K9=\"\",0,Lichtpunkt!K9)","v":0},null,{"$f":"IF(CT9=\"\",\"\",Lichtpunkt!M9)","v":0},{"$f":"IF(Lichtpunkt!N9=\"\",0,Lichtpunkt!N9)","v":0},{"$f":"IF(Lichtpunkt!O9=\"\",0,Lichtpunkt!O9)","v":0},null,{"$f":"IF(CX9=\"\",\"\",Lichtpunkt!Q9)","v":0},{"$f":"IF(Lichtpunkt!R9=\"\",0,Lichtpunkt!R9)","v":0},{"$f":"IF(Lichtpunkt!S9=\"\",0,Lichtpunkt!S9)","v":0},null,{"$f":"IF('LP-König'!A9=\"\",\"\",'LP-König'!A9)","v":""},{"$f":"IF('LP-König'!B9=\"\",\"\",'LP-König'!B9)","v":""},{"$f":"IF('LP-König'!C9=\"\",\"\",'LP-König'!C9)","v":""}]
[{"$f":"IF(D10=\"\",\"\",Schüler!A10)","v":0},{"$f":"IF(D10=\"\",\"\",Schüler!B10)","v":0},{"$f":"IF(D10=\"\",\"\",Schüler!C10)","v":0},{"$f":"IF(Schüler!D10=\"\",0,Schüler!D10)","v":0},{"$f":"IF(Schüler!E10=\"\",0,Schüler!E10)","v":0},null,{"$f":"IF(J10=\"\",\"\",Schüler!G10)","v":0},{"$f":"IF(J10=\"\",\"\",Schüler!H10)","v":0},{"$f":"IF(J10=\"\",\"\",Schüler!I10)","v":0},{"$f":"IF(Schüler!J10=\"\",0,Schüler!J10)","v":0},{"$f":"IF(Schüler!K10=\"\",0,Schüler!K10)","v":0},null,{"$f":"IF(N10=\"\",\"\",Schüler!M10)","v":0},{"$f":"IF(Schüler!N10=\"\",0,Schüler!N10)","v":0},{"$f":"IF(Schüler!O10=\"\",0,Schüler!O10)","v":0},null,{"$f":"IF(R10=\"\",\"\",Schüler!Q10)","v":0},{"$f":"IF(Schüler!R10=\"\",0,Schüler!R10)","v":0},{"$f":"IF(Schüler!S10=\"\",0,Schüler!S10)","v":0},null,{"$f":"IF(X10=\"\",\"\",Jugend!A10)","v":0},{"$f":"IF(X10=\"\",\"\",Jugend!B10)","v":0},{"$f":"IF(X10=\"\",\"\",Jugend!C10)","v":0},{"$f":"IF(Jugend!D10=\"\",0,Jugend!D10)","v":0},{"$f":"IF(Jugend!E10=\"\",0,Jugend!E10)","v":0},null,{"$f":"IF(AD10=\"\",\"\",Jugend!G10)","v":0},{"$f":"IF(AD10=\"\",\"\",Jugend!H10)","v":0},{"$f":"IF(AD10=\"\",\"\",Jugend!I10)","v":0},{"$f":"IF(Jugend!J10=\"\",0,Jugend!J10)","v":0},{"$f":"IF(Jugend!K10=\"\",0,Jugend!K10)","v":0},null,{"$f":"IF(AH10=\"\",\"\",Jugend!M10)","v":0},{"$f":"IF(Jugend!N10=\"\",0,Jugend!N10)","v":0},{"$f":"IF(Jugend!O10=\"\",0,Jugend!O10)","v":0},null,{"$f":"IF(AL10=\"\",\"\",Jugend!Q10)","v":0},{"$f":"IF(Jugend!R10=\"\",0,Jugend!R10)","v":0},{"$f":"IF(Jugend!S10=\"\",0,Jugend!S10)","v":0},null,{"$f":"IF(AR10=\"\",\"\",'Junioren II'!A10)","v":0},{"$f":"IF(AR10=\"\",\"\",'Junioren II'!B10)","v":0},{"$f":"IF(AR10=\"\",\"\",'Junioren II'!C10)","v":0},{"$f":"IF('Junioren II'!D10=\"\",0,'Junioren II'!D10)","v":0},{"$f":"IF('Junioren II'!E10=\"\",0,'Junioren II'!E10)","v":0},null,{"$f":"IF(AX10=\"\",\"\",'Junioren II'!G10)","v":0},{"$f":"IF(AX10=\"\",\"\",'Junioren II'!H10)","v":0},{"$f":"IF(AX10=\"\",\"\",'Junioren II'!I10)","v":0},{"$f":"IF('Junioren II'!J10=\"\",0,'Junioren II'!J10)","v":0},{"$f":"IF('Junioren II'!K10=\"\",0,'Junioren II'!K10)","v":0},null,{"$f":"IF(BB10=\"\",\"\",'Junioren II'!M10)","v":0},{"$f":"IF('Junioren II'!N10=\"\",0,'Junioren II'!N10)","v":0},{"$f":"IF('Junioren II'!O10=\"\",0,'Junioren II'!O10)","v":0},null,{"$f":"IF(BF10=\"\",\"\",'Junioren II'!Q10)","v":0},{"$f":"IF('Junioren II'!R10=\"\",0,'Junioren II'!R10)","v":0},{"$f":"IF('Junioren II'!S10=\"\",0,'Junioren II'!S10)","v":0},null,{"$f":"IF('UK-König'!A10=\"\",\"\",'UK-König'!A10)","v":""},{"$f":"IF('UK-König'!B10=\"\",\"\",'UK-König'!B10)","v":""},{"$f":"IF('UK-König'!C10=\"\",\"\",'UK-König'!C10)","v":""},null,{"$f":"IF(BP10=\"\",\"\",'Junioren I'!A10)","v":0},{"$f":"IF(BP10=\"\",\"\",'Junioren I'!B10)","v":0},{"$f":"IF(BP10=\"\",\"\",'Junioren I'!C10)","v":0},{"$f":"IF('Junioren I'!D10=\"\",0,'Junioren I'!D10)","v":0},{"$f":"IF('Junioren I'!E10=\"\",0,'Junioren I'!E10)","v":0},null,{"$f":"IF(BV10=\"\",\"\",'Junioren I'!G10)","v":0},{"$f":"IF(BV10=\"\",\"\",'Junioren I'!H10)","v":0},{"$f":"IF(BV10=\"\",\"\",'Junioren I'!I10)","v":0},{"$f":"IF('Junioren I'!J10=\"\",0,'Junioren I'!J10)","v":0},{"$f":"IF('Junioren I'!K10=\"\",0,'Junioren I'!K10)","v":0},null,{"$f":"IF(BZ10=\"\",\"\",'Junioren I'!M10)","v":0},{"$f":"IF('Junioren I'!N10=\"\",0,'Junioren I'!N10)","v":0},{"$f":"IF('Junioren I'!O10=\"\",0,'Junioren I'!O10)","v":0},null,{"$f":"IF(CD10=\"\",\"\",'Junioren I'!Q10)","v":0},{"$f":"IF('Junioren I'!R10=\"\",0,'Junioren I'!R10)","v":0},{"$f":"IF('Junioren I'!S10=\"\",0,'Junioren I'!S10)","v":0},null,{"$f":"IF(CJ10=\"\",\"\",Lichtpunkt!A10)","v":0},{"$f":"IF(CJ10=\"\",\"\",Lichtpunkt!B10)","v":0},{"$f":"IF(CJ10=\"\",\"\",Lichtpunkt!C10)","v":0},{"$f":"IF(Lichtpunkt!D10=\"\",0,Lichtpunkt!D10)","v":0},{"$f":"IF(Lichtpunkt!E10=\"\",0,Lichtpunkt!E10)","v":0},null,{"$f":"IF(CP10=\"\",\"\",Lichtpunkt!G10)","v":0},{"$f":"IF(CP10=\"\",\"\",Lichtpunkt!H10)","v":0},{"$f":"IF(CP10=\"\",\"\",Lichtpunkt!I10)","v":0},{"$f":"IF(Lichtpunkt!J10=\"\",0,Lichtpunkt!J10)","v":0},{"$f":"IF(Lichtpunkt!K10=\"\",0,Lichtpunkt!K10)","v":0},null,{"$f":"IF(CT10=\"\",\"\",Lichtpunkt!M10)","v":0},{"$f":"IF(Lichtpunkt!N10=\"\",0,Lichtpunkt!N10)","v":0},{"$f":"IF(Lichtpunkt!O10=\"\",0,Lichtpunkt!O10)","v":0},null,{"$f":"IF(CX10=\"\",\"\",Lichtpunkt!Q10)","v":0},{"$f":"IF(Lichtpunkt!R10=\"\",0,Lichtpunkt!R10)","v":0},{"$f":"IF(Lichtpunkt!S10=\"\",0,Lichtpunkt!S10)","v":0},null,{"$f":"IF('LP-König'!A10=\"\",\"\",'LP-König'!A10)","v":""},{"$f":"IF('LP-König'!B10=\"\",\"\",'LP-König'!B10)","v":""},{"$f":"IF('LP-König'!C10=\"\",\"\",'LP-König'!C10)","v":""}]
[{"$f":"IF(D11=\"\",\"\",Schüler!A11)","v":0},{"$f":"IF(D11=\"\",\"\",Schüler!B11)","v":0},{"$f":"IF(D11=\"\",\"\",Schüler!C11)","v":0},{"$f":"IF(Schüler!D11=\"\",0,Schüler!D11)","v":0},{"$f":"IF(Schüler!E11=\"\",0,Schüler!E11)","v":0},null,{"$f":"IF(J11=\"\",\"\",Schüler!G11)","v":0},{"$f":"IF(J11=\"\",\"\",Schüler!H11)","v":0},{"$f":"IF(J11=\"\",\"\",Schüler!I11)","v":0},{"$f":"IF(Schüler!J11=\"\",0,Schüler!J11)","v":0},{"$f":"IF(Schüler!K11=\"\",0,Schüler!K11)","v":0},null,{"$f":"IF(N11=\"\",\"\",Schüler!M11)","v":0},{"$f":"IF(Schüler!N11=\"\",0,Schüler!N11)","v":0},{"$f":"IF(Schüler!O11=\"\",0,Schüler!O11)","v":0},null,{"$f":"IF(R11=\"\",\"\",Schüler!Q11)","v":0},{"$f":"IF(Schüler!R11=\"\",0,Schüler!R11)","v":0},{"$f":"IF(Schüler!S11=\"\",0,Schüler!S11)","v":0},null,{"$f":"IF(X11=\"\",\"\",Jugend!A11)","v":0},{"$f":"IF(X11=\"\",\"\",Jugend!B11)","v":0},{"$f":"IF(X11=\"\",\"\",Jugend!C11)","v":0},{"$f":"IF(Jugend!D11=\"\",0,Jugend!D11)","v":0},{"$f":"IF(Jugend!E11=\"\",0,Jugend!E11)","v":0},null,{"$f":"IF(AD11=\"\",\"\",Jugend!G11)","v":0},{"$f":"IF(AD11=\"\",\"\",Jugend!H11)","v":0},{"$f":"IF(AD11=\"\",\"\",Jugend!I11)","v":0},{"$f":"IF(Jugend!J11=\"\",0,Jugend!J11)","v":0},{"$f":"IF(Jugend!K11=\"\",0,Jugend!K11)","v":0},null,{"$f":"IF(AH11=\"\",\"\",Jugend!M11)","v":0},{"$f":"IF(Jugend!N11=\"\",0,Jugend!N11)","v":0},{"$f":"IF(Jugend!O11=\"\",0,Jugend!O11)","v":0},null,{"$f":"IF(AL11=\"\",\"\",Jugend!Q11)","v":0},{"$f":"IF(Jugend!R11=\"\",0,Jugend!R11)","v":0},{"$f":"IF(Jugend!S11=\"\",0,Jugend!S11)","v":0},null,{"$f":"IF(AR11=\"\",\"\",'Junioren II'!A11)","v":0},{"$f":"IF(AR11=\"\",\"\",'Junioren II'!B11)","v":0},{"$f":"IF(AR11=\"\",\"\",'Junioren II'!C11)","v":0},{"$f":"IF('Junioren II'!D11=\"\",0,'Junioren II'!D11)","v":0},{"$f":"IF('Junioren II'!E11=\"\",0,'Junioren II'!E11)","v":0},null,{"$f":"IF(AX11=\"\",\"\",'Junioren II'!G11)","v":0},{"$f":"IF(AX11=\"\",\"\",'Junioren II'!H11)","v":0},{"$f":"IF(AX11=\"\",\"\",'Junioren II'!I11)","v":0},{"$f":"IF('Junioren II'!J11=\"\",0,'Junioren II'!J11)","v":0},{"$f":"IF('Junioren II'!K11=\"\",0,'Junioren II'!K11)","v":0},null,{"$f":"IF(BB11=\"\",\"\",'Junioren II'!M11)","v":0},{"$f":"IF('Junioren II'!N11=\"\",0,'Junioren II'!N11)","v":0},{"$f":"IF('Junioren II'!O11=\"\",0,'Junioren II'!O11)","v":0},null,{"$f":"IF(BF11=\"\",\"\",'Junioren II'!Q11)","v":0},{"$f":"IF('Junioren II'!R11=\"\",0,'Junioren II'!R11)","v":0},{"$f":"IF('Junioren II'!S11=\"\",0,'Junioren II'!S11)","v":0},null,{"$f":"IF('UK-König'!A11=\"\",\"\",'UK-König'!A11)","v":""},{"$f":"IF('UK-König'!B11=\"\",\"\",'UK-König'!B11)","v":""},{"$f":"IF('UK-König'!C11=\"\",\"\",'UK-König'!C11)","v":""},null,{"$f":"IF(BP11=\"\",\"\",'Junioren I'!A11)","v":0},{"$f":"IF(BP11=\"\",\"\",'Junioren I'!B11)","v":0},{"$f":"IF(BP11=\"\",\"\",'Junioren I'!C11)","v":0},{"$f":"IF('Junioren I'!D11=\"\",0,'Junioren I'!D11)","v":0},{"$f":"IF('Junioren I'!E11=\"\",0,'Junioren I'!E11)","v":0},null,{"$f":"IF(BV11=\"\",\"\",'Junioren I'!G11)","v":0},{"$f":"IF(BV11=\"\",\"\",'Junioren I'!H11)","v":0},{"$f":"IF(BV11=\"\",\"\",'Junioren I'!I11)","v":0},{"$f":"IF('Junioren I'!J11=\"\",0,'Junioren I'!J11)","v":0},{"$f":"IF('Junioren I'!K11=\"\",0,'Junioren I'!K11)","v":0},null,{"$f":"IF(BZ11=\"\",\"\",'Junioren I'!M11)","v":0},{"$f":"IF('Junioren I'!N11=\"\",0,'Junioren I'!N11)","v":0},{"$f":"IF('Junioren I'!O11=\"\",0,'Junioren I'!O11)","v":0},null,{"$f":"IF(CD11=\"\",\"\",'Junioren I'!Q11)","v":0},{"$f":"IF('Junioren I'!R11=\"\",0,'Junioren I'!R11)","v":0},{"$f":"IF('Junioren I'!S11=\"\",0,'Junioren I'!S11)","v":0},null,{"$f":"IF(CJ11=\"\",\"\",Lichtpunkt!A11)","v":0},{"$f":"IF(CJ11=\"\",\"\",Lichtpunkt!B11)","v":0},{"$f":"IF(CJ11=\"\",\"\",Lichtpunkt!C11)","v":0},{"$f":"IF(Lichtpunkt!D11=\"\",0,Lichtpunkt!D11)","v":0},{"$f":"IF(Lichtpunkt!E11=\"\",0,Lichtpunkt!E11)","v":0},null,{"$f":"IF(CP11=\"\",\"\",Lichtpunkt!G11)","v":0},{"$f":"IF(CP11=\"\",\"\",Lichtpunkt!H11)","v":0},{"$f":"IF(CP11=\"\",\"\",Lichtpunkt!I11)","v":0},{"$f":"IF(Lichtpunkt!J11=\"\",0,Lichtpunkt!J11)","v":0},{"$f":"IF(Lichtpunkt!K11=\"\",0,Lichtpunkt!K11)","v":0},null,{"$f":"IF(CT11=\"\",\"\",Lichtpunkt!M11)","v":0},{"$f":"IF(Lichtpunkt!N11=\"\",0,Lichtpunkt!N11)","v":0},{"$f":"IF(Lichtpunkt!O11=\"\",0,Lichtpunkt!O11)","v":0},null,{"$f":"IF(CX11=\"\",\"\",Lichtpunkt!Q11)","v":0},{"$f":"IF(Lichtpunkt!R11=\"\",0,Lichtpunkt!R11)","v":0},{"$f":"IF(Lichtpunkt!S11=\"\",0,Lichtpunkt!S11)","v":0},null,{"$f":"IF('LP-König'!A11=\"\",\"\",'LP-König'!A11)","v":""},{"$f":"IF('LP-König'!B11=\"\",\"\",'LP-König'!B11)","v":""},{"$f":"IF('LP-König'!C11=\"\",\"\",'LP-König'!C11)","v":""}]
[{"$f":"IF(D12=\"\",\"\",Schüler!A12)","v":0},{"$f":"IF(D12=\"\",\"\",Schüler!B12)","v":0},{"$f":"IF(D12=\"\",\"\",Schüler!C12)","v":0},{"$f":"IF(Schüler!D12=\"\",0,Schüler!D12)","v":0},{"$f":"IF(Schüler!E12=\"\",0,Schüler!E12)","v":0},null,{"$f":"IF(J12=\"\",\"\",Schüler!G12)","v":0},{"$f":"IF(J12=\"\",\"\",Schüler!H12)","v":0},{"$f":"IF(J12=\"\",\"\",Schüler!I12)","v":0},{"$f":"IF(Schüler!J12=\"\",0,Schüler!J12)","v":0},{"$f":"IF(Schüler!K12=\"\",0,Schüler!K12)","v":0},null,{"$f":"IF(N12=\"\",\"\",Schüler!M12)","v":0},{"$f":"IF(Schüler!N12=\"\",0,Schüler!N12)","v":0},{"$f":"IF(Schüler!O12=\"\",0,Schüler!O12)","v":0},null,{"$f":"IF(R12=\"\",\"\",Schüler!Q12)","v":0},{"$f":"IF(Schüler!R12=\"\",0,Schüler!R12)","v":0},{"$f":"IF(Schüler!S12=\"\",0,Schüler!S12)","v":0},null,{"$f":"IF(X12=\"\",\"\",Jugend!A12)","v":0},{"$f":"IF(X12=\"\",\"\",Jugend!B12)","v":0},{"$f":"IF(X12=\"\",\"\",Jugend!C12)","v":0},{"$f":"IF(Jugend!D12=\"\",0,Jugend!D12)","v":0},{"$f":"IF(Jugend!E12=\"\",0,Jugend!E12)","v":0},null,{"$f":"IF(AD12=\"\",\"\",Jugend!G12)","v":0},{"$f":"IF(AD12=\"\",\"\",Jugend!H12)","v":0},{"$f":"IF(AD12=\"\",\"\",Jugend!I12)","v":0},{"$f":"IF(Jugend!J12=\"\",0,Jugend!J12)","v":0},{"$f":"IF(Jugend!K12=\"\",0,Jugend!K12)","v":0},null,{"$f":"IF(AH12=\"\",\"\",Jugend!M12)","v":0},{"$f":"IF(Jugend!N12=\"\",0,Jugend!N12)","v":0},{"$f":"IF(Jugend!O12=\"\",0,Jugend!O12)","v":0},null,{"$f":"IF(AL12=\"\",\"\",Jugend!Q12)","v":0},{"$f":"IF(Jugend!R12=\"\",0,Jugend!R12)","v":0},{"$f":"IF(Jugend!S12=\"\",0,Jugend!S12)","v":0},null,{"$f":"IF(AR12=\"\",\"\",'Junioren II'!A12)","v":0},{"$f":"IF(AR12=\"\",\"\",'Junioren II'!B12)","v":0},{"$f":"IF(AR12=\"\",\"\",'Junioren II'!C12)","v":0},{"$f":"IF('Junioren II'!D12=\"\",0,'Junioren II'!D12)","v":0},{"$f":"IF('Junioren II'!E12=\"\",0,'Junioren II'!E12)","v":0},null,{"$f":"IF(AX12=\"\",\"\",'Junioren II'!G12)","v":0},{"$f":"IF(AX12=\"\",\"\",'Junioren II'!H12)","v":0},{"$f":"IF(AX12=\"\",\"\",'Junioren II'!I12)","v":0},{"$f":"IF('Junioren II'!J12=\"\",0,'Junioren II'!J12)","v":0},{"$f":"IF('Junioren II'!K12=\"\",0,'Junioren II'!K12)","v":0},null,{"$f":"IF(BB12=\"\",\"\",'Junioren II'!M12)","v":0},{"$f":"IF('Junioren II'!N12=\"\",0,'Junioren II'!N12)","v":0},{"$f":"IF('Junioren II'!O12=\"\",0,'Junioren II'!O12)","v":0},null,{"$f":"IF(BF12=\"\",\"\",'Junioren II'!Q12)","v":0},{"$f":"IF('Junioren II'!R12=\"\",0,'Junioren II'!R12)","v":0},{"$f":"IF('Junioren II'!S12=\"\",0,'Junioren II'!S12)","v":0},null,{"$f":"IF('UK-König'!A12=\"\",\"\",'UK-König'!A12)","v":""},{"$f":"IF('UK-König'!B12=\"\",\"\",'UK-König'!B12)","v":""},{"$f":"IF('UK-König'!C12=\"\",\"\",'UK-König'!C12)","v":""},null,{"$f":"IF(BP12=\"\",\"\",'Junioren I'!A12)","v":0},{"$f":"IF(BP12=\"\",\"\",'Junioren I'!B12)","v":0},{"$f":"IF(BP12=\"\",\"\",'Junioren I'!C12)","v":0},{"$f":"IF('Junioren I'!D12=\"\",0,'Junioren I'!D12)","v":0},{"$f":"IF('Junioren I'!E12=\"\",0,'Junioren I'!E12)","v":0},null,{"$f":"IF(BV12=\"\",\"\",'Junioren I'!G12)","v":0},{"$f":"IF(BV12=\"\",\"\",'Junioren I'!H12)","v":0},{"$f":"IF(BV12=\"\",\"\",'Junioren I'!I12)","v":0},{"$f":"IF('Junioren I'!J12=\"\",0,'Junioren I'!J12)","v":0},{"$f":"IF('Junioren I'!K12=\"\",0,'Junioren I'!K12)","v":0},null,{"$f":"IF(BZ12=\"\",\"\",'Junioren I'!M12)","v":0},{"$f":"IF('Junioren I'!N12=\"\",0,'Junioren I'!N12)","v":0},{"$f":"IF('Junioren I'!O12=\"\",0,'Junioren I'!O12)","v":0},null,{"$f":"IF(CD12=\"\",\"\",'Junioren I'!Q12)","v":0},{"$f":"IF('Junioren I'!R12=\"\",0,'Junioren I'!R12)","v":0},{"$f":"IF('Junioren I'!S12=\"\",0,'Junioren I'!S12)","v":0},null,{"$f":"IF(CJ12=\"\",\"\",Lichtpunkt!A12)","v":0},{"$f":"IF(CJ12=\"\",\"\",Lichtpunkt!B12)","v":0},{"$f":"IF(CJ12=\"\",\"\",Lichtpunkt!C12)","v":0},{"$f":"IF(Lichtpunkt!D12=\"\",0,Lichtpunkt!D12)","v":0},{"$f":"IF(Lichtpunkt!E12=\"\",0,Lichtpunkt!E12)","v":0},null,{"$f":"IF(CP12=\"\",\"\",Lichtpunkt!G12)","v":0},{"$f":"IF(CP12=\"\",\"\",Lichtpunkt!H12)","v":0},{"$f":"IF(CP12=\"\",\"\",Lichtpunkt!I12)","v":0},{"$f":"IF(Lichtpunkt!J12=\"\",0,Lichtpunkt!J12)","v":0},{"$f":"IF(Lichtpunkt!K12=\"\",0,Lichtpunkt!K12)","v":0},null,{"$f":"IF(CT12=\"\",\"\",Lichtpunkt!M12)","v":0},{"$f":"IF(Lichtpunkt!N12=\"\",0,Lichtpunkt!N12)","v":0},{"$f":"IF(Lichtpunkt!O12=\"\",0,Lichtpunkt!O12)","v":0},null,{"$f":"IF(CX12=\"\",\"\",Lichtpunkt!Q12)","v":0},{"$f":"IF(Lichtpunkt!R12=\"\",0,Lichtpunkt!R12)","v":0},{"$f":"IF(Lichtpunkt!S12=\"\",0,Lichtpunkt!S12)","v":0},null,{"$f":"IF('LP-König'!A12=\"\",\"\",'LP-König'!A12)","v":""},{"$f":"IF('LP-König'!B12=\"\",\"\",'LP-König'!B12)","v":""},{"$f":"IF('LP-König'!C12=\"\",\"\",'LP-König'!C12)","v":""}]
[{"$f":"IF(D13=\"\",\"\",Schüler!A13)","v":0},{"$f":"IF(D13=\"\",\"\",Schüler!B13)","v":0},{"$f":"IF(D13=\"\",\"\",Schüler!C13)","v":0},{"$f":"IF(Schüler!D13=\"\",0,Schüler!D13)","v":0},{"$f":"IF(Schüler!E13=\"\",0,Schüler!E13)","v":0},null,{"$f":"IF(J13=\"\",\"\",Schüler!G13)","v":0},{"$f":"IF(J13=\"\",\"\",Schüler!H13)","v":0},{"$f":"IF(J13=\"\",\"\",Schüler!I13)","v":0},{"$f":"IF(Schüler!J13=\"\",0,Schüler!J13)","v":0},{"$f":"IF(Schüler!K13=\"\",0,Schüler!K13)","v":0},null,{"$f":"IF(N13=\"\",\"\",Schüler!M13)","v":0},{"$f":"IF(Schüler!N13=\"\",0,Schüler!N13)","v":0},{"$f":"IF(Schüler!O13=\"\",0,Schüler!O13)","v":0},null,{"$f":"IF(R13=\"\",\"\",Schüler!Q13)","v":0},{"$f":"IF(Schüler!R13=\"\",0,Schüler!R13)","v":0},{"$f":"IF(Schüler!S13=\"\",0,Schüler!S13)","v":0},null,{"$f":"IF(X13=\"\",\"\",Jugend!A13)","v":0},{"$f":"IF(X13=\"\",\"\",Jugend!B13)","v":0},{"$f":"IF(X13=\"\",\"\",Jugend!C13)","v":0},{"$f":"IF(Jugend!D13=\"\",0,Jugend!D13)","v":0},{"$f":"IF(Jugend!E13=\"\",0,Jugend!E13)","v":0},null,{"$f":"IF(AD13=\"\",\"\",Jugend!G13)","v":0},{"$f":"IF(AD13=\"\",\"\",Jugend!H13)","v":0},{"$f":"IF(AD13=\"\",\"\",Jugend!I13)","v":0},{"$f":"IF(Jugend!J13=\"\",0,Jugend!J13)","v":0},{"$f":"IF(Jugend!K13=\"\",0,Jugend!K13)","v":0},null,{"$f":"IF(AH13=\"\",\"\",Jugend!M13)","v":0},{"$f":"IF(Jugend!N13=\"\",0,Jugend!N13)","v":0},{"$f":"IF(Jugend!O13=\"\",0,Jugend!O13)","v":0},null,{"$f":"IF(AL13=\"\",\"\",Jugend!Q13)","v":0},{"$f":"IF(Jugend!R13=\"\",0,Jugend!R13)","v":0},{"$f":"IF(Jugend!S13=\"\",0,Jugend!S13)","v":0},null,{"$f":"IF(AR13=\"\",\"\",'Junioren II'!A13)","v":0},{"$f":"IF(AR13=\"\",\"\",'Junioren II'!B13)","v":0},{"$f":"IF(AR13=\"\",\"\",'Junioren II'!C13)","v":0},{"$f":"IF('Junioren II'!D13=\"\",0,'Junioren II'!D13)","v":0},{"$f":"IF('Junioren II'!E13=\"\",0,'Junioren II'!E13)","v":0},null,{"$f":"IF(AX13=\"\",\"\",'Junioren II'!G13)","v":0},{"$f":"IF(AX13=\"\",\"\",'Junioren II'!H13)","v":0},{"$f":"IF(AX13=\"\",\"\",'Junioren II'!I13)","v":0},{"$f":"IF('Junioren II'!J13=\"\",0,'Junioren II'!J13)","v":0},{"$f":"IF('Junioren II'!K13=\"\",0,'Junioren II'!K13)","v":0},null,{"$f":"IF(BB13=\"\",\"\",'Junioren II'!M13)","v":0},{"$f":"IF('Junioren II'!N13=\"\",0,'Junioren II'!N13)","v":0},{"$f":"IF('Junioren II'!O13=\"\",0,'Junioren II'!O13)","v":0},null,{"$f":"IF(BF13=\"\",\"\",'Junioren II'!Q13)","v":0},{"$f":"IF('Junioren II'!R13=\"\",0,'Junioren II'!R13)","v":0},{"$f":"IF('Junioren II'!S13=\"\",0,'Junioren II'!S13)","v":0},null,{"$f":"IF('UK-König'!A13=\"\",\"\",'UK-König'!A13)","v":""},{"$f":"IF('UK-König'!B13=\"\",\"\",'UK-König'!B13)","v":""},{"$f":"IF('UK-König'!C13=\"\",\"\",'UK-König'!C13)","v":""},null,{"$f":"IF(BP13=\"\",\"\",'Junioren I'!A13)","v":0},{"$f":"IF(BP13=\"\",\"\",'Junioren I'!B13)","v":0},{"$f":"IF(BP13=\"\",\"\",'Junioren I'!C13)","v":0},{"$f":"IF('Junioren I'!D13=\"\",0,'Junioren I'!D13)","v":0},{"$f":"IF('Junioren I'!E13=\"\",0,'Junioren I'!E13)","v":0},null,{"$f":"IF(BV13=\"\",\"\",'Junioren I'!G13)","v":0},{"$f":"IF(BV13=\"\",\"\",'Junioren I'!H13)","v":0},{"$f":"IF(BV13=\"\",\"\",'Junioren I'!I13)","v":0},{"$f":"IF('Junioren I'!J13=\"\",0,'Junioren I'!J13)","v":0},{"$f":"IF('Junioren I'!K13=\"\",0,'Junioren I'!K13)","v":0},null,{"$f":"IF(BZ13=\"\",\"\",'Junioren I'!M13)","v":0},{"$f":"IF('Junioren I'!N13=\"\",0,'Junioren I'!N13)","v":0},{"$f":"IF('Junioren I'!O13=\"\",0,'Junioren I'!O13)","v":0},null,{"$f":"IF(CD13=\"\",\"\",'Junioren I'!Q13)","v":0},{"$f":"IF('Junioren I'!R13=\"\",0,'Junioren I'!R13)","v":0},{"$f":"IF('Junioren I'!S13=\"\",0,'Junioren I'!S13)","v":0},null,{"$f":"IF(CJ13=\"\",\"\",Lichtpunkt!A13)","v":0},{"$f":"IF(CJ13=\"\",\"\",Lichtpunkt!B13)","v":0},{"$f":"IF(CJ13=\"\",\"\",Lichtpunkt!C13)","v":0},{"$f":"IF(Lichtpunkt!D13=\"\",0,Lichtpunkt!D13)","v":0},{"$f":"IF(Lichtpunkt!E13=\"\",0,Lichtpunkt!E13)","v":0},null,{"$f":"IF(CP13=\"\",\"\",Lichtpunkt!G13)","v":0},{"$f":"IF(CP13=\"\",\"\",Lichtpunkt!H13)","v":0},{"$f":"IF(CP13=\"\",\"\",Lichtpunkt!I13)","v":0},{"$f":"IF(Lichtpunkt!J13=\"\",0,Lichtpunkt!J13)","v":0},{"$f":"IF(Lichtpunkt!K13=\"\",0,Lichtpunkt!K13)","v":0},null,{"$f":"IF(CT13=\"\",\"\",Lichtpunkt!M13)","v":0},{"$f":"IF(Lichtpunkt!N13=\"\",0,Lichtpunkt!N13)","v":0},{"$f":"IF(Lichtpunkt!O13=\"\",0,Lichtpunkt!O13)","v":0},null,{"$f":"IF(CX13=\"\",\"\",Lichtpunkt!Q13)","v":0},{"$f":"IF(Lichtpunkt!R13=\"\",0,Lichtpunkt!R13)","v":0},{"$f":"IF(Lichtpunkt!S13=\"\",0,Lichtpunkt!S13)","v":0},null,{"$f":"IF('LP-König'!A13=\"\",\"\",'LP-König'!A13)","v":""},{"$f":"IF('LP-König'!B13=\"\",\"\",'LP-König'!B13)","v":""},{"$f":"IF('LP-König'!C13=\"\",\"\",'LP-König'!C13)","v":""}]
[{"$f":"IF(D14=\"\",\"\",Schüler!A14)","v":0},{"$f":"IF(D14=\"\",\"\",Schüler!B14)","v":0},{"$f":"IF(D14=\"\",\"\",Schüler!C14)","v":0},{"$f":"IF(Schüler!D14=\"\",0,Schüler!D14)","v":0},{"$f":"IF(Schüler!E14=\"\",0,Schüler!E14)","v":0},null,{"$f":"IF(J14=\"\",\"\",Schüler!G14)","v":0},{"$f":"IF(J14=\"\",\"\",Schüler!H14)","v":0},{"$f":"IF(J14=\"\",\"\",Schüler!I14)","v":0},{"$f":"IF(Schüler!J14=\"\",0,Schüler!J14)","v":0},{"$f":"IF(Schüler!K14=\"\",0,Schüler!K14)","v":0},null,{"$f":"IF(N14=\"\",\"\",Schüler!M14)","v":0},{"$f":"IF(Schüler!N14=\"\",0,Schüler!N14)","v":0},{"$f":"IF(Schüler!O14=\"\",0,Schüler!O14)","v":0},null,{"$f":"IF(R14=\"\",\"\",Schüler!Q14)","v":0},{"$f":"IF(Schüler!R14=\"\",0,Schüler!R14)","v":0},{"$f":"IF(Schüler!S14=\"\",0,Schüler!S14)","v":0},null,{"$f":"IF(X14=\"\",\"\",Jugend!A14)","v":0},{"$f":"IF(X14=\"\",\"\",Jugend!B14)","v":0},{"$f":"IF(X14=\"\",\"\",Jugend!C14)","v":0},{"$f":"IF(Jugend!D14=\"\",0,Jugend!D14)","v":0},{"$f":"IF(Jugend!E14=\"\",0,Jugend!E14)","v":0},null,{"$f":"IF(AD14=\"\",\"\",Jugend!G14)","v":0},{"$f":"IF(AD14=\"\",\"\",Jugend!H14)","v":0},{"$f":"IF(AD14=\"\",\"\",Jugend!I14)","v":0},{"$f":"IF(Jugend!J14=\"\",0,Jugend!J14)","v":0},{"$f":"IF(Jugend!K14=\"\",0,Jugend!K14)","v":0},null,{"$f":"IF(AH14=\"\",\"\",Jugend!M14)","v":0},{"$f":"IF(Jugend!N14=\"\",0,Jugend!N14)","v":0},{"$f":"IF(Jugend!O14=\"\",0,Jugend!O14)","v":0},null,{"$f":"IF(AL14=\"\",\"\",Jugend!Q14)","v":0},{"$f":"IF(Jugend!R14=\"\",0,Jugend!R14)","v":0},{"$f":"IF(Jugend!S14=\"\",0,Jugend!S14)","v":0},null,{"$f":"IF(AR14=\"\",\"\",'Junioren II'!A14)","v":0},{"$f":"IF(AR14=\"\",\"\",'Junioren II'!B14)","v":0},{"$f":"IF(AR14=\"\",\"\",'Junioren II'!C14)","v":0},{"$f":"IF('Junioren II'!D14=\"\",0,'Junioren II'!D14)","v":0},{"$f":"IF('Junioren II'!E14=\"\",0,'Junioren II'!E14)","v":0},null,{"$f":"IF(AX14=\"\",\"\",'Junioren II'!G14)","v":0},{"$f":"IF(AX14=\"\",\"\",'Junioren II'!H14)","v":0},{"$f":"IF(AX14=\"\",\"\",'Junioren II'!I14)","v":0},{"$f":"IF('Junioren II'!J14=\"\",0,'Junioren II'!J14)","v":0},{"$f":"IF('Junioren II'!K14=\"\",0,'Junioren II'!K14)","v":0},null,{"$f":"IF(BB14=\"\",\"\",'Junioren II'!M14)","v":0},{"$f":"IF('Junioren II'!N14=\"\",0,'Junioren II'!N14)","v":0},{"$f":"IF('Junioren II'!O14=\"\",0,'Junioren II'!O14)","v":0},null,{"$f":"IF(BF14=\"\",\"\",'Junioren II'!Q14)","v":0},{"$f":"IF('Junioren II'!R14=\"\",0,'Junioren II'!R14)","v":0},{"$f":"IF('Junioren II'!S14=\"\",0,'Junioren II'!S14)","v":0},null,{"$f":"IF('UK-König'!A14=\"\",\"\",'UK-König'!A14)","v":""},{"$f":"IF('UK-König'!B14=\"\",\"\",'UK-König'!B14)","v":""},{"$f":"IF('UK-König'!C14=\"\",\"\",'UK-König'!C14)","v":""},null,{"$f":"IF(BP14=\"\",\"\",'Junioren I'!A14)","v":0},{"$f":"IF(BP14=\"\",\"\",'Junioren I'!B14)","v":0},{"$f":"IF(BP14=\"\",\"\",'Junioren I'!C14)","v":0},{"$f":"IF('Junioren I'!D14=\"\",0,'Junioren I'!D14)","v":0},{"$f":"IF('Junioren I'!E14=\"\",0,'Junioren I'!E14)","v":0},null,{"$f":"IF(BV14=\"\",\"\",'Junioren I'!G14)","v":0},{"$f":"IF(BV14=\"\",\"\",'Junioren I'!H14)","v":0},{"$f":"IF(BV14=\"\",\"\",'Junioren I'!I14)","v":0},{"$f":"IF('Junioren I'!J14=\"\",0,'Junioren I'!J14)","v":0},{"$f":"IF('Junioren I'!K14=\"\",0,'Junioren I'!K14)","v":0},null,{"$f":"IF(BZ14=\"\",\"\",'Junioren I'!M14)","v":0},{"$f":"IF('Junioren I'!N14=\"\",0,'Junioren I'!N14)","v":0},{"$f":"IF('Junioren I'!O14=\"\",0,'Junioren I'!O14)","v":0},null,{"$f":"IF(CD14=\"\",\"\",'Junioren I'!Q14)","v":0},{"$f":"IF('Junioren I'!R14=\"\",0,'Junioren I'!R14)","v":0},{"$f":"IF('Junioren I'!S14=\"\",0,'Junioren I'!S14)","v":0},null,{"$f":"IF(CJ14=\"\",\"\",Lichtpunkt!A14)","v":0},{"$f":"IF(CJ14=\"\",\"\",Lichtpunkt!B14)","v":0},{"$f":"IF(CJ14=\"\",\"\",Lichtpunkt!C14)","v":0},{"$f":"IF(Lichtpunkt!D14=\"\",0,Lichtpunkt!D14)","v":0},{"$f":"IF(Lichtpunkt!E14=\"\",0,Lichtpunkt!E14)","v":0},null,{"$f":"IF(CP14=\"\",\"\",Lichtpunkt!G14)","v":0},{"$f":"IF(CP14=\"\",\"\",Lichtpunkt!H14)","v":0},{"$f":"IF(CP14=\"\",\"\",Lichtpunkt!I14)","v":0},{"$f":"IF(Lichtpunkt!J14=\"\",0,Lichtpunkt!J14)","v":0},{"$f":"IF(Lichtpunkt!K14=\"\",0,Lichtpunkt!K14)","v":0},null,{"$f":"IF(CT14=\"\",\"\",Lichtpunkt!M14)","v":0},{"$f":"IF(Lichtpunkt!N14=\"\",0,Lichtpunkt!N14)","v":0},{"$f":"IF(Lichtpunkt!O14=\"\",0,Lichtpunkt!O14)","v":0},null,{"$f":"IF(CX14=\"\",\"\",Lichtpunkt!Q14)","v":0},{"$f":"IF(Lichtpunkt!R14=\"\",0,Lichtpunkt!R14)","v":0},{"$f":"IF(Lichtpunkt!S14=\"\",0,Lichtpunkt!S14)","v":0},null,{"$f":"IF('LP-König'!A14=\"\",\"\",'LP-König'!A14)","v":""},{"$f":"IF('LP-König'!B14=\"\",\"\",'LP-König'!B14)","v":""},{"$f":"IF('LP-König'!C14=\"\",\"\",'LP-König'!C14)","v":""}]
[{"$f":"IF(D15=\"\",\"\",Schüler!A15)","v":0},{"$f":"IF(D15=\"\",\"\",Schüler!B15)","v":0},{"$f":"IF(D15=\"\",\"\",Schüler!C15)","v":0},{"$f":"IF(Schüler!D15=\"\",0,Schüler!D15)","v":0},{"$f":"IF(Schüler!E15=\"\",0,Schüler!E15)","v":0},null,{"$f":"IF(J15=\"\",\"\",Schüler!G15)","v":0},{"$f":"IF(J15=\"\",\"\",Schüler!H15)","v":0},{"$f":"IF(J15=\"\",\"\",Schüler!I15)","v":0},{"$f":"IF(Schüler!J15=\"\",0,Schüler!J15)","v":0},{"$f":"IF(Schüler!K15=\"\",0,Schüler!K15)","v":0},null,{"$f":"IF(N15=\"\",\"\",Schüler!M15)","v":0},{"$f":"IF(Schüler!N15=\"\",0,Schüler!N15)","v":0},{"$f":"IF(Schüler!O15=\"\",0,Schüler!O15)","v":0},null,{"$f":"IF(R15=\"\",\"\",Schüler!Q15)","v":0},{"$f":"IF(Schüler!R15=\"\",0,Schüler!R15)","v":0},{"$f":"IF(Schüler!S15=\"\",0,Schüler!S15)","v":0},null,{"$f":"IF(X15=\"\",\"\",Jugend!A15)","v":0},{"$f":"IF(X15=\"\",\"\",Jugend!B15)","v":0},{"$f":"IF(X15=\"\",\"\",Jugend!C15)","v":0},{"$f":"IF(Jugend!D15=\"\",0,Jugend!D15)","v":0},{"$f":"IF(Jugend!E15=\"\",0,Jugend!E15)","v":0},null,{"$f":"IF(AD15=\"\",\"\",Jugend!G15)","v":0},{"$f":"IF(AD15=\"\",\"\",Jugend!H15)","v":0},{"$f":"IF(AD15=\"\",\"\",Jugend!I15)","v":0},{"$f":"IF(Jugend!J15=\"\",0,Jugend!J15)","v":0},{"$f":"IF(Jugend!K15=\"\",0,Jugend!K15)","v":0},null,{"$f":"IF(AH15=\"\",\"\",Jugend!M15)","v":0},{"$f":"IF(Jugend!N15=\"\",0,Jugend!N15)","v":0},{"$f":"IF(Jugend!O15=\"\",0,Jugend!O15)","v":0},null,{"$f":"IF(AL15=\"\",\"\",Jugend!Q15)","v":0},{"$f":"IF(Jugend!R15=\"\",0,Jugend!R15)","v":0},{"$f":"IF(Jugend!S15=\"\",0,Jugend!S15)","v":0},null,{"$f":"IF(AR15=\"\",\"\",'Junioren II'!A15)","v":0},{"$f":"IF(AR15=\"\",\"\",'Junioren II'!B15)","v":0},{"$f":"IF(AR15=\"\",\"\",'Junioren II'!C15)","v":0},{"$f":"IF('Junioren II'!D15=\"\",0,'Junioren II'!D15)","v":0},{"$f":"IF('Junioren II'!E15=\"\",0,'Junioren II'!E15)","v":0},null,{"$f":"IF(AX15=\"\",\"\",'Junioren II'!G15)","v":0},{"$f":"IF(AX15=\"\",\"\",'Junioren II'!H15)","v":0},{"$f":"IF(AX15=\"\",\"\",'Junioren II'!I15)","v":0},{"$f":"IF('Junioren II'!J15=\"\",0,'Junioren II'!J15)","v":0},{"$f":"IF('Junioren II'!K15=\"\",0,'Junioren II'!K15)","v":0},null,{"$f":"IF(BB15=\"\",\"\",'Junioren II'!M15)","v":0},{"$f":"IF('Junioren II'!N15=\"\",0,'Junioren II'!N15)","v":0},{"$f":"IF('Junioren II'!O15=\"\",0,'Junioren II'!O15)","v":0},null,{"$f":"IF(BF15=\"\",\"\",'Junioren II'!Q15)","v":0},{"$f":"IF('Junioren II'!R15=\"\",0,'Junioren II'!R15)","v":0},{"$f":"IF('Junioren II'!S15=\"\",0,'Junioren II'!S15)","v":0},null,{"$f":"IF('UK-König'!A15=\"\",\"\",'UK-König'!A15)","v":""},{"$f":"IF('UK-König'!B15=\"\",\"\",'UK-König'!B15)","v":""},{"$f":"IF('UK-König'!C15=\"\",\"\",'UK-König'!C15)","v":""},null,{"$f":"IF(BP15=\"\",\"\",'Junioren I'!A15)","v":0},{"$f":"IF(BP15=\"\",\"\",'Junioren I'!B15)","v":0},{"$f":"IF(BP15=\"\",\"\",'Junioren I'!C15)","v":0},{"$f":"IF('Junioren I'!D15=\"\",0,'Junioren I'!D15)","v":0},{"$f":"IF('Junioren I'!E15=\"\",0,'Junioren I'!E15)","v":0},null,{"$f":"IF(BV15=\"\",\"\",'Junioren I'!G15)","v":0},{"$f":"IF(BV15=\"\",\"\",'Junioren I'!H15)","v":0},{"$f":"IF(BV15=\"\",\"\",'Junioren I'!I15)","v":0},{"$f":"IF('Junioren I'!J15=\"\",0,'Junioren I'!J15)","v":0},{"$f":"IF('Junioren I'!K15=\"\",0,'Junioren I'!K15)","v":0},null,{"$f":"IF(BZ15=\"\",\"\",'Junioren I'!M15)","v":0},{"$f":"IF('Junioren I'!N15=\"\",0,'Junioren I'!N15)","v":0},{"$f":"IF('Junioren I'!O15=\"\",0,'Junioren I'!O15)","v":0},null,{"$f":"IF(CD15=\"\",\"\",'Junioren I'!Q15)","v":0},{"$f":"IF('Junioren I'!R15=\"\",0,'Junioren I'!R15)","v":0},{"$f":"IF('Junioren I'!S15=\"\",0,'Junioren I'!S15)","v":0},null,{"$f":"IF(CJ15=\"\",\"\",Lichtpunkt!A15)","v":0},{"$f":"IF(CJ15=\"\",\"\",Lichtpunkt!B15)","v":0},{"$f":"IF(CJ15=\"\",\"\",Lichtpunkt!C15)","v":0},{"$f":"IF(Lichtpunkt!D15=\"\",0,Lichtpunkt!D15)","v":0},{"$f":"IF(Lichtpunkt!E15=\"\",0,Lichtpunkt!E15)","v":0},null,{"$f":"IF(CP15=\"\",\"\",Lichtpunkt!G15)","v":0},{"$f":"IF(CP15=\"\",\"\",Lichtpunkt!H15)","v":0},{"$f":"IF(CP15=\"\",\"\",Lichtpunkt!I15)","v":0},{"$f":"IF(Lichtpunkt!J15=\"\",0,Lichtpunkt!J15)","v":0},{"$f":"IF(Lichtpunkt!K15=\"\",0,Lichtpunkt!K15)","v":0},null,{"$f":"IF(CT15=\"\",\"\",Lichtpunkt!M15)","v":0},{"$f":"IF(Lichtpunkt!N15=\"\",0,Lichtpunkt!N15)","v":0},{"$f":"IF(Lichtpunkt!O15=\"\",0,Lichtpunkt!O15)","v":0},null,{"$f":"IF(CX15=\"\",\"\",Lichtpunkt!Q15)","v":0},{"$f":"IF(Lichtpunkt!R15=\"\",0,Lichtpunkt!R15)","v":0},{"$f":"IF(Lichtpunkt!S15=\"\",0,Lichtpunkt!S15)","v":0},null,{"$f":"IF('LP-König'!A15=\"\",\"\",'LP-König'!A15)","v":""},{"$f":"IF('LP-König'!B15=\"\",\"\",'LP-König'!B15)","v":""},{"$f":"IF('LP-König'!C15=\"\",\"\",'LP-König'!C15)","v":""}]
[{"$f":"IF(D16=\"\",\"\",Schüler!A16)","v":0},{"$f":"IF(D16=\"\",\"\",Schüler!B16)","v":0},{"$f":"IF(D16=\"\",\"\",Schüler!C16)","v":0},{"$f":"IF(Schüler!D16=\"\",0,Schüler!D16)","v":0},{"$f":"IF(Schüler!E16=\"\",0,Schüler!E16)","v":0},null,{"$f":"IF(J16=\"\",\"\",Schüler!G16)","v":0},{"$f":"IF(J16=\"\",\"\",Schüler!H16)","v":0},{"$f":"IF(J16=\"\",\"\",Schüler!I16)","v":0},{"$f":"IF(Schüler!J16=\"\",0,Schüler!J16)","v":0},{"$f":"IF(Schüler!K16=\"\",0,Schüler!K16)","v":0},null,{"$f":"IF(N16=\"\",\"\",Schüler!M16)","v":0},{"$f":"IF(Schüler!N16=\"\",0,Schüler!N16)","v":0},{"$f":"IF(Schüler!O16=\"\",0,Schüler!O16)","v":0},null,{"$f":"IF(R16=\"\",\"\",Schüler!Q16)","v":0},{"$f":"IF(Schüler!R16=\"\",0,Schüler!R16)","v":0},{"$f":"IF(Schüler!S16=\"\",0,Schüler!S16)","v":0},null,{"$f":"IF(X16=\"\",\"\",Jugend!A16)","v":0},{"$f":"IF(X16=\"\",\"\",Jugend!B16)","v":0},{"$f":"IF(X16=\"\",\"\",Jugend!C16)","v":0},{"$f":"IF(Jugend!D16=\"\",0,Jugend!D16)","v":0},{"$f":"IF(Jugend!E16=\"\",0,Jugend!E16)","v":0},null,{"$f":"IF(AD16=\"\",\"\",Jugend!G16)","v":0},{"$f":"IF(AD16=\"\",\"\",Jugend!H16)","v":0},{"$f":"IF(AD16=\"\",\"\",Jugend!I16)","v":0},{"$f":"IF(Jugend!J16=\"\",0,Jugend!J16)","v":0},{"$f":"IF(Jugend!K16=\"\",0,Jugend!K16)","v":0},null,{"$f":"IF(AH16=\"\",\"\",Jugend!M16)","v":0},{"$f":"IF(Jugend!N16=\"\",0,Jugend!N16)","v":0},{"$f":"IF(Jugend!O16=\"\",0,Jugend!O16)","v":0},null,{"$f":"IF(AL16=\"\",\"\",Jugend!Q16)","v":0},{"$f":"IF(Jugend!R16=\"\",0,Jugend!R16)","v":0},{"$f":"IF(Jugend!S16=\"\",0,Jugend!S16)","v":0},null,{"$f":"IF(AR16=\"\",\"\",'Junioren II'!A16)","v":0},{"$f":"IF(AR16=\"\",\"\",'Junioren II'!B16)","v":0},{"$f":"IF(AR16=\"\",\"\",'Junioren II'!C16)","v":0},{"$f":"IF('Junioren II'!D16=\"\",0,'Junioren II'!D16)","v":0},{"$f":"IF('Junioren II'!E16=\"\",0,'Junioren II'!E16)","v":0},null,{"$f":"IF(AX16=\"\",\"\",'Junioren II'!G16)","v":0},{"$f":"IF(AX16=\"\",\"\",'Junioren II'!H16)","v":0},{"$f":"IF(AX16=\"\",\"\",'Junioren II'!I16)","v":0},{"$f":"IF('Junioren II'!J16=\"\",0,'Junioren II'!J16)","v":0},{"$f":"IF('Junioren II'!K16=\"\",0,'Junioren II'!K16)","v":0},null,{"$f":"IF(BB16=\"\",\"\",'Junioren II'!M16)","v":0},{"$f":"IF('Junioren II'!N16=\"\",0,'Junioren II'!N16)","v":0},{"$f":"IF('Junioren II'!O16=\"\",0,'Junioren II'!O16)","v":0},null,{"$f":"IF(BF16=\"\",\"\",'Junioren II'!Q16)","v":0},{"$f":"IF('Junioren II'!R16=\"\",0,'Junioren II'!R16)","v":0},{"$f":"IF('Junioren II'!S16=\"\",0,'Junioren II'!S16)","v":0},null,{"$f":"IF('UK-König'!A16=\"\",\"\",'UK-König'!A16)","v":""},{"$f":"IF('UK-König'!B16=\"\",\"\",'UK-König'!B16)","v":""},{"$f":"IF('UK-König'!C16=\"\",\"\",'UK-König'!C16)","v":""},null,{"$f":"IF(BP16=\"\",\"\",'Junioren I'!A16)","v":0},{"$f":"IF(BP16=\"\",\"\",'Junioren I'!B16)","v":0},{"$f":"IF(BP16=\"\",\"\",'Junioren I'!C16)","v":0},{"$f":"IF('Junioren I'!D16=\"\",0,'Junioren I'!D16)","v":0},{"$f":"IF('Junioren I'!E16=\"\",0,'Junioren I'!E16)","v":0},null,{"$f":"IF(BV16=\"\",\"\",'Junioren I'!G16)","v":0},{"$f":"IF(BV16=\"\",\"\",'Junioren I'!H16)","v":0},{"$f":"IF(BV16=\"\",\"\",'Junioren I'!I16)","v":0},{"$f":"IF('Junioren I'!J16=\"\",0,'Junioren I'!J16)","v":0},{"$f":"IF('Junioren I'!K16=\"\",0,'Junioren I'!K16)","v":0},null,{"$f":"IF(BZ16=\"\",\"\",'Junioren I'!M16)","v":0},{"$f":"IF('Junioren I'!N16=\"\",0,'Junioren I'!N16)","v":0},{"$f":"IF('Junioren I'!O16=\"\",0,'Junioren I'!O16)","v":0},null,{"$f":"IF(CD16=\"\",\"\",'Junioren I'!Q16)","v":0},{"$f":"IF('Junioren I'!R16=\"\",0,'Junioren I'!R16)","v":0},{"$f":"IF('Junioren I'!S16=\"\",0,'Junioren I'!S16)","v":0},null,{"$f":"IF(CJ16=\"\",\"\",Lichtpunkt!A16)","v":0},{"$f":"IF(CJ16=\"\",\"\",Lichtpunkt!B16)","v":0},{"$f":"IF(CJ16=\"\",\"\",Lichtpunkt!C16)","v":0},{"$f":"IF(Lichtpunkt!D16=\"\",0,Lichtpunkt!D16)","v":0},{"$f":"IF(Lichtpunkt!E16=\"\",0,Lichtpunkt!E16)","v":0},null,{"$f":"IF(CP16=\"\",\"\",Lichtpunkt!G16)","v":0},{"$f":"IF(CP16=\"\",\"\",Lichtpunkt!H16)","v":0},{"$f":"IF(CP16=\"\",\"\",Lichtpunkt!I16)","v":0},{"$f":"IF(Lichtpunkt!J16=\"\",0,Lichtpunkt!J16)","v":0},{"$f":"IF(Lichtpunkt!K16=\"\",0,Lichtpunkt!K16)","v":0},null,{"$f":"IF(CT16=\"\",\"\",Lichtpunkt!M16)","v":0},{"$f":"IF(Lichtpunkt!N16=\"\",0,Lichtpunkt!N16)","v":0},{"$f":"IF(Lichtpunkt!O16=\"\",0,Lichtpunkt!O16)","v":0},null,{"$f":"IF(CX16=\"\",\"\",Lichtpunkt!Q16)","v":0},{"$f":"IF(Lichtpunkt!R16=\"\",0,Lichtpunkt!R16)","v":0},{"$f":"IF(Lichtpunkt!S16=\"\",0,Lichtpunkt!S16)","v":0},null,{"$f":"IF('LP-König'!A16=\"\",\"\",'LP-König'!A16)","v":""},{"$f":"IF('LP-König'!B16=\"\",\"\",'LP-König'!B16)","v":""},{"$f":"IF('LP-König'!C16=\"\",\"\",'LP-König'!C16)","v":""}]
[{"$f":"IF(D17=\"\",\"\",Schüler!A17)","v":0},{"$f":"IF(D17=\"\",\"\",Schüler!B17)","v":0},{"$f":"IF(D17=\"\",\"\",Schüler!C17)","v":0},{"$f":"IF(Schüler!D17=\"\",0,Schüler!D17)","v":0},{"$f":"IF(Schüler!E17=\"\",0,Schüler!E17)","v":0},null,{"$f":"IF(J17=\"\",\"\",Schüler!G17)","v":0},{"$f":"IF(J17=\"\",\"\",Schüler!H17)","v":0},{"$f":"IF(J17=\"\",\"\",Schüler!I17)","v":0},{"$f":"IF(Schüler!J17=\"\",0,Schüler!J17)","v":0},{"$f":"IF(Schüler!K17=\"\",0,Schüler!K17)","v":0},null,{"$f":"IF(N17=\"\",\"\",Schüler!M17)","v":0},{"$f":"IF(Schüler!N17=\"\",0,Schüler!N17)","v":0},{"$f":"IF(Schüler!O17=\"\",0,Schüler!O17)","v":0},null,{"$f":"IF(R17=\"\",\"\",Schüler!Q17)","v":0},{"$f":"IF(Schüler!R17=\"\",0,Schüler!R17)","v":0},{"$f":"IF(Schüler!S17=\"\",0,Schüler!S17)","v":0},null,{"$f":"IF(X17=\"\",\"\",Jugend!A17)","v":0},{"$f":"IF(X17=\"\",\"\",Jugend!B17)","v":0},{"$f":"IF(X17=\"\",\"\",Jugend!C17)","v":0},{"$f":"IF(Jugend!D17=\"\",0,Jugend!D17)","v":0},{"$f":"IF(Jugend!E17=\"\",0,Jugend!E17)","v":0},null,{"$f":"IF(AD17=\"\",\"\",Jugend!G17)","v":0},{"$f":"IF(AD17=\"\",\"\",Jugend!H17)","v":0},{"$f":"IF(AD17=\"\",\"\",Jugend!I17)","v":0},{"$f":"IF(Jugend!J17=\"\",0,Jugend!J17)","v":0},{"$f":"IF(Jugend!K17=\"\",0,Jugend!K17)","v":0},null,{"$f":"IF(AH17=\"\",\"\",Jugend!M17)","v":0},{"$f":"IF(Jugend!N17=\"\",0,Jugend!N17)","v":0},{"$f":"IF(Jugend!O17=\"\",0,Jugend!O17)","v":0},null,{"$f":"IF(AL17=\"\",\"\",Jugend!Q17)","v":0},{"$f":"IF(Jugend!R17=\"\",0,Jugend!R17)","v":0},{"$f":"IF(Jugend!S17=\"\",0,Jugend!S17)","v":0},null,{"$f":"IF(AR17=\"\",\"\",'Junioren II'!A17)","v":0},{"$f":"IF(AR17=\"\",\"\",'Junioren II'!B17)","v":0},{"$f":"IF(AR17=\"\",\"\",'Junioren II'!C17)","v":0},{"$f":"IF('Junioren II'!D17=\"\",0,'Junioren II'!D17)","v":0},{"$f":"IF('Junioren II'!E17=\"\",0,'Junioren II'!E17)","v":0},null,{"$f":"IF(AX17=\"\",\"\",'Junioren II'!G17)","v":0},{"$f":"IF(AX17=\"\",\"\",'Junioren II'!H17)","v":0},{"$f":"IF(AX17=\"\",\"\",'Junioren II'!I17)","v":0},{"$f":"IF('Junioren II'!J17=\"\",0,'Junioren II'!J17)","v":0},{"$f":"IF('Junioren II'!K17=\"\",0,'Junioren II'!K17)","v":0},null,{"$f":"IF(BB17=\"\",\"\",'Junioren II'!M17)","v":0},{"$f":"IF('Junioren II'!N17=\"\",0,'Junioren II'!N17)","v":0},{"$f":"IF('Junioren II'!O17=\"\",0,'Junioren II'!O17)","v":0},null,{"$f":"IF(BF17=\"\",\"\",'Junioren II'!Q17)","v":0},{"$f":"IF('Junioren II'!R17=\"\",0,'Junioren II'!R17)","v":0},{"$f":"IF('Junioren II'!S17=\"\",0,'Junioren II'!S17)","v":0},null,{"$f":"IF('UK-König'!A17=\"\",\"\",'UK-König'!A17)","v":""},{"$f":"IF('UK-König'!B17=\"\",\"\",'UK-König'!B17)","v":""},{"$f":"IF('UK-König'!C17=\"\",\"\",'UK-König'!C17)","v":""},null,{"$f":"IF(BP17=\"\",\"\",'Junioren I'!A17)","v":0},{"$f":"IF(BP17=\"\",\"\",'Junioren I'!B17)","v":0},{"$f":"IF(BP17=\"\",\"\",'Junioren I'!C17)","v":0},{"$f":"IF('Junioren I'!D17=\"\",0,'Junioren I'!D17)","v":0},{"$f":"IF('Junioren I'!E17=\"\",0,'Junioren I'!E17)","v":0},null,{"$f":"IF(BV17=\"\",\"\",'Junioren I'!G17)","v":0},{"$f":"IF(BV17=\"\",\"\",'Junioren I'!H17)","v":0},{"$f":"IF(BV17=\"\",\"\",'Junioren I'!I17)","v":0},{"$f":"IF('Junioren I'!J17=\"\",0,'Junioren I'!J17)","v":0},{"$f":"IF('Junioren I'!K17=\"\",0,'Junioren I'!K17)","v":0},null,{"$f":"IF(BZ17=\"\",\"\",'Junioren I'!M17)","v":0},{"$f":"IF('Junioren I'!N17=\"\",0,'Junioren I'!N17)","v":0},{"$f":"IF('Junioren I'!O17=\"\",0,'Junioren I'!O17)","v":0},null,{"$f":"IF(CD17=\"\",\"\",'Junioren I'!Q17)","v":0},{"$f":"IF('Junioren I'!R17=\"\",0,'Junioren I'!R17)","v":0},{"$f":"IF('Junioren I'!S17=\"\",0,'Junioren I'!S17)","v":0},null,{"$f":"IF(CJ17=\"\",\"\",Lichtpunkt!A17)","v":0},{"$f":"IF(CJ17=\"\",\"\",Lichtpunkt!B17)","v":0},{"$f":"IF(CJ17=\"\",\"\",Lichtpunkt!C17)","v":0},{"$f":"IF(Lichtpunkt!D17=\"\",0,Lichtpunkt!D17)","v":0},{"$f":"IF(Lichtpunkt!E17=\"\",0,Lichtpunkt!E17)","v":0},null,{"$f":"IF(CP17=\"\",\"\",Lichtpunkt!G17)","v":0},{"$f":"IF(CP17=\"\",\"\",Lichtpunkt!H17)","v":0},{"$f":"IF(CP17=\"\",\"\",Lichtpunkt!I17)","v":0},{"$f":"IF(Lichtpunkt!J17=\"\",0,Lichtpunkt!J17)","v":0},{"$f":"IF(Lichtpunkt!K17=\"\",0,Lichtpunkt!K17)","v":0},null,{"$f":"IF(CT17=\"\",\"\",Lichtpunkt!M17)","v":0},{"$f":"IF(Lichtpunkt!N17=\"\",0,Lichtpunkt!N17)","v":0},{"$f":"IF(Lichtpunkt!O17=\"\",0,Lichtpunkt!O17)","v":0},null,{"$f":"IF(CX17=\"\",\"\",Lichtpunkt!Q17)","v":0},{"$f":"IF(Lichtpunkt!R17=\"\",0,Lichtpunkt!R17)","v":0},{"$f":"IF(Lichtpunkt!S17=\"\",0,Lichtpunkt!S17)","v":0},null,{"$f":"IF('LP-König'!A17=\"\",\"\",'LP-König'!A17)","v":""},{"$f":"IF('LP-König'!B17=\"\",\"\",'LP-König'!B17)","v":""},{"$f":"IF('LP-König'!C17=\"\",\"\",'LP-König'!C17)","v":""}]
[{"$f":"IF(D18=\"\",\"\",Schüler!A18)","v":0},{"$f":"IF(D18=\"\",\"\",Schüler!B18)","v":0},{"$f":"IF(D18=\"\",\"\",Schüler!C18)","v":0},{"$f":"IF(Schüler!D18=\"\",0,Schüler!D18)","v":0},{"$f":"IF(Schüler!E18=\"\",0,Schüler!E18)","v":0},null,{"$f":"IF(J18=\"\",\"\",Schüler!G18)","v":0},{"$f":"IF(J18=\"\",\"\",Schüler!H18)","v":0},{"$f":"IF(J18=\"\",\"\",Schüler!I18)","v":0},{"$f":"IF(Schüler!J18=\"\",0,Schüler!J18)","v":0},{"$f":"IF(Schüler!K18=\"\",0,Schüler!K18)","v":0},null,{"$f":"IF(N18=\"\",\"\",Schüler!M18)","v":0},{"$f":"IF(Schüler!N18=\"\",0,Schüler!N18)","v":0},{"$f":"IF(Schüler!O18=\"\",0,Schüler!O18)","v":0},null,{"$f":"IF(R18=\"\",\"\",Schüler!Q18)","v":0},{"$f":"IF(Schüler!R18=\"\",0,Schüler!R18)","v":0},{"$f":"IF(Schüler!S18=\"\",0,Schüler!S18)","v":0},null,{"$f":"IF(X18=\"\",\"\",Jugend!A18)","v":0},{"$f":"IF(X18=\"\",\"\",Jugend!B18)","v":0},{"$f":"IF(X18=\"\",\"\",Jugend!C18)","v":0},{"$f":"IF(Jugend!D18=\"\",0,Jugend!D18)","v":0},{"$f":"IF(Jugend!E18=\"\",0,Jugend!E18)","v":0},null,{"$f":"IF(AD18=\"\",\"\",Jugend!G18)","v":0},{"$f":"IF(AD18=\"\",\"\",Jugend!H18)","v":0},{"$f":"IF(AD18=\"\",\"\",Jugend!I18)","v":0},{"$f":"IF(Jugend!J18=\"\",0,Jugend!J18)","v":0},{"$f":"IF(Jugend!K18=\"\",0,Jugend!K18)","v":0},null,{"$f":"IF(AH18=\"\",\"\",Jugend!M18)","v":0},{"$f":"IF(Jugend!N18=\"\",0,Jugend!N18)","v":0},{"$f":"IF(Jugend!O18=\"\",0,Jugend!O18)","v":0},null,{"$f":"IF(AL18=\"\",\"\",Jugend!Q18)","v":0},{"$f":"IF(Jugend!R18=\"\",0,Jugend!R18)","v":0},{"$f":"IF(Jugend!S18=\"\",0,Jugend!S18)","v":0},null,{"$f":"IF(AR18=\"\",\"\",'Junioren II'!A18)","v":0},{"$f":"IF(AR18=\"\",\"\",'Junioren II'!B18)","v":0},{"$f":"IF(AR18=\"\",\"\",'Junioren II'!C18)","v":0},{"$f":"IF('Junioren II'!D18=\"\",0,'Junioren II'!D18)","v":0},{"$f":"IF('Junioren II'!E18=\"\",0,'Junioren II'!E18)","v":0},null,{"$f":"IF(AX18=\"\",\"\",'Junioren II'!G18)","v":0},{"$f":"IF(AX18=\"\",\"\",'Junioren II'!H18)","v":0},{"$f":"IF(AX18=\"\",\"\",'Junioren II'!I18)","v":0},{"$f":"IF('Junioren II'!J18=\"\",0,'Junioren II'!J18)","v":0},{"$f":"IF('Junioren II'!K18=\"\",0,'Junioren II'!K18)","v":0},null,{"$f":"IF(BB18=\"\",\"\",'Junioren II'!M18)","v":0},{"$f":"IF('Junioren II'!N18=\"\",0,'Junioren II'!N18)","v":0},{"$f":"IF('Junioren II'!O18=\"\",0,'Junioren II'!O18)","v":0},null,{"$f":"IF(BF18=\"\",\"\",'Junioren II'!Q18)","v":0},{"$f":"IF('Junioren II'!R18=\"\",0,'Junioren II'!R18)","v":0},{"$f":"IF('Junioren II'!S18=\"\",0,'Junioren II'!S18)","v":0},null,{"$f":"IF('UK-König'!A18=\"\",\"\",'UK-König'!A18)","v":""},{"$f":"IF('UK-König'!B18=\"\",\"\",'UK-König'!B18)","v":""},{"$f":"IF('UK-König'!C18=\"\",\"\",'UK-König'!C18)","v":""},null,{"$f":"IF(BP18=\"\",\"\",'Junioren I'!A18)","v":0},{"$f":"IF(BP18=\"\",\"\",'Junioren I'!B18)","v":0},{"$f":"IF(BP18=\"\",\"\",'Junioren I'!C18)","v":0},{"$f":"IF('Junioren I'!D18=\"\",0,'Junioren I'!D18)","v":0},{"$f":"IF('Junioren I'!E18=\"\",0,'Junioren I'!E18)","v":0},null,{"$f":"IF(BV18=\"\",\"\",'Junioren I'!G18)","v":0},{"$f":"IF(BV18=\"\",\"\",'Junioren I'!H18)","v":0},{"$f":"IF(BV18=\"\",\"\",'Junioren I'!I18)","v":0},{"$f":"IF('Junioren I'!J18=\"\",0,'Junioren I'!J18)","v":0},{"$f":"IF('Junioren I'!K18=\"\",0,'Junioren I'!K18)","v":0},null,{"$f":"IF(BZ18=\"\",\"\",'Junioren I'!M18)","v":0},{"$f":"IF('Junioren I'!N18=\"\",0,'Junioren I'!N18)","v":0},{"$f":"IF('Junioren I'!O18=\"\",0,'Junioren I'!O18)","v":0},null,{"$f":"IF(CD18=\"\",\"\",'Junioren I'!Q18)","v":0},{"$f":"IF('Junioren I'!R18=\"\",0,'Junioren I'!R18)","v":0},{"$f":"IF('Junioren I'!S18=\"\",0,'Junioren I'!S18)","v":0},null,{"$f":"IF(CJ18=\"\",\"\",Lichtpunkt!A18)","v":0},{"$f":"IF(CJ18=\"\",\"\",Lichtpunkt!B18)","v":0},{"$f":"IF(CJ18=\"\",\"\",Lichtpunkt!C18)","v":0},{"$f":"IF(Lichtpunkt!D18=\"\",0,Lichtpunkt!D18)","v":0},{"$f":"IF(Lichtpunkt!E18=\"\",0,Lichtpunkt!E18)","v":0},null,{"$f":"IF(CP18=\"\",\"\",Lichtpunkt!G18)","v":0},{"$f":"IF(CP18=\"\",\"\",Lichtpunkt!H18)","v":0},{"$f":"IF(CP18=\"\",\"\",Lichtpunkt!I18)","v":0},{"$f":"IF(Lichtpunkt!J18=\"\",0,Lichtpunkt!J18)","v":0},{"$f":"IF(Lichtpunkt!K18=\"\",0,Lichtpunkt!K18)","v":0},null,{"$f":"IF(CT18=\"\",\"\",Lichtpunkt!M18)","v":0},{"$f":"IF(Lichtpunkt!N18=\"\",0,Lichtpunkt!N18)","v":0},{"$f":"IF(Lichtpunkt!O18=\"\",0,Lichtpunkt!O18)","v":0},null,{"$f":"IF(CX18=\"\",\"\",Lichtpunkt!Q18)","v":0},{"$f":"IF(Lichtpunkt!R18=\"\",0,Lichtpunkt!R18)","v":0},{"$f":"IF(Lichtpunkt!S18=\"\",0,Lichtpunkt!S18)","v":0},null,{"$f":"IF('LP-König'!A18=\"\",\"\",'LP-König'!A18)","v":""},{"$f":"IF('LP-König'!B18=\"\",\"\",'LP-König'!B18)","v":""},{"$f":"IF('LP-König'!C18=\"\",\"\",'LP-König'!C18)","v":""}]
[{"$f":"IF(D19=\"\",\"\",Schüler!A19)","v":0},{"$f":"IF(D19=\"\",\"\",Schüler!B19)","v":0},{"$f":"IF(D19=\"\",\"\",Schüler!C19)","v":0},{"$f":"IF(Schüler!D19=\"\",0,Schüler!D19)","v":0},{"$f":"IF(Schüler!E19=\"\",0,Schüler!E19)","v":0},null,{"$f":"IF(J19=\"\",\"\",Schüler!G19)","v":0},{"$f":"IF(J19=\"\",\"\",Schüler!H19)","v":0},{"$f":"IF(J19=\"\",\"\",Schüler!I19)","v":0},{"$f":"IF(Schüler!J19=\"\",0,Schüler!J19)","v":0},{"$f":"IF(Schüler!K19=\"\",0,Schüler!K19)","v":0},null,{"$f":"IF(N19=\"\",\"\",Schüler!M19)","v":0},{"$f":"IF(Schüler!N19=\"\",0,Schüler!N19)","v":0},{"$f":"IF(Schüler!O19=\"\",0,Schüler!O19)","v":0},null,{"$f":"IF(R19=\"\",\"\",Schüler!Q19)","v":0},{"$f":"IF(Schüler!R19=\"\",0,Schüler!R19)","v":0},{"$f":"IF(Schüler!S19=\"\",0,Schüler!S19)","v":0},null,{"$f":"IF(X19=\"\",\"\",Jugend!A19)","v":0},{"$f":"IF(X19=\"\",\"\",Jugend!B19)","v":0},{"$f":"IF(X19=\"\",\"\",Jugend!C19)","v":0},{"$f":"IF(Jugend!D19=\"\",0,Jugend!D19)","v":0},{"$f":"IF(Jugend!E19=\"\",0,Jugend!E19)","v":0},null,{"$f":"IF(AD19=\"\",\"\",Jugend!G19)","v":0},{"$f":"IF(AD19=\"\",\"\",Jugend!H19)","v":0},{"$f":"IF(AD19=\"\",\"\",Jugend!I19)","v":0},{"$f":"IF(Jugend!J19=\"\",0,Jugend!J19)","v":0},{"$f":"IF(Jugend!K19=\"\",0,Jugend!K19)","v":0},null,{"$f":"IF(AH19=\"\",\"\",Jugend!M19)","v":0},{"$f":"IF(Jugend!N19=\"\",0,Jugend!N19)","v":0},{"$f":"IF(Jugend!O19=\"\",0,Jugend!O19)","v":0},null,{"$f":"IF(AL19=\"\",\"\",Jugend!Q19)","v":0},{"$f":"IF(Jugend!R19=\"\",0,Jugend!R19)","v":0},{"$f":"IF(Jugend!S19=\"\",0,Jugend!S19)","v":0},null,{"$f":"IF(AR19=\"\",\"\",'Junioren II'!A19)","v":0},{"$f":"IF(AR19=\"\",\"\",'Junioren II'!B19)","v":0},{"$f":"IF(AR19=\"\",\"\",'Junioren II'!C19)","v":0},{"$f":"IF('Junioren II'!D19=\"\",0,'Junioren II'!D19)","v":0},{"$f":"IF('Junioren II'!E19=\"\",0,'Junioren II'!E19)","v":0},null,{"$f":"IF(AX19=\"\",\"\",'Junioren II'!G19)","v":0},{"$f":"IF(AX19=\"\",\"\",'Junioren II'!H19)","v":0},{"$f":"IF(AX19=\"\",\"\",'Junioren II'!I19)","v":0},{"$f":"IF('Junioren II'!J19=\"\",0,'Junioren II'!J19)","v":0},{"$f":"IF('Junioren II'!K19=\"\",0,'Junioren II'!K19)","v":0},null,{"$f":"IF(BB19=\"\",\"\",'Junioren II'!M19)","v":0},{"$f":"IF('Junioren II'!N19=\"\",0,'Junioren II'!N19)","v":0},{"$f":"IF('Junioren II'!O19=\"\",0,'Junioren II'!O19)","v":0},null,{"$f":"IF(BF19=\"\",\"\",'Junioren II'!Q19)","v":0},{"$f":"IF('Junioren II'!R19=\"\",0,'Junioren II'!R19)","v":0},{"$f":"IF('Junioren II'!S19=\"\",0,'Junioren II'!S19)","v":0},null,{"$f":"IF('UK-König'!A19=\"\",\"\",'UK-König'!A19)","v":""},{"$f":"IF('UK-König'!B19=\"\",\"\",'UK-König'!B19)","v":""},{"$f":"IF('UK-König'!C19=\"\",\"\",'UK-König'!C19)","v":""},null,{"$f":"IF(BP19=\"\",\"\",'Junioren I'!A19)","v":0},{"$f":"IF(BP19=\"\",\"\",'Junioren I'!B19)","v":0},{"$f":"IF(BP19=\"\",\"\",'Junioren I'!C19)","v":0},{"$f":"IF('Junioren I'!D19=\"\",0,'Junioren I'!D19)","v":0},{"$f":"IF('Junioren I'!E19=\"\",0,'Junioren I'!E19)","v":0},null,{"$f":"IF(BV19=\"\",\"\",'Junioren I'!G19)","v":0},{"$f":"IF(BV19=\"\",\"\",'Junioren I'!H19)","v":0},{"$f":"IF(BV19=\"\",\"\",'Junioren I'!I19)","v":0},{"$f":"IF('Junioren I'!J19=\"\",0,'Junioren I'!J19)","v":0},{"$f":"IF('Junioren I'!K19=\"\",0,'Junioren I'!K19)","v":0},null,{"$f":"IF(BZ19=\"\",\"\",'Junioren I'!M19)","v":0},{"$f":"IF('Junioren I'!N19=\"\",0,'Junioren I'!N19)","v":0},{"$f":"IF('Junioren I'!O19=\"\",0,'Junioren I'!O19)","v":0},null,{"$f":"IF(CD19=\"\",\"\",'Junioren I'!Q19)","v":0},{"$f":"IF('Junioren I'!R19=\"\",0,'Junioren I'!R19)","v":0},{"$f":"IF('Junioren I'!S19=\"\",0,'Junioren I'!S19)","v":0},null,{"$f":"IF(CJ19=\"\",\"\",Lichtpunkt!A19)","v":0},{"$f":"IF(CJ19=\"\",\"\",Lichtpunkt!B19)","v":0},{"$f":"IF(CJ19=\"\",\"\",Lichtpunkt!C19)","v":0},{"$f":"IF(Lichtpunkt!D19=\"\",0,Lichtpunkt!D19)","v":0},{"$f":"IF(Lichtpunkt!E19=\"\",0,Lichtpunkt!E19)","v":0},null,{"$f":"IF(CP19=\"\",\"\",Lichtpunkt!G19)","v":0},{"$f":"IF(CP19=\"\",\"\",Lichtpunkt!H19)","v":0},{"$f":"IF(CP19=\"\",\"\",Lichtpunkt!I19)","v":0},{"$f":"IF(Lichtpunkt!J19=\"\",0,Lichtpunkt!J19)","v":0},{"$f":"IF(Lichtpunkt!K19=\"\",0,Lichtpunkt!K19)","v":0},null,{"$f":"IF(CT19=\"\",\"\",Lichtpunkt!M19)","v":0},{"$f":"IF(Lichtpunkt!N19=\"\",0,Lichtpunkt!N19)","v":0},{"$f":"IF(Lichtpunkt!O19=\"\",0,Lichtpunkt!O19)","v":0},null,{"$f":"IF(CX19=\"\",\"\",Lichtpunkt!Q19)","v":0},{"$f":"IF(Lichtpunkt!R19=\"\",0,Lichtpunkt!R19)","v":0},{"$f":"IF(Lichtpunkt!S19=\"\",0,Lichtpunkt!S19)","v":0},null,{"$f":"IF('LP-König'!A19=\"\",\"\",'LP-König'!A19)","v":""},{"$f":"IF('LP-König'!B19=\"\",\"\",'LP-König'!B19)","v":""},{"$f":"IF('LP-König'!C19=\"\",\"\",'LP-König'!C19)","v":""}]
[{"$f":"IF(D20=\"\",\"\",Schüler!A20)","v":0},{"$f":"IF(D20=\"\",\"\",Schüler!B20)","v":0},{"$f":"IF(D20=\"\",\"\",Schüler!C20)","v":0},{"$f":"IF(Schüler!D20=\"\",0,Schüler!D20)","v":0},{"$f":"IF(Schüler!E20=\"\",0,Schüler!E20)","v":0},null,{"$f":"IF(J20=\"\",\"\",Schüler!G20)","v":0},{"$f":"IF(J20=\"\",\"\",Schüler!H20)","v":0},{"$f":"IF(J20=\"\",\"\",Schüler!I20)","v":0},{"$f":"IF(Schüler!J20=\"\",0,Schüler!J20)","v":0},{"$f":"IF(Schüler!K20=\"\",0,Schüler!K20)","v":0},null,{"$f":"IF(N20=\"\",\"\",Schüler!M20)","v":0},{"$f":"IF(Schüler!N20=\"\",0,Schüler!N20)","v":0},{"$f":"IF(Schüler!O20=\"\",0,Schüler!O20)","v":0},null,{"$f":"IF(R20=\"\",\"\",Schüler!Q20)","v":0},{"$f":"IF(Schüler!R20=\"\",0,Schüler!R20)","v":0},{"$f":"IF(Schüler!S20=\"\",0,Schüler!S20)","v":0},null,{"$f":"IF(X20=\"\",\"\",Jugend!A20)","v":0},{"$f":"IF(X20=\"\",\"\",Jugend!B20)","v":0},{"$f":"IF(X20=\"\",\"\",Jugend!C20)","v":0},{"$f":"IF(Jugend!D20=\"\",0,Jugend!D20)","v":0},{"$f":"IF(Jugend!E20=\"\",0,Jugend!E20)","v":0},null,{"$f":"IF(AD20=\"\",\"\",Jugend!G20)","v":0},{"$f":"IF(AD20=\"\",\"\",Jugend!H20)","v":0},{"$f":"IF(AD20=\"\",\"\",Jugend!I20)","v":0},{"$f":"IF(Jugend!J20=\"\",0,Jugend!J20)","v":0},{"$f":"IF(Jugend!K20=\"\",0,Jugend!K20)","v":0},null,{"$f":"IF(AH20=\"\",\"\",Jugend!M20)","v":0},{"$f":"IF(Jugend!N20=\"\",0,Jugend!N20)","v":0},{"$f":"IF(Jugend!O20=\"\",0,Jugend!O20)","v":0},null,{"$f":"IF(AL20=\"\",\"\",Jugend!Q20)","v":0},{"$f":"IF(Jugend!R20=\"\",0,Jugend!R20)","v":0},{"$f":"IF(Jugend!S20=\"\",0,Jugend!S20)","v":0},null,{"$f":"IF(AR20=\"\",\"\",'Junioren II'!A20)","v":0},{"$f":"IF(AR20=\"\",\"\",'Junioren II'!B20)","v":0},{"$f":"IF(AR20=\"\",\"\",'Junioren II'!C20)","v":0},{"$f":"IF('Junioren II'!D20=\"\",0,'Junioren II'!D20)","v":0},{"$f":"IF('Junioren II'!E20=\"\",0,'Junioren II'!E20)","v":0},null,{"$f":"IF(AX20=\"\",\"\",'Junioren II'!G20)","v":0},{"$f":"IF(AX20=\"\",\"\",'Junioren II'!H20)","v":0},{"$f":"IF(AX20=\"\",\"\",'Junioren II'!I20)","v":0},{"$f":"IF('Junioren II'!J20=\"\",0,'Junioren II'!J20)","v":0},{"$f":"IF('Junioren II'!K20=\"\",0,'Junioren II'!K20)","v":0},null,{"$f":"IF(BB20=\"\",\"\",'Junioren II'!M20)","v":0},{"$f":"IF('Junioren II'!N20=\"\",0,'Junioren II'!N20)","v":0},{"$f":"IF('Junioren II'!O20=\"\",0,'Junioren II'!O20)","v":0},null,{"$f":"IF(BF20=\"\",\"\",'Junioren II'!Q20)","v":0},{"$f":"IF('Junioren II'!R20=\"\",0,'Junioren II'!R20)","v":0},{"$f":"IF('Junioren II'!S20=\"\",0,'Junioren II'!S20)","v":0},null,{"$f":"IF('UK-König'!A20=\"\",\"\",'UK-König'!A20)","v":""},{"$f":"IF('UK-König'!B20=\"\",\"\",'UK-König'!B20)","v":""},{"$f":"IF('UK-König'!C20=\"\",\"\",'UK-König'!C20)","v":""},null,{"$f":"IF(BP20=\"\",\"\",'Junioren I'!A20)","v":0},{"$f":"IF(BP20=\"\",\"\",'Junioren I'!B20)","v":0},{"$f":"IF(BP20=\"\",\"\",'Junioren I'!C20)","v":0},{"$f":"IF('Junioren I'!D20=\"\",0,'Junioren I'!D20)","v":0},{"$f":"IF('Junioren I'!E20=\"\",0,'Junioren I'!E20)","v":0},null,{"$f":"IF(BV20=\"\",\"\",'Junioren I'!G20)","v":0},{"$f":"IF(BV20=\"\",\"\",'Junioren I'!H20)","v":0},{"$f":"IF(BV20=\"\",\"\",'Junioren I'!I20)","v":0},{"$f":"IF('Junioren I'!J20=\"\",0,'Junioren I'!J20)","v":0},{"$f":"IF('Junioren I'!K20=\"\",0,'Junioren I'!K20)","v":0},null,{"$f":"IF(BZ20=\"\",\"\",'Junioren I'!M20)","v":0},{"$f":"IF('Junioren I'!N20=\"\",0,'Junioren I'!N20)","v":0},{"$f":"IF('Junioren I'!O20=\"\",0,'Junioren I'!O20)","v":0},null,{"$f":"IF(CD20=\"\",\"\",'Junioren I'!Q20)","v":0},{"$f":"IF('Junioren I'!R20=\"\",0,'Junioren I'!R20)","v":0},{"$f":"IF('Junioren I'!S20=\"\",0,'Junioren I'!S20)","v":0},null,{"$f":"IF(CJ20=\"\",\"\",Lichtpunkt!A20)","v":0},{"$f":"IF(CJ20=\"\",\"\",Lichtpunkt!B20)","v":0},{"$f":"IF(CJ20=\"\",\"\",Lichtpunkt!C20)","v":0},{"$f":"IF(Lichtpunkt!D20=\"\",0,Lichtpunkt!D20)","v":0},{"$f":"IF(Lichtpunkt!E20=\"\",0,Lichtpunkt!E20)","v":0},null,{"$f":"IF(CP20=\"\",\"\",Lichtpunkt!G20)","v":0},{"$f":"IF(CP20=\"\",\"\",Lichtpunkt!H20)","v":0},{"$f":"IF(CP20=\"\",\"\",Lichtpunkt!I20)","v":0},{"$f":"IF(Lichtpunkt!J20=\"\",0,Lichtpunkt!J20)","v":0},{"$f":"IF(Lichtpunkt!K20=\"\",0,Lichtpunkt!K20)","v":0},null,{"$f":"IF(CT20=\"\",\"\",Lichtpunkt!M20)","v":0},{"$f":"IF(Lichtpunkt!N20=\"\",0,Lichtpunkt!N20)","v":0},{"$f":"IF(Lichtpunkt!O20=\"\",0,Lichtpunkt!O20)","v":0},null,{"$f":"IF(CX20=\"\",\"\",Lichtpunkt!Q20)","v":0},{"$f":"IF(Lichtpunkt!R20=\"\",0,Lichtpunkt!R20)","v":0},{"$f":"IF(Lichtpunkt!S20=\"\",0,Lichtpunkt!S20)","v":0},null,{"$f":"IF('LP-König'!A20=\"\",\"\",'LP-König'!A20)","v":""},{"$f":"IF('LP-König'!B20=\"\",\"\",'LP-König'!B20)","v":""},{"$f":"IF('LP-König'!C20=\"\",\"\",'LP-König'!C20)","v":""}]
[{"$f":"IF(D21=\"\",\"\",Schüler!A21)","v":0},{"$f":"IF(D21=\"\",\"\",Schüler!B21)","v":0},{"$f":"IF(D21=\"\",\"\",Schüler!C21)","v":0},{"$f":"IF(Schüler!D21=\"\",0,Schüler!D21)","v":0},{"$f":"IF(Schüler!E21=\"\",0,Schüler!E21)","v":0},null,{"$f":"IF(J21=\"\",\"\",Schüler!G21)","v":0},{"$f":"IF(J21=\"\",\"\",Schüler!H21)","v":0},{"$f":"IF(J21=\"\",\"\",Schüler!I21)","v":0},{"$f":"IF(Schüler!J21=\"\",0,Schüler!J21)","v":0},{"$f":"IF(Schüler!K21=\"\",0,Schüler!K21)","v":0},null,{"$f":"IF(N21=\"\",\"\",Schüler!M21)","v":0},{"$f":"IF(Schüler!N21=\"\",0,Schüler!N21)","v":0},{"$f":"IF(Schüler!O21=\"\",0,Schüler!O21)","v":0},null,{"$f":"IF(R21=\"\",\"\",Schüler!Q21)","v":0},{"$f":"IF(Schüler!R21=\"\",0,Schüler!R21)","v":0},{"$f":"IF(Schüler!S21=\"\",0,Schüler!S21)","v":0},null,{"$f":"IF(X21=\"\",\"\",Jugend!A21)","v":0},{"$f":"IF(X21=\"\",\"\",Jugend!B21)","v":0},{"$f":"IF(X21=\"\",\"\",Jugend!C21)","v":0},{"$f":"IF(Jugend!D21=\"\",0,Jugend!D21)","v":0},{"$f":"IF(Jugend!E21=\"\",0,Jugend!E21)","v":0},null,{"$f":"IF(AD21=\"\",\"\",Jugend!G21)","v":0},{"$f":"IF(AD21=\"\",\"\",Jugend!H21)","v":0},{"$f":"IF(AD21=\"\",\"\",Jugend!I21)","v":0},{"$f":"IF(Jugend!J21=\"\",0,Jugend!J21)","v":0},{"$f":"IF(Jugend!K21=\"\",0,Jugend!K21)","v":0},null,{"$f":"IF(AH21=\"\",\"\",Jugend!M21)","v":0},{"$f":"IF(Jugend!N21=\"\",0,Jugend!N21)","v":0},{"$f":"IF(Jugend!O21=\"\",0,Jugend!O21)","v":0},null,{"$f":"IF(AL21=\"\",\"\",Jugend!Q21)","v":0},{"$f":"IF(Jugend!R21=\"\",0,Jugend!R21)","v":0},{"$f":"IF(Jugend!S21=\"\",0,Jugend!S21)","v":0},null,{"$f":"IF(AR21=\"\",\"\",'Junioren II'!A21)","v":0},{"$f":"IF(AR21=\"\",\"\",'Junioren II'!B21)","v":0},{"$f":"IF(AR21=\"\",\"\",'Junioren II'!C21)","v":0},{"$f":"IF('Junioren II'!D21=\"\",0,'Junioren II'!D21)","v":0},{"$f":"IF('Junioren II'!E21=\"\",0,'Junioren II'!E21)","v":0},null,{"$f":"IF(AX21=\"\",\"\",'Junioren II'!G21)","v":0},{"$f":"IF(AX21=\"\",\"\",'Junioren II'!H21)","v":0},{"$f":"IF(AX21=\"\",\"\",'Junioren II'!I21)","v":0},{"$f":"IF('Junioren II'!J21=\"\",0,'Junioren II'!J21)","v":0},{"$f":"IF('Junioren II'!K21=\"\",0,'Junioren II'!K21)","v":0},null,{"$f":"IF(BB21=\"\",\"\",'Junioren II'!M21)","v":0},{"$f":"IF('Junioren II'!N21=\"\",0,'Junioren II'!N21)","v":0},{"$f":"IF('Junioren II'!O21=\"\",0,'Junioren II'!O21)","v":0},null,{"$f":"IF(BF21=\"\",\"\",'Junioren II'!Q21)","v":0},{"$f":"IF('Junioren II'!R21=\"\",0,'Junioren II'!R21)","v":0},{"$f":"IF('Junioren II'!S21=\"\",0,'Junioren II'!S21)","v":0},null,{"$f":"IF('UK-König'!A21=\"\",\"\",'UK-König'!A21)","v":""},{"$f":"IF('UK-König'!B21=\"\",\"\",'UK-König'!B21)","v":""},{"$f":"IF('UK-König'!C21=\"\",\"\",'UK-König'!C21)","v":""},null,{"$f":"IF(BP21=\"\",\"\",'Junioren I'!A21)","v":0},{"$f":"IF(BP21=\"\",\"\",'Junioren I'!B21)","v":0},{"$f":"IF(BP21=\"\",\"\",'Junioren I'!C21)","v":0},{"$f":"IF('Junioren I'!D21=\"\",0,'Junioren I'!D21)","v":0},{"$f":"IF('Junioren I'!E21=\"\",0,'Junioren I'!E21)","v":0},null,{"$f":"IF(BV21=\"\",\"\",'Junioren I'!G21)","v":0},{"$f":"IF(BV21=\"\",\"\",'Junioren I'!H21)","v":0},{"$f":"IF(BV21=\"\",\"\",'Junioren I'!I21)","v":0},{"$f":"IF('Junioren I'!J21=\"\",0,'Junioren I'!J21)","v":0},{"$f":"IF('Junioren I'!K21=\"\",0,'Junioren I'!K21)","v":0},null,{"$f":"IF(BZ21=\"\",\"\",'Junioren I'!M21)","v":0},{"$f":"IF('Junioren I'!N21=\"\",0,'Junioren I'!N21)","v":0},{"$f":"IF('Junioren I'!O21=\"\",0,'Junioren I'!O21)","v":0},null,{"$f":"IF(CD21=\"\",\"\",'Junioren I'!Q21)","v":0},{"$f":"IF('Junioren I'!R21=\"\",0,'Junioren I'!R21)","v":0},{"$f":"IF('Junioren I'!S21=\"\",0,'Junioren I'!S21)","v":0},null,{"$f":"IF(CJ21=\"\",\"\",Lichtpunkt!A21)","v":0},{"$f":"IF(CJ21=\"\",\"\",Lichtpunkt!B21)","v":0},{"$f":"IF(CJ21=\"\",\"\",Lichtpunkt!C21)","v":0},{"$f":"IF(Lichtpunkt!D21=\"\",0,Lichtpunkt!D21)","v":0},{"$f":"IF(Lichtpunkt!E21=\"\",0,Lichtpunkt!E21)","v":0},null,{"$f":"IF(CP21=\"\",\"\",Lichtpunkt!G21)","v":0},{"$f":"IF(CP21=\"\",\"\",Lichtpunkt!H21)","v":0},{"$f":"IF(CP21=\"\",\"\",Lichtpunkt!I21)","v":0},{"$f":"IF(Lichtpunkt!J21=\"\",0,Lichtpunkt!J21)","v":0},{"$f":"IF(Lichtpunkt!K21=\"\",0,Lichtpunkt!K21)","v":0},null,{"$f":"IF(CT21=\"\",\"\",Lichtpunkt!M21)","v":0},{"$f":"IF(Lichtpunkt!N21=\"\",0,Lichtpunkt!N21)","v":0},{"$f":"IF(Lichtpunkt!O21=\"\",0,Lichtpunkt!O21)","v":0},null,{"$f":"IF(CX21=\"\",\"\",Lichtpunkt!Q21)","v":0},{"$f":"IF(Lichtpunkt!R21=\"\",0,Lichtpunkt!R21)","v":0},{"$f":"IF(Lichtpunkt!S21=\"\",0,Lichtpunkt!S21)","v":0},null,{"$f":"IF('LP-König'!A21=\"\",\"\",'LP-König'!A21)","v":""},{"$f":"IF('LP-König'!B21=\"\",\"\",'LP-König'!B21)","v":""},{"$f":"IF('LP-König'!C21=\"\",\"\",'LP-König'!C21)","v":""}]
[{"$f":"IF(D22=\"\",\"\",Schüler!A22)","v":0},{"$f":"IF(D22=\"\",\"\",Schüler!B22)","v":0},{"$f":"IF(D22=\"\",\"\",Schüler!C22)","v":0},{"$f":"IF(Schüler!D22=\"\",0,Schüler!D22)","v":0},{"$f":"IF(Schüler!E22=\"\",0,Schüler!E22)","v":0},null,{"$f":"IF(J22=\"\",\"\",Schüler!G22)","v":0},{"$f":"IF(J22=\"\",\"\",Schüler!H22)","v":0},{"$f":"IF(J22=\"\",\"\",Schüler!I22)","v":0},{"$f":"IF(Schüler!J22=\"\",0,Schüler!J22)","v":0},{"$f":"IF(Schüler!K22=\"\",0,Schüler!K22)","v":0},null,{"$f":"IF(N22=\"\",\"\",Schüler!M22)","v":0},{"$f":"IF(Schüler!N22=\"\",0,Schüler!N22)","v":0},{"$f":"IF(Schüler!O22=\"\",0,Schüler!O22)","v":0},null,{"$f":"IF(R22=\"\",\"\",Schüler!Q22)","v":0},{"$f":"IF(Schüler!R22=\"\",0,Schüler!R22)","v":0},{"$f":"IF(Schüler!S22=\"\",0,Schüler!S22)","v":0},null,{"$f":"IF(X22=\"\",\"\",Jugend!A22)","v":0},{"$f":"IF(X22=\"\",\"\",Jugend!B22)","v":0},{"$f":"IF(X22=\"\",\"\",Jugend!C22)","v":0},{"$f":"IF(Jugend!D22=\"\",0,Jugend!D22)","v":0},{"$f":"IF(Jugend!E22=\"\",0,Jugend!E22)","v":0},null,{"$f":"IF(AD22=\"\",\"\",Jugend!G22)","v":0},{"$f":"IF(AD22=\"\",\"\",Jugend!H22)","v":0},{"$f":"IF(AD22=\"\",\"\",Jugend!I22)","v":0},{"$f":"IF(Jugend!J22=\"\",0,Jugend!J22)","v":0},{"$f":"IF(Jugend!K22=\"\",0,Jugend!K22)","v":0},null,{"$f":"IF(AH22=\"\",\"\",Jugend!M22)","v":0},{"$f":"IF(Jugend!N22=\"\",0,Jugend!N22)","v":0},{"$f":"IF(Jugend!O22=\"\",0,Jugend!O22)","v":0},null,{"$f":"IF(AL22=\"\",\"\",Jugend!Q22)","v":0},{"$f":"IF(Jugend!R22=\"\",0,Jugend!R22)","v":0},{"$f":"IF(Jugend!S22=\"\",0,Jugend!S22)","v":0},null,{"$f":"IF(AR22=\"\",\"\",'Junioren II'!A22)","v":0},{"$f":"IF(AR22=\"\",\"\",'Junioren II'!B22)","v":0},{"$f":"IF(AR22=\"\",\"\",'Junioren II'!C22)","v":0},{"$f":"IF('Junioren II'!D22=\"\",0,'Junioren II'!D22)","v":0},{"$f":"IF('Junioren II'!E22=\"\",0,'Junioren II'!E22)","v":0},null,{"$f":"IF(AX22=\"\",\"\",'Junioren II'!G22)","v":0},{"$f":"IF(AX22=\"\",\"\",'Junioren II'!H22)","v":0},{"$f":"IF(AX22=\"\",\"\",'Junioren II'!I22)","v":0},{"$f":"IF('Junioren II'!J22=\"\",0,'Junioren II'!J22)","v":0},{"$f":"IF('Junioren II'!K22=\"\",0,'Junioren II'!K22)","v":0},null,{"$f":"IF(BB22=\"\",\"\",'Junioren II'!M22)","v":0},{"$f":"IF('Junioren II'!N22=\"\",0,'Junioren II'!N22)","v":0},{"$f":"IF('Junioren II'!O22=\"\",0,'Junioren II'!O22)","v":0},null,{"$f":"IF(BF22=\"\",\"\",'Junioren II'!Q22)","v":0},{"$f":"IF('Junioren II'!R22=\"\",0,'Junioren II'!R22)","v":0},{"$f":"IF('Junioren II'!S22=\"\",0,'Junioren II'!S22)","v":0},null,{"$f":"IF('UK-König'!A22=\"\",\"\",'UK-König'!A22)","v":""},{"$f":"IF('UK-König'!B22=\"\",\"\",'UK-König'!B22)","v":""},{"$f":"IF('UK-König'!C22=\"\",\"\",'UK-König'!C22)","v":""},null,{"$f":"IF(BP22=\"\",\"\",'Junioren I'!A22)","v":0},{"$f":"IF(BP22=\"\",\"\",'Junioren I'!B22)","v":0},{"$f":"IF(BP22=\"\",\"\",'Junioren I'!C22)","v":0},{"$f":"IF('Junioren I'!D22=\"\",0,'Junioren I'!D22)","v":0},{"$f":"IF('Junioren I'!E22=\"\",0,'Junioren I'!E22)","v":0},null,{"$f":"IF(BV22=\"\",\"\",'Junioren I'!G22)","v":0},{"$f":"IF(BV22=\"\",\"\",'Junioren I'!H22)","v":0},{"$f":"IF(BV22=\"\",\"\",'Junioren I'!I22)","v":0},{"$f":"IF('Junioren I'!J22=\"\",0,'Junioren I'!J22)","v":0},{"$f":"IF('Junioren I'!K22=\"\",0,'Junioren I'!K22)","v":0},null,{"$f":"IF(BZ22=\"\",\"\",'Junioren I'!M22)","v":0},{"$f":"IF('Junioren I'!N22=\"\",0,'Junioren I'!N22)","v":0},{"$f":"IF('Junioren I'!O22=\"\",0,'Junioren I'!O22)","v":0},null,{"$f":"IF(CD22=\"\",\"\",'Junioren I'!Q22)","v":0},{"$f":"IF('Junioren I'!R22=\"\",0,'Junioren I'!R22)","v":0},{"$f":"IF('Junioren I'!S22=\"\",0,'Junioren I'!S22)","v":0},null,{"$f":"IF(CJ22=\"\",\"\",Lichtpunkt!A22)","v":0},{"$f":"IF(CJ22=\"\",\"\",Lichtpunkt!B22)","v":0},{"$f":"IF(CJ22=\"\",\"\",Lichtpunkt!C22)","v":0},{"$f":"IF(Lichtpunkt!D22=\"\",0,Lichtpunkt!D22)","v":0},{"$f":"IF(Lichtpunkt!E22=\"\",0,Lichtpunkt!E22)","v":0},null,{"$f":"IF(CP22=\"\",\"\",Lichtpunkt!G22)","v":0},{"$f":"IF(CP22=\"\",\"\",Lichtpunkt!H22)","v":0},{"$f":"IF(CP22=\"\",\"\",Lichtpunkt!I22)","v":0},{"$f":"IF(Lichtpunkt!J22=\"\",0,Lichtpunkt!J22)","v":0},{"$f":"IF(Lichtpunkt!K22=\"\",0,Lichtpunkt!K22)","v":0},null,{"$f":"IF(CT22=\"\",\"\",Lichtpunkt!M22)","v":0},{"$f":"IF(Lichtpunkt!N22=\"\",0,Lichtpunkt!N22)","v":0},{"$f":"IF(Lichtpunkt!O22=\"\",0,Lichtpunkt!O22)","v":0},null,{"$f":"IF(CX22=\"\",\"\",Lichtpunkt!Q22)","v":0},{"$f":"IF(Lichtpunkt!R22=\"\",0,Lichtpunkt!R22)","v":0},{"$f":"IF(Lichtpunkt!S22=\"\",0,Lichtpunkt!S22)","v":0},null,{"$f":"IF('LP-König'!A22=\"\",\"\",'LP-König'!A22)","v":""},{"$f":"IF('LP-König'!B22=\"\",\"\",'LP-König'!B22)","v":""},{"$f":"IF('LP-König'!C22=\"\",\"\",'LP-König'!C22)","v":""}]
[{"$f":"IF(D23=\"\",\"\",Schüler!A23)","v":0},{"$f":"IF(D23=\"\",\"\",Schüler!B23)","v":0},{"$f":"IF(D23=\"\",\"\",Schüler!C23)","v":0},{"$f":"IF(Schüler!D23=\"\",0,Schüler!D23)","v":0},{"$f":"IF(Schüler!E23=\"\",0,Schüler!E23)","v":0},null,{"$f":"IF(J23=\"\",\"\",Schüler!G23)","v":0},{"$f":"IF(J23=\"\",\"\",Schüler!H23)","v":0},{"$f":"IF(J23=\"\",\"\",Schüler!I23)","v":0},{"$f":"IF(Schüler!J23=\"\",0,Schüler!J23)","v":0},{"$f":"IF(Schüler!K23=\"\",0,Schüler!K23)","v":0},null,{"$f":"IF(N23=\"\",\"\",Schüler!M23)","v":0},{"$f":"IF(Schüler!N23=\"\",0,Schüler!N23)","v":0},{"$f":"IF(Schüler!O23=\"\",0,Schüler!O23)","v":0},null,{"$f":"IF(R23=\"\",\"\",Schüler!Q23)","v":0},{"$f":"IF(Schüler!R23=\"\",0,Schüler!R23)","v":0},{"$f":"IF(Schüler!S23=\"\",0,Schüler!S23)","v":0},null,{"$f":"IF(X23=\"\",\"\",Jugend!A23)","v":0},{"$f":"IF(X23=\"\",\"\",Jugend!B23)","v":0},{"$f":"IF(X23=\"\",\"\",Jugend!C23)","v":0},{"$f":"IF(Jugend!D23=\"\",0,Jugend!D23)","v":0},{"$f":"IF(Jugend!E23=\"\",0,Jugend!E23)","v":0},null,{"$f":"IF(AD23=\"\",\"\",Jugend!G23)","v":0},{"$f":"IF(AD23=\"\",\"\",Jugend!H23)","v":0},{"$f":"IF(AD23=\"\",\"\",Jugend!I23)","v":0},{"$f":"IF(Jugend!J23=\"\",0,Jugend!J23)","v":0},{"$f":"IF(Jugend!K23=\"\",0,Jugend!K23)","v":0},null,{"$f":"IF(AH23=\"\",\"\",Jugend!M23)","v":0},{"$f":"IF(Jugend!N23=\"\",0,Jugend!N23)","v":0},{"$f":"IF(Jugend!O23=\"\",0,Jugend!O23)","v":0},null,{"$f":"IF(AL23=\"\",\"\",Jugend!Q23)","v":0},{"$f":"IF(Jugend!R23=\"\",0,Jugend!R23)","v":0},{"$f":"IF(Jugend!S23=\"\",0,Jugend!S23)","v":0},null,{"$f":"IF(AR23=\"\",\"\",'Junioren II'!A23)","v":0},{"$f":"IF(AR23=\"\",\"\",'Junioren II'!B23)","v":0},{"$f":"IF(AR23=\"\",\"\",'Junioren II'!C23)","v":0},{"$f":"IF('Junioren II'!D23=\"\",0,'Junioren II'!D23)","v":0},{"$f":"IF('Junioren II'!E23=\"\",0,'Junioren II'!E23)","v":0},null,{"$f":"IF(AX23=\"\",\"\",'Junioren II'!G23)","v":0},{"$f":"IF(AX23=\"\",\"\",'Junioren II'!H23)","v":0},{"$f":"IF(AX23=\"\",\"\",'Junioren II'!I23)","v":0},{"$f":"IF('Junioren II'!J23=\"\",0,'Junioren II'!J23)","v":0},{"$f":"IF('Junioren II'!K23=\"\",0,'Junioren II'!K23)","v":0},null,{"$f":"IF(BB23=\"\",\"\",'Junioren II'!M23)","v":0},{"$f":"IF('Junioren II'!N23=\"\",0,'Junioren II'!N23)","v":0},{"$f":"IF('Junioren II'!O23=\"\",0,'Junioren II'!O23)","v":0},null,{"$f":"IF(BF23=\"\",\"\",'Junioren II'!Q23)","v":0},{"$f":"IF('Junioren II'!R23=\"\",0,'Junioren II'!R23)","v":0},{"$f":"IF('Junioren II'!S23=\"\",0,'Junioren II'!S23)","v":0},null,{"$f":"IF('UK-König'!A23=\"\",\"\",'UK-König'!A23)","v":""},{"$f":"IF('UK-König'!B23=\"\",\"\",'UK-König'!B23)","v":""},{"$f":"IF('UK-König'!C23=\"\",\"\",'UK-König'!C23)","v":""},null,{"$f":"IF(BP23=\"\",\"\",'Junioren I'!A23)","v":0},{"$f":"IF(BP23=\"\",\"\",'Junioren I'!B23)","v":0},{"$f":"IF(BP23=\"\",\"\",'Junioren I'!C23)","v":0},{"$f":"IF('Junioren I'!D23=\"\",0,'Junioren I'!D23)","v":0},{"$f":"IF('Junioren I'!E23=\"\",0,'Junioren I'!E23)","v":0},null,{"$f":"IF(BV23=\"\",\"\",'Junioren I'!G23)","v":0},{"$f":"IF(BV23=\"\",\"\",'Junioren I'!H23)","v":0},{"$f":"IF(BV23=\"\",\"\",'Junioren I'!I23)","v":0},{"$f":"IF('Junioren I'!J23=\"\",0,'Junioren I'!J23)","v":0},{"$f":"IF('Junioren I'!K23=\"\",0,'Junioren I'!K23)","v":0},null,{"$f":"IF(BZ23=\"\",\"\",'Junioren I'!M23)","v":0},{"$f":"IF('Junioren I'!N23=\"\",0,'Junioren I'!N23)","v":0},{"$f":"IF('Junioren I'!O23=\"\",0,'Junioren I'!O23)","v":0},null,{"$f":"IF(CD23=\"\",\"\",'Junioren I'!Q23)","v":0},{"$f":"IF('Junioren I'!R23=\"\",0,'Junioren I'!R23)","v":0},{"$f":"IF('Junioren I'!S23=\"\",0,'Junioren I'!S23)","v":0},null,{"$f":"IF(CJ23=\"\",\"\",Lichtpunkt!A23)","v":0},{"$f":"IF(CJ23=\"\",\"\",Lichtpunkt!B23)","v":0},{"$f":"IF(CJ23=\"\",\"\",Lichtpunkt!C23)","v":0},{"$f":"IF(Lichtpunkt!D23=\"\",0,Lichtpunkt!D23)","v":0},{"$f":"IF(Lichtpunkt!E23=\"\",0,Lichtpunkt!E23)","v":0},null,{"$f":"IF(CP23=\"\",\"\",Lichtpunkt!G23)","v":0},{"$f":"IF(CP23=\"\",\"\",Lichtpunkt!H23)","v":0},{"$f":"IF(CP23=\"\",\"\",Lichtpunkt!I23)","v":0},{"$f":"IF(Lichtpunkt!J23=\"\",0,Lichtpunkt!J23)","v":0},{"$f":"IF(Lichtpunkt!K23=\"\",0,Lichtpunkt!K23)","v":0},null,{"$f":"IF(CT23=\"\",\"\",Lichtpunkt!M23)","v":0},{"$f":"IF(Lichtpunkt!N23=\"\",0,Lichtpunkt!N23)","v":0},{"$f":"IF(Lichtpunkt!O23=\"\",0,Lichtpunkt!O23)","v":0},null,{"$f":"IF(CX23=\"\",\"\",Lichtpunkt!Q23)","v":0},{"$f":"IF(Lichtpunkt!R23=\"\",0,Lichtpunkt!R23)","v":0},{"$f":"IF(Lichtpunkt!S23=\"\",0,Lichtpunkt!S23)","v":0},null,{"$f":"IF('LP-König'!A23=\"\",\"\",'LP-König'!A23)","v":""},{"$f":"IF('LP-König'!B23=\"\",\"\",'LP-König'!B23)","v":""},{"$f":"IF('LP-König'!C23=\"\",\"\",'LP-König'!C23)","v":""}]
[{"$f":"IF(D24=\"\",\"\",Schüler!A24)","v":0},{"$f":"IF(D24=\"\",\"\",Schüler!B24)","v":0},{"$f":"IF(D24=\"\",\"\",Schüler!C24)","v":0},{"$f":"IF(Schüler!D24=\"\",0,Schüler!D24)","v":0},{"$f":"IF(Schüler!E24=\"\",0,Schüler!E24)","v":0},null,{"$f":"IF(J24=\"\",\"\",Schüler!G24)","v":0},{"$f":"IF(J24=\"\",\"\",Schüler!H24)","v":0},{"$f":"IF(J24=\"\",\"\",Schüler!I24)","v":0},{"$f":"IF(Schüler!J24=\"\",0,Schüler!J24)","v":0},{"$f":"IF(Schüler!K24=\"\",0,Schüler!K24)","v":0},null,{"$f":"IF(N24=\"\",\"\",Schüler!M24)","v":0},{"$f":"IF(Schüler!N24=\"\",0,Schüler!N24)","v":0},{"$f":"IF(Schüler!O24=\"\",0,Schüler!O24)","v":0},null,{"$f":"IF(R24=\"\",\"\",Schüler!Q24)","v":0},{"$f":"IF(Schüler!R24=\"\",0,Schüler!R24)","v":0},{"$f":"IF(Schüler!S24=\"\",0,Schüler!S24)","v":0},null,{"$f":"IF(X24=\"\",\"\",Jugend!A24)","v":0},{"$f":"IF(X24=\"\",\"\",Jugend!B24)","v":0},{"$f":"IF(X24=\"\",\"\",Jugend!C24)","v":0},{"$f":"IF(Jugend!D24=\"\",0,Jugend!D24)","v":0},{"$f":"IF(Jugend!E24=\"\",0,Jugend!E24)","v":0},null,{"$f":"IF(AD24=\"\",\"\",Jugend!G24)","v":0},{"$f":"IF(AD24=\"\",\"\",Jugend!H24)","v":0},{"$f":"IF(AD24=\"\",\"\",Jugend!I24)","v":0},{"$f":"IF(Jugend!J24=\"\",0,Jugend!J24)","v":0},{"$f":"IF(Jugend!K24=\"\",0,Jugend!K24)","v":0},null,{"$f":"IF(AH24=\"\",\"\",Jugend!M24)","v":0},{"$f":"IF(Jugend!N24=\"\",0,Jugend!N24)","v":0},{"$f":"IF(Jugend!O24=\"\",0,Jugend!O24)","v":0},null,{"$f":"IF(AL24=\"\",\"\",Jugend!Q24)","v":0},{"$f":"IF(Jugend!R24=\"\",0,Jugend!R24)","v":0},{"$f":"IF(Jugend!S24=\"\",0,Jugend!S24)","v":0},null,{"$f":"IF(AR24=\"\",\"\",'Junioren II'!A24)","v":0},{"$f":"IF(AR24=\"\",\"\",'Junioren II'!B24)","v":0},{"$f":"IF(AR24=\"\",\"\",'Junioren II'!C24)","v":0},{"$f":"IF('Junioren II'!D24=\"\",0,'Junioren II'!D24)","v":0},{"$f":"IF('Junioren II'!E24=\"\",0,'Junioren II'!E24)","v":0},null,{"$f":"IF(AX24=\"\",\"\",'Junioren II'!G24)","v":0},{"$f":"IF(AX24=\"\",\"\",'Junioren II'!H24)","v":0},{"$f":"IF(AX24=\"\",\"\",'Junioren II'!I24)","v":0},{"$f":"IF('Junioren II'!J24=\"\",0,'Junioren II'!J24)","v":0},{"$f":"IF('Junioren II'!K24=\"\",0,'Junioren II'!K24)","v":0},null,{"$f":"IF(BB24=\"\",\"\",'Junioren II'!M24)","v":0},{"$f":"IF('Junioren II'!N24=\"\",0,'Junioren II'!N24)","v":0},{"$f":"IF('Junioren II'!O24=\"\",0,'Junioren II'!O24)","v":0},null,{"$f":"IF(BF24=\"\",\"\",'Junioren II'!Q24)","v":0},{"$f":"IF('Junioren II'!R24=\"\",0,'Junioren II'!R24)","v":0},{"$f":"IF('Junioren II'!S24=\"\",0,'Junioren II'!S24)","v":0},null,{"$f":"IF('UK-König'!A24=\"\",\"\",'UK-König'!A24)","v":""},{"$f":"IF('UK-König'!B24=\"\",\"\",'UK-König'!B24)","v":""},{"$f":"IF('UK-König'!C24=\"\",\"\",'UK-König'!C24)","v":""},null,{"$f":"IF(BP24=\"\",\"\",'Junioren I'!A24)","v":0},{"$f":"IF(BP24=\"\",\"\",'Junioren I'!B24)","v":0},{"$f":"IF(BP24=\"\",\"\",'Junioren I'!C24)","v":0},{"$f":"IF('Junioren I'!D24=\"\",0,'Junioren I'!D24)","v":0},{"$f":"IF('Junioren I'!E24=\"\",0,'Junioren I'!E24)","v":0},null,{"$f":"IF(BV24=\"\",\"\",'Junioren I'!G24)","v":0},{"$f":"IF(BV24=\"\",\"\",'Junioren I'!H24)","v":0},{"$f":"IF(BV24=\"\",\"\",'Junioren I'!I24)","v":0},{"$f":"IF('Junioren I'!J24=\"\",0,'Junioren I'!J24)","v":0},{"$f":"IF('Junioren I'!K24=\"\",0,'Junioren I'!K24)","v":0},null,{"$f":"IF(BZ24=\"\",\"\",'Junioren I'!M24)","v":0},{"$f":"IF('Junioren I'!N24=\"\",0,'Junioren I'!N24)","v":0},{"$f":"IF('Junioren I'!O24=\"\",0,'Junioren I'!O24)","v":0},null,{"$f":"IF(CD24=\"\",\"\",'Junioren I'!Q24)","v":0},{"$f":"IF('Junioren I'!R24=\"\",0,'Junioren I'!R24)","v":0},{"$f":"IF('Junioren I'!S24=\"\",0,'Junioren I'!S24)","v":0},null,{"$f":"IF(CJ24=\"\",\"\",Lichtpunkt!A24)","v":0},{"$f":"IF(CJ24=\"\",\"\",Lichtpunkt!B24)","v":0},{"$f":"IF(CJ24=\"\",\"\",Lichtpunkt!C24)","v":0},{"$f":"IF(Lichtpunkt!D24=\"\",0,Lichtpunkt!D24)","v":0},{"$f":"IF(Lichtpunkt!E24=\"\",0,Lichtpunkt!E24)","v":0},null,{"$f":"IF(CP24=\"\",\"\",Lichtpunkt!G24)","v":0},{"$f":"IF(CP24=\"\",\"\",Lichtpunkt!H24)","v":0},{"$f":"IF(CP24=\"\",\"\",Lichtpunkt!I24)","v":0},{"$f":"IF(Lichtpunkt!J24=\"\",0,Lichtpunkt!J24)","v":0},{"$f":"IF(Lichtpunkt!K24=\"\",0,Lichtpunkt!K24)","v":0},null,{"$f":"IF(CT24=\"\",\"\",Lichtpunkt!M24)","v":0},{"$f":"IF(Lichtpunkt!N24=\"\",0,Lichtpunkt!N24)","v":0},{"$f":"IF(Lichtpunkt!O24=\"\",0,Lichtpunkt!O24)","v":0},null,{"$f":"IF(CX24=\"\",\"\",Lichtpunkt!Q24)","v":0},{"$f":"IF(Lichtpunkt!R24=\"\",0,Lichtpunkt!R24)","v":0},{"$f":"IF(Lichtpunkt!S24=\"\",0,Lichtpunkt!S24)","v":0},null,{"$f":"IF('LP-König'!A24=\"\",\"\",'LP-König'!A24)","v":""},{"$f":"IF('LP-König'!B24=\"\",\"\",'LP-König'!B24)","v":""},{"$f":"IF('LP-König'!C24=\"\",\"\",'LP-König'!C24)","v":""}]
[{"$f":"IF(D25=\"\",\"\",Schüler!A25)","v":0},{"$f":"IF(D25=\"\",\"\",Schüler!B25)","v":0},{"$f":"IF(D25=\"\",\"\",Schüler!C25)","v":0},{"$f":"IF(Schüler!D25=\"\",0,Schüler!D25)","v":0},{"$f":"IF(Schüler!E25=\"\",0,Schüler!E25)","v":0},null,{"$f":"IF(J25=\"\",\"\",Schüler!G25)","v":0},{"$f":"IF(J25=\"\",\"\",Schüler!H25)","v":0},{"$f":"IF(J25=\"\",\"\",Schüler!I25)","v":0},{"$f":"IF(Schüler!J25=\"\",0,Schüler!J25)","v":0},{"$f":"IF(Schüler!K25=\"\",0,Schüler!K25)","v":0},null,{"$f":"IF(N25=\"\",\"\",Schüler!M25)","v":0},{"$f":"IF(Schüler!N25=\"\",0,Schüler!N25)","v":0},{"$f":"IF(Schüler!O25=\"\",0,Schüler!O25)","v":0},null,{"$f":"IF(R25=\"\",\"\",Schüler!Q25)","v":0},{"$f":"IF(Schüler!R25=\"\",0,Schüler!R25)","v":0},{"$f":"IF(Schüler!S25=\"\",0,Schüler!S25)","v":0},null,{"$f":"IF(X25=\"\",\"\",Jugend!A25)","v":0},{"$f":"IF(X25=\"\",\"\",Jugend!B25)","v":0},{"$f":"IF(X25=\"\",\"\",Jugend!C25)","v":0},{"$f":"IF(Jugend!D25=\"\",0,Jugend!D25)","v":0},{"$f":"IF(Jugend!E25=\"\",0,Jugend!E25)","v":0},null,{"$f":"IF(AD25=\"\",\"\",Jugend!G25)","v":0},{"$f":"IF(AD25=\"\",\"\",Jugend!H25)","v":0},{"$f":"IF(AD25=\"\",\"\",Jugend!I25)","v":0},{"$f":"IF(Jugend!J25=\"\",0,Jugend!J25)","v":0},{"$f":"IF(Jugend!K25=\"\",0,Jugend!K25)","v":0},null,{"$f":"IF(AH25=\"\",\"\",Jugend!M25)","v":0},{"$f":"IF(Jugend!N25=\"\",0,Jugend!N25)","v":0},{"$f":"IF(Jugend!O25=\"\",0,Jugend!O25)","v":0},null,{"$f":"IF(AL25=\"\",\"\",Jugend!Q25)","v":0},{"$f":"IF(Jugend!R25=\"\",0,Jugend!R25)","v":0},{"$f":"IF(Jugend!S25=\"\",0,Jugend!S25)","v":0},null,{"$f":"IF(AR25=\"\",\"\",'Junioren II'!A25)","v":0},{"$f":"IF(AR25=\"\",\"\",'Junioren II'!B25)","v":0},{"$f":"IF(AR25=\"\",\"\",'Junioren II'!C25)","v":0},{"$f":"IF('Junioren II'!D25=\"\",0,'Junioren II'!D25)","v":0},{"$f":"IF('Junioren II'!E25=\"\",0,'Junioren II'!E25)","v":0},null,{"$f":"IF(AX25=\"\",\"\",'Junioren II'!G25)","v":0},{"$f":"IF(AX25=\"\",\"\",'Junioren II'!H25)","v":0},{"$f":"IF(AX25=\"\",\"\",'Junioren II'!I25)","v":0},{"$f":"IF('Junioren II'!J25=\"\",0,'Junioren II'!J25)","v":0},{"$f":"IF('Junioren II'!K25=\"\",0,'Junioren II'!K25)","v":0},null,{"$f":"IF(BB25=\"\",\"\",'Junioren II'!M25)","v":0},{"$f":"IF('Junioren II'!N25=\"\",0,'Junioren II'!N25)","v":0},{"$f":"IF('Junioren II'!O25=\"\",0,'Junioren II'!O25)","v":0},null,{"$f":"IF(BF25=\"\",\"\",'Junioren II'!Q25)","v":0},{"$f":"IF('Junioren II'!R25=\"\",0,'Junioren II'!R25)","v":0},{"$f":"IF('Junioren II'!S25=\"\",0,'Junioren II'!S25)","v":0},null,{"$f":"IF('UK-König'!A25=\"\",\"\",'UK-König'!A25)","v":""},{"$f":"IF('UK-König'!B25=\"\",\"\",'UK-König'!B25)","v":""},{"$f":"IF('UK-König'!C25=\"\",\"\",'UK-König'!C25)","v":""},null,{"$f":"IF(BP25=\"\",\"\",'Junioren I'!A25)","v":0},{"$f":"IF(BP25=\"\",\"\",'Junioren I'!B25)","v":0},{"$f":"IF(BP25=\"\",\"\",'Junioren I'!C25)","v":0},{"$f":"IF('Junioren I'!D25=\"\",0,'Junioren I'!D25)","v":0},{"$f":"IF('Junioren I'!E25=\"\",0,'Junioren I'!E25)","v":0},null,{"$f":"IF(BV25=\"\",\"\",'Junioren I'!G25)","v":0},{"$f":"IF(BV25=\"\",\"\",'Junioren I'!H25)","v":0},{"$f":"IF(BV25=\"\",\"\",'Junioren I'!I25)","v":0},{"$f":"IF('Junioren I'!J25=\"\",0,'Junioren I'!J25)","v":0},{"$f":"IF('Junioren I'!K25=\"\",0,'Junioren I'!K25)","v":0},null,{"$f":"IF(BZ25=\"\",\"\",'Junioren I'!M25)","v":0},{"$f":"IF('Junioren I'!N25=\"\",0,'Junioren I'!N25)","v":0},{"$f":"IF('Junioren I'!O25=\"\",0,'Junioren I'!O25)","v":0},null,{"$f":"IF(CD25=\"\",\"\",'Junioren I'!Q25)","v":0},{"$f":"IF('Junioren I'!R25=\"\",0,'Junioren I'!R25)","v":0},{"$f":"IF('Junioren I'!S25=\"\",0,'Junioren I'!S25)","v":0},null,{"$f":"IF(CJ25=\"\",\"\",Lichtpunkt!A25)","v":0},{"$f":"IF(CJ25=\"\",\"\",Lichtpunkt!B25)","v":0},{"$f":"IF(CJ25=\"\",\"\",Lichtpunkt!C25)","v":0},{"$f":"IF(Lichtpunkt!D25=\"\",0,Lichtpunkt!D25)","v":0},{"$f":"IF(Lichtpunkt!E25=\"\",0,Lichtpunkt!E25)","v":0},null,{"$f":"IF(CP25=\"\",\"\",Lichtpunkt!G25)","v":0},{"$f":"IF(CP25=\"\",\"\",Lichtpunkt!H25)","v":0},{"$f":"IF(CP25=\"\",\"\",Lichtpunkt!I25)","v":0},{"$f":"IF(Lichtpunkt!J25=\"\",0,Lichtpunkt!J25)","v":0},{"$f":"IF(Lichtpunkt!K25=\"\",0,Lichtpunkt!K25)","v":0},null,{"$f":"IF(CT25=\"\",\"\",Lichtpunkt!M25)","v":0},{"$f":"IF(Lichtpunkt!N25=\"\",0,Lichtpunkt!N25)","v":0},{"$f":"IF(Lichtpunkt!O25=\"\",0,Lichtpunkt!O25)","v":0},null,{"$f":"IF(CX25=\"\",\"\",Lichtpunkt!Q25)","v":0},{"$f":"IF(Lichtpunkt!R25=\"\",0,Lichtpunkt!R25)","v":0},{"$f":"IF(Lichtpunkt!S25=\"\",0,Lichtpunkt!S25)","v":0},null,{"$f":"IF('LP-König'!A25=\"\",\"\",'LP-König'!A25)","v":""},{"$f":"IF('LP-König'!B25=\"\",\"\",'LP-König'!B25)","v":""},{"$f":"IF('LP-König'!C25=\"\",\"\",'LP-König'!C25)","v":""}]
[{"$f":"IF(D26=\"\",\"\",Schüler!A26)","v":0},{"$f":"IF(D26=\"\",\"\",Schüler!B26)","v":0},{"$f":"IF(D26=\"\",\"\",Schüler!C26)","v":0},{"$f":"IF(Schüler!D26=\"\",0,Schüler!D26)","v":0},{"$f":"IF(Schüler!E26=\"\",0,Schüler!E26)","v":0},null,{"$f":"IF(J26=\"\",\"\",Schüler!G26)","v":0},{"$f":"IF(J26=\"\",\"\",Schüler!H26)","v":0},{"$f":"IF(J26=\"\",\"\",Schüler!I26)","v":0},{"$f":"IF(Schüler!J26=\"\",0,Schüler!J26)","v":0},{"$f":"IF(Schüler!K26=\"\",0,Schüler!K26)","v":0},null,{"$f":"IF(N26=\"\",\"\",Schüler!M26)","v":0},{"$f":"IF(Schüler!N26=\"\",0,Schüler!N26)","v":0},{"$f":"IF(Schüler!O26=\"\",0,Schüler!O26)","v":0},null,{"$f":"IF(R26=\"\",\"\",Schüler!Q26)","v":0},{"$f":"IF(Schüler!R26=\"\",0,Schüler!R26)","v":0},{"$f":"IF(Schüler!S26=\"\",0,Schüler!S26)","v":0},null,{"$f":"IF(X26=\"\",\"\",Jugend!A26)","v":0},{"$f":"IF(X26=\"\",\"\",Jugend!B26)","v":0},{"$f":"IF(X26=\"\",\"\",Jugend!C26)","v":0},{"$f":"IF(Jugend!D26=\"\",0,Jugend!D26)","v":0},{"$f":"IF(Jugend!E26=\"\",0,Jugend!E26)","v":0},null,{"$f":"IF(AD26=\"\",\"\",Jugend!G26)","v":0},{"$f":"IF(AD26=\"\",\"\",Jugend!H26)","v":0},{"$f":"IF(AD26=\"\",\"\",Jugend!I26)","v":0},{"$f":"IF(Jugend!J26=\"\",0,Jugend!J26)","v":0},{"$f":"IF(Jugend!K26=\"\",0,Jugend!K26)","v":0},null,{"$f":"IF(AH26=\"\",\"\",Jugend!M26)","v":0},{"$f":"IF(Jugend!N26=\"\",0,Jugend!N26)","v":0},{"$f":"IF(Jugend!O26=\"\",0,Jugend!O26)","v":0},null,{"$f":"IF(AL26=\"\",\"\",Jugend!Q26)","v":0},{"$f":"IF(Jugend!R26=\"\",0,Jugend!R26)","v":0},{"$f":"IF(Jugend!S26=\"\",0,Jugend!S26)","v":0},null,{"$f":"IF(AR26=\"\",\"\",'Junioren II'!A26)","v":0},{"$f":"IF(AR26=\"\",\"\",'Junioren II'!B26)","v":0},{"$f":"IF(AR26=\"\",\"\",'Junioren II'!C26)","v":0},{"$f":"IF('Junioren II'!D26=\"\",0,'Junioren II'!D26)","v":0},{"$f":"IF('Junioren II'!E26=\"\",0,'Junioren II'!E26)","v":0},null,{"$f":"IF(AX26=\"\",\"\",'Junioren II'!G26)","v":0},{"$f":"IF(AX26=\"\",\"\",'Junioren II'!H26)","v":0},{"$f":"IF(AX26=\"\",\"\",'Junioren II'!I26)","v":0},{"$f":"IF('Junioren II'!J26=\"\",0,'Junioren II'!J26)","v":0},{"$f":"IF('Junioren II'!K26=\"\",0,'Junioren II'!K26)","v":0},null,{"$f":"IF(BB26=\"\",\"\",'Junioren II'!M26)","v":0},{"$f":"IF('Junioren II'!N26=\"\",0,'Junioren II'!N26)","v":0},{"$f":"IF('Junioren II'!O26=\"\",0,'Junioren II'!O26)","v":0},null,{"$f":"IF(BF26=\"\",\"\",'Junioren II'!Q26)","v":0},{"$f":"IF('Junioren II'!R26=\"\",0,'Junioren II'!R26)","v":0},{"$f":"IF('Junioren II'!S26=\"\",0,'Junioren II'!S26)","v":0},null,{"$f":"IF('UK-König'!A26=\"\",\"\",'UK-König'!A26)","v":""},{"$f":"IF('UK-König'!B26=\"\",\"\",'UK-König'!B26)","v":""},{"$f":"IF('UK-König'!C26=\"\",\"\",'UK-König'!C26)","v":""},null,{"$f":"IF(BP26=\"\",\"\",'Junioren I'!A26)","v":0},{"$f":"IF(BP26=\"\",\"\",'Junioren I'!B26)","v":0},{"$f":"IF(BP26=\"\",\"\",'Junioren I'!C26)","v":0},{"$f":"IF('Junioren I'!D26=\"\",0,'Junioren I'!D26)","v":0},{"$f":"IF('Junioren I'!E26=\"\",0,'Junioren I'!E26)","v":0},null,{"$f":"IF(BV26=\"\",\"\",'Junioren I'!G26)","v":0},{"$f":"IF(BV26=\"\",\"\",'Junioren I'!H26)","v":0},{"$f":"IF(BV26=\"\",\"\",'Junioren I'!I26)","v":0},{"$f":"IF('Junioren I'!J26=\"\",0,'Junioren I'!J26)","v":0},{"$f":"IF('Junioren I'!K26=\"\",0,'Junioren I'!K26)","v":0},null,{"$f":"IF(BZ26=\"\",\"\",'Junioren I'!M26)","v":0},{"$f":"IF('Junioren I'!N26=\"\",0,'Junioren I'!N26)","v":0},{"$f":"IF('Junioren I'!O26=\"\",0,'Junioren I'!O26)","v":0},null,{"$f":"IF(CD26=\"\",\"\",'Junioren I'!Q26)","v":0},{"$f":"IF('Junioren I'!R26=\"\",0,'Junioren I'!R26)","v":0},{"$f":"IF('Junioren I'!S26=\"\",0,'Junioren I'!S26)","v":0},null,{"$f":"IF(CJ26=\"\",\"\",Lichtpunkt!A26)","v":0},{"$f":"IF(CJ26=\"\",\"\",Lichtpunkt!B26)","v":0},{"$f":"IF(CJ26=\"\",\"\",Lichtpunkt!C26)","v":0},{"$f":"IF(Lichtpunkt!D26=\"\",0,Lichtpunkt!D26)","v":0},{"$f":"IF(Lichtpunkt!E26=\"\",0,Lichtpunkt!E26)","v":0},null,{"$f":"IF(CP26=\"\",\"\",Lichtpunkt!G26)","v":0},{"$f":"IF(CP26=\"\",\"\",Lichtpunkt!H26)","v":0},{"$f":"IF(CP26=\"\",\"\",Lichtpunkt!I26)","v":0},{"$f":"IF(Lichtpunkt!J26=\"\",0,Lichtpunkt!J26)","v":0},{"$f":"IF(Lichtpunkt!K26=\"\",0,Lichtpunkt!K26)","v":0},null,{"$f":"IF(CT26=\"\",\"\",Lichtpunkt!M26)","v":0},{"$f":"IF(Lichtpunkt!N26=\"\",0,Lichtpunkt!N26)","v":0},{"$f":"IF(Lichtpunkt!O26=\"\",0,Lichtpunkt!O26)","v":0},null,{"$f":"IF(CX26=\"\",\"\",Lichtpunkt!Q26)","v":0},{"$f":"IF(Lichtpunkt!R26=\"\",0,Lichtpunkt!R26)","v":0},{"$f":"IF(Lichtpunkt!S26=\"\",0,Lichtpunkt!S26)","v":0},null,{"$f":"IF('LP-König'!A26=\"\",\"\",'LP-König'!A26)","v":""},{"$f":"IF('LP-König'!B26=\"\",\"\",'LP-König'!B26)","v":""},{"$f":"IF('LP-König'!C26=\"\",\"\",'LP-König'!C26)","v":""}]
[{"$f":"IF(D27=\"\",\"\",Schüler!A27)","v":0},{"$f":"IF(D27=\"\",\"\",Schüler!B27)","v":0},{"$f":"IF(D27=\"\",\"\",Schüler!C27)","v":0},{"$f":"IF(Schüler!D27=\"\",0,Schüler!D27)","v":0},{"$f":"IF(Schüler!E27=\"\",0,Schüler!E27)","v":0},null,{"$f":"IF(J27=\"\",\"\",Schüler!G27)","v":0},{"$f":"IF(J27=\"\",\"\",Schüler!H27)","v":0},{"$f":"IF(J27=\"\",\"\",Schüler!I27)","v":0},{"$f":"IF(Schüler!J27=\"\",0,Schüler!J27)","v":0},{"$f":"IF(Schüler!K27=\"\",0,Schüler!K27)","v":0},null,{"$f":"IF(N27=\"\",\"\",Schüler!M27)","v":0},{"$f":"IF(Schüler!N27=\"\",0,Schüler!N27)","v":0},{"$f":"IF(Schüler!O27=\"\",0,Schüler!O27)","v":0},null,{"$f":"IF(R27=\"\",\"\",Schüler!Q27)","v":0},{"$f":"IF(Schüler!R27=\"\",0,Schüler!R27)","v":0},{"$f":"IF(Schüler!S27=\"\",0,Schüler!S27)","v":0},null,{"$f":"IF(X27=\"\",\"\",Jugend!A27)","v":0},{"$f":"IF(X27=\"\",\"\",Jugend!B27)","v":0},{"$f":"IF(X27=\"\",\"\",Jugend!C27)","v":0},{"$f":"IF(Jugend!D27=\"\",0,Jugend!D27)","v":0},{"$f":"IF(Jugend!E27=\"\",0,Jugend!E27)","v":0},null,{"$f":"IF(AD27=\"\",\"\",Jugend!G27)","v":0},{"$f":"IF(AD27=\"\",\"\",Jugend!H27)","v":0},{"$f":"IF(AD27=\"\",\"\",Jugend!I27)","v":0},{"$f":"IF(Jugend!J27=\"\",0,Jugend!J27)","v":0},{"$f":"IF(Jugend!K27=\"\",0,Jugend!K27)","v":0},null,{"$f":"IF(AH27=\"\",\"\",Jugend!M27)","v":0},{"$f":"IF(Jugend!N27=\"\",0,Jugend!N27)","v":0},{"$f":"IF(Jugend!O27=\"\",0,Jugend!O27)","v":0},null,{"$f":"IF(AL27=\"\",\"\",Jugend!Q27)","v":0},{"$f":"IF(Jugend!R27=\"\",0,Jugend!R27)","v":0},{"$f":"IF(Jugend!S27=\"\",0,Jugend!S27)","v":0},null,{"$f":"IF(AR27=\"\",\"\",'Junioren II'!A27)","v":0},{"$f":"IF(AR27=\"\",\"\",'Junioren II'!B27)","v":0},{"$f":"IF(AR27=\"\",\"\",'Junioren II'!C27)","v":0},{"$f":"IF('Junioren II'!D27=\"\",0,'Junioren II'!D27)","v":0},{"$f":"IF('Junioren II'!E27=\"\",0,'Junioren II'!E27)","v":0},null,{"$f":"IF(AX27=\"\",\"\",'Junioren II'!G27)","v":0},{"$f":"IF(AX27=\"\",\"\",'Junioren II'!H27)","v":0},{"$f":"IF(AX27=\"\",\"\",'Junioren II'!I27)","v":0},{"$f":"IF('Junioren II'!J27=\"\",0,'Junioren II'!J27)","v":0},{"$f":"IF('Junioren II'!K27=\"\",0,'Junioren II'!K27)","v":0},null,{"$f":"IF(BB27=\"\",\"\",'Junioren II'!M27)","v":0},{"$f":"IF('Junioren II'!N27=\"\",0,'Junioren II'!N27)","v":0},{"$f":"IF('Junioren II'!O27=\"\",0,'Junioren II'!O27)","v":0},null,{"$f":"IF(BF27=\"\",\"\",'Junioren II'!Q27)","v":0},{"$f":"IF('Junioren II'!R27=\"\",0,'Junioren II'!R27)","v":0},{"$f":"IF('Junioren II'!S27=\"\",0,'Junioren II'!S27)","v":0},null,{"$f":"IF('UK-König'!A27=\"\",\"\",'UK-König'!A27)","v":""},{"$f":"IF('UK-König'!B27=\"\",\"\",'UK-König'!B27)","v":""},{"$f":"IF('UK-König'!C27=\"\",\"\",'UK-König'!C27)","v":""},null,{"$f":"IF(BP27=\"\",\"\",'Junioren I'!A27)","v":0},{"$f":"IF(BP27=\"\",\"\",'Junioren I'!B27)","v":0},{"$f":"IF(BP27=\"\",\"\",'Junioren I'!C27)","v":0},{"$f":"IF('Junioren I'!D27=\"\",0,'Junioren I'!D27)","v":0},{"$f":"IF('Junioren I'!E27=\"\",0,'Junioren I'!E27)","v":0},null,{"$f":"IF(BV27=\"\",\"\",'Junioren I'!G27)","v":0},{"$f":"IF(BV27=\"\",\"\",'Junioren I'!H27)","v":0},{"$f":"IF(BV27=\"\",\"\",'Junioren I'!I27)","v":0},{"$f":"IF('Junioren I'!J27=\"\",0,'Junioren I'!J27)","v":0},{"$f":"IF('Junioren I'!K27=\"\",0,'Junioren I'!K27)","v":0},null,{"$f":"IF(BZ27=\"\",\"\",'Junioren I'!M27)","v":0},{"$f":"IF('Junioren I'!N27=\"\",0,'Junioren I'!N27)","v":0},{"$f":"IF('Junioren I'!O27=\"\",0,'Junioren I'!O27)","v":0},null,{"$f":"IF(CD27=\"\",\"\",'Junioren I'!Q27)","v":0},{"$f":"IF('Junioren I'!R27=\"\",0,'Junioren I'!R27)","v":0},{"$f":"IF('Junioren I'!S27=\"\",0,'Junioren I'!S27)","v":0},null,{"$f":"IF(CJ27=\"\",\"\",Lichtpunkt!A27)","v":0},{"$f":"IF(CJ27=\"\",\"\",Lichtpunkt!B27)","v":0},{"$f":"IF(CJ27=\"\",\"\",Lichtpunkt!C27)","v":0},{"$f":"IF(Lichtpunkt!D27=\"\",0,Lichtpunkt!D27)","v":0},{"$f":"IF(Lichtpunkt!E27=\"\",0,Lichtpunkt!E27)","v":0},null,{"$f":"IF(CP27=\"\",\"\",Lichtpunkt!G27)","v":0},{"$f":"IF(CP27=\"\",\"\",Lichtpunkt!H27)","v":0},{"$f":"IF(CP27=\"\",\"\",Lichtpunkt!I27)","v":0},{"$f":"IF(Lichtpunkt!J27=\"\",0,Lichtpunkt!J27)","v":0},{"$f":"IF(Lichtpunkt!K27=\"\",0,Lichtpunkt!K27)","v":0},null,{"$f":"IF(CT27=\"\",\"\",Lichtpunkt!M27)","v":0},{"$f":"IF(Lichtpunkt!N27=\"\",0,Lichtpunkt!N27)","v":0},{"$f":"IF(Lichtpunkt!O27=\"\",0,Lichtpunkt!O27)","v":0},null,{"$f":"IF(CX27=\"\",\"\",Lichtpunkt!Q27)","v":0},{"$f":"IF(Lichtpunkt!R27=\"\",0,Lichtpunkt!R27)","v":0},{"$f":"IF(Lichtpunkt!S27=\"\",0,Lichtpunkt!S27)","v":0},null,{"$f":"IF('LP-König'!A27=\"\",\"\",'LP-König'!A27)","v":""},{"$f":"IF('LP-König'!B27=\"\",\"\",'LP-König'!B27)","v":""},{"$f":"IF('LP-König'!C27=\"\",\"\",'LP-König'!C27)","v":""}]
[{"$f":"IF(D28=\"\",\"\",Schüler!A28)","v":0},{"$f":"IF(D28=\"\",\"\",Schüler!B28)","v":0},{"$f":"IF(D28=\"\",\"\",Schüler!C28)","v":0},{"$f":"IF(Schüler!D28=\"\",0,Schüler!D28)","v":0},{"$f":"IF(Schüler!E28=\"\",0,Schüler!E28)","v":0},null,{"$f":"IF(J28=\"\",\"\",Schüler!G28)","v":0},{"$f":"IF(J28=\"\",\"\",Schüler!H28)","v":0},{"$f":"IF(J28=\"\",\"\",Schüler!I28)","v":0},{"$f":"IF(Schüler!J28=\"\",0,Schüler!J28)","v":0},{"$f":"IF(Schüler!K28=\"\",0,Schüler!K28)","v":0},null,{"$f":"IF(N28=\"\",\"\",Schüler!M28)","v":0},{"$f":"IF(Schüler!N28=\"\",0,Schüler!N28)","v":0},{"$f":"IF(Schüler!O28=\"\",0,Schüler!O28)","v":0},null,{"$f":"IF(R28=\"\",\"\",Schüler!Q28)","v":0},{"$f":"IF(Schüler!R28=\"\",0,Schüler!R28)","v":0},{"$f":"IF(Schüler!S28=\"\",0,Schüler!S28)","v":0},null,{"$f":"IF(X28=\"\",\"\",Jugend!A28)","v":0},{"$f":"IF(X28=\"\",\"\",Jugend!B28)","v":0},{"$f":"IF(X28=\"\",\"\",Jugend!C28)","v":0},{"$f":"IF(Jugend!D28=\"\",0,Jugend!D28)","v":0},{"$f":"IF(Jugend!E28=\"\",0,Jugend!E28)","v":0},null,{"$f":"IF(AD28=\"\",\"\",Jugend!G28)","v":0},{"$f":"IF(AD28=\"\",\"\",Jugend!H28)","v":0},{"$f":"IF(AD28=\"\",\"\",Jugend!I28)","v":0},{"$f":"IF(Jugend!J28=\"\",0,Jugend!J28)","v":0},{"$f":"IF(Jugend!K28=\"\",0,Jugend!K28)","v":0},null,{"$f":"IF(AH28=\"\",\"\",Jugend!M28)","v":0},{"$f":"IF(Jugend!N28=\"\",0,Jugend!N28)","v":0},{"$f":"IF(Jugend!O28=\"\",0,Jugend!O28)","v":0},null,{"$f":"IF(AL28=\"\",\"\",Jugend!Q28)","v":0},{"$f":"IF(Jugend!R28=\"\",0,Jugend!R28)","v":0},{"$f":"IF(Jugend!S28=\"\",0,Jugend!S28)","v":0},null,{"$f":"IF(AR28=\"\",\"\",'Junioren II'!A28)","v":0},{"$f":"IF(AR28=\"\",\"\",'Junioren II'!B28)","v":0},{"$f":"IF(AR28=\"\",\"\",'Junioren II'!C28)","v":0},{"$f":"IF('Junioren II'!D28=\"\",0,'Junioren II'!D28)","v":0},{"$f":"IF('Junioren II'!E28=\"\",0,'Junioren II'!E28)","v":0},null,{"$f":"IF(AX28=\"\",\"\",'Junioren II'!G28)","v":0},{"$f":"IF(AX28=\"\",\"\",'Junioren II'!H28)","v":0},{"$f":"IF(AX28=\"\",\"\",'Junioren II'!I28)","v":0},{"$f":"IF('Junioren II'!J28=\"\",0,'Junioren II'!J28)","v":0},{"$f":"IF('Junioren II'!K28=\"\",0,'Junioren II'!K28)","v":0},null,{"$f":"IF(BB28=\"\",\"\",'Junioren II'!M28)","v":0},{"$f":"IF('Junioren II'!N28=\"\",0,'Junioren II'!N28)","v":0},{"$f":"IF('Junioren II'!O28=\"\",0,'Junioren II'!O28)","v":0},null,{"$f":"IF(BF28=\"\",\"\",'Junioren II'!Q28)","v":0},{"$f":"IF('Junioren II'!R28=\"\",0,'Junioren II'!R28)","v":0},{"$f":"IF('Junioren II'!S28=\"\",0,'Junioren II'!S28)","v":0},null,{"$f":"IF('UK-König'!A28=\"\",\"\",'UK-König'!A28)","v":""},{"$f":"IF('UK-König'!B28=\"\",\"\",'UK-König'!B28)","v":""},{"$f":"IF('UK-König'!C28=\"\",\"\",'UK-König'!C28)","v":""},null,{"$f":"IF(BP28=\"\",\"\",'Junioren I'!A28)","v":0},{"$f":"IF(BP28=\"\",\"\",'Junioren I'!B28)","v":0},{"$f":"IF(BP28=\"\",\"\",'Junioren I'!C28)","v":0},{"$f":"IF('Junioren I'!D28=\"\",0,'Junioren I'!D28)","v":0},{"$f":"IF('Junioren I'!E28=\"\",0,'Junioren I'!E28)","v":0},null,{"$f":"IF(BV28=\"\",\"\",'Junioren I'!G28)","v":0},{"$f":"IF(BV28=\"\",\"\",'Junioren I'!H28)","v":0},{"$f":"IF(BV28=\"\",\"\",'Junioren I'!I28)","v":0},{"$f":"IF('Junioren I'!J28=\"\",0,'Junioren I'!J28)","v":0},{"$f":"IF('Junioren I'!K28=\"\",0,'Junioren I'!K28)","v":0},null,{"$f":"IF(BZ28=\"\",\"\",'Junioren I'!M28)","v":0},{"$f":"IF('Junioren I'!N28=\"\",0,'Junioren I'!N28)","v":0},{"$f":"IF('Junioren I'!O28=\"\",0,'Junioren I'!O28)","v":0},null,{"$f":"IF(CD28=\"\",\"\",'Junioren I'!Q28)","v":0},{"$f":"IF('Junioren I'!R28=\"\",0,'Junioren I'!R28)","v":0},{"$f":"IF('Junioren I'!S28=\"\",0,'Junioren I'!S28)","v":0},null,{"$f":"IF(CJ28=\"\",\"\",Lichtpunkt!A28)","v":0},{"$f":"IF(CJ28=\"\",\"\",Lichtpunkt!B28)","v":0},{"$f":"IF(CJ28=\"\",\"\",Lichtpunkt!C28)","v":0},{"$f":"IF(Lichtpunkt!D28=\"\",0,Lichtpunkt!D28)","v":0},{"$f":"IF(Lichtpunkt!E28=\"\",0,Lichtpunkt!E28)","v":0},null,{"$f":"IF(CP28=\"\",\"\",Lichtpunkt!G28)","v":0},{"$f":"IF(CP28=\"\",\"\",Lichtpunkt!H28)","v":0},{"$f":"IF(CP28=\"\",\"\",Lichtpunkt!I28)","v":0},{"$f":"IF(Lichtpunkt!J28=\"\",0,Lichtpunkt!J28)","v":0},{"$f":"IF(Lichtpunkt!K28=\"\",0,Lichtpunkt!K28)","v":0},null,{"$f":"IF(CT28=\"\",\"\",Lichtpunkt!M28)","v":0},{"$f":"IF(Lichtpunkt!N28=\"\",0,Lichtpunkt!N28)","v":0},{"$f":"IF(Lichtpunkt!O28=\"\",0,Lichtpunkt!O28)","v":0},null,{"$f":"IF(CX28=\"\",\"\",Lichtpunkt!Q28)","v":0},{"$f":"IF(Lichtpunkt!R28=\"\",0,Lichtpunkt!R28)","v":0},{"$f":"IF(Lichtpunkt!S28=\"\",0,Lichtpunkt!S28)","v":0},null,{"$f":"IF('LP-König'!A28=\"\",\"\",'LP-König'!A28)","v":""},{"$f":"IF('LP-König'!B28=\"\",\"\",'LP-König'!B28)","v":""},{"$f":"IF('LP-König'!C28=\"\",\"\",'LP-König'!C28)","v":""}]
[{"$f":"IF(D29=\"\",\"\",Schüler!A29)","v":0},{"$f":"IF(D29=\"\",\"\",Schüler!B29)","v":0},{"$f":"IF(D29=\"\",\"\",Schüler!C29)","v":0},{"$f":"IF(Schüler!D29=\"\",0,Schüler!D29)","v":0},{"$f":"IF(Schüler!E29=\"\",0,Schüler!E29)","v":0},null,{"$f":"IF(J29=\"\",\"\",Schüler!G29)","v":0},{"$f":"IF(J29=\"\",\"\",Schüler!H29)","v":0},{"$f":"IF(J29=\"\",\"\",Schüler!I29)","v":0},{"$f":"IF(Schüler!J29=\"\",0,Schüler!J29)","v":0},{"$f":"IF(Schüler!K29=\"\",0,Schüler!K29)","v":0},null,{"$f":"IF(N29=\"\",\"\",Schüler!M29)","v":0},{"$f":"IF(Schüler!N29=\"\",0,Schüler!N29)","v":0},{"$f":"IF(Schüler!O29=\"\",0,Schüler!O29)","v":0},null,{"$f":"IF(R29=\"\",\"\",Schüler!Q29)","v":0},{"$f":"IF(Schüler!R29=\"\",0,Schüler!R29)","v":0},{"$f":"IF(Schüler!S29=\"\",0,Schüler!S29)","v":0},null,{"$f":"IF(X29=\"\",\"\",Jugend!A29)","v":0},{"$f":"IF(X29=\"\",\"\",Jugend!B29)","v":0},{"$f":"IF(X29=\"\",\"\",Jugend!C29)","v":0},{"$f":"IF(Jugend!D29=\"\",0,Jugend!D29)","v":0},{"$f":"IF(Jugend!E29=\"\",0,Jugend!E29)","v":0},null,{"$f":"IF(AD29=\"\",\"\",Jugend!G29)","v":0},{"$f":"IF(AD29=\"\",\"\",Jugend!H29)","v":0},{"$f":"IF(AD29=\"\",\"\",Jugend!I29)","v":0},{"$f":"IF(Jugend!J29=\"\",0,Jugend!J29)","v":0},{"$f":"IF(Jugend!K29=\"\",0,Jugend!K29)","v":0},null,{"$f":"IF(AH29=\"\",\"\",Jugend!M29)","v":0},{"$f":"IF(Jugend!N29=\"\",0,Jugend!N29)","v":0},{"$f":"IF(Jugend!O29=\"\",0,Jugend!O29)","v":0},null,{"$f":"IF(AL29=\"\",\"\",Jugend!Q29)","v":0},{"$f":"IF(Jugend!R29=\"\",0,Jugend!R29)","v":0},{"$f":"IF(Jugend!S29=\"\",0,Jugend!S29)","v":0},null,{"$f":"IF(AR29=\"\",\"\",'Junioren II'!A29)","v":0},{"$f":"IF(AR29=\"\",\"\",'Junioren II'!B29)","v":0},{"$f":"IF(AR29=\"\",\"\",'Junioren II'!C29)","v":0},{"$f":"IF('Junioren II'!D29=\"\",0,'Junioren II'!D29)","v":0},{"$f":"IF('Junioren II'!E29=\"\",0,'Junioren II'!E29)","v":0},null,{"$f":"IF(AX29=\"\",\"\",'Junioren II'!G29)","v":0},{"$f":"IF(AX29=\"\",\"\",'Junioren II'!H29)","v":0},{"$f":"IF(AX29=\"\",\"\",'Junioren II'!I29)","v":0},{"$f":"IF('Junioren II'!J29=\"\",0,'Junioren II'!J29)","v":0},{"$f":"IF('Junioren II'!K29=\"\",0,'Junioren II'!K29)","v":0},null,{"$f":"IF(BB29=\"\",\"\",'Junioren II'!M29)","v":0},{"$f":"IF('Junioren II'!N29=\"\",0,'Junioren II'!N29)","v":0},{"$f":"IF('Junioren II'!O29=\"\",0,'Junioren II'!O29)","v":0},null,{"$f":"IF(BF29=\"\",\"\",'Junioren II'!Q29)","v":0},{"$f":"IF('Junioren II'!R29=\"\",0,'Junioren II'!R29)","v":0},{"$f":"IF('Junioren II'!S29=\"\",0,'Junioren II'!S29)","v":0},null,{"$f":"IF('UK-König'!A29=\"\",\"\",'UK-König'!A29)","v":""},{"$f":"IF('UK-König'!B29=\"\",\"\",'UK-König'!B29)","v":""},{"$f":"IF('UK-König'!C29=\"\",\"\",'UK-König'!C29)","v":""},null,{"$f":"IF(BP29=\"\",\"\",'Junioren I'!A29)","v":0},{"$f":"IF(BP29=\"\",\"\",'Junioren I'!B29)","v":0},{"$f":"IF(BP29=\"\",\"\",'Junioren I'!C29)","v":0},{"$f":"IF('Junioren I'!D29=\"\",0,'Junioren I'!D29)","v":0},{"$f":"IF('Junioren I'!E29=\"\",0,'Junioren I'!E29)","v":0},null,{"$f":"IF(BV29=\"\",\"\",'Junioren I'!G29)","v":0},{"$f":"IF(BV29=\"\",\"\",'Junioren I'!H29)","v":0},{"$f":"IF(BV29=\"\",\"\",'Junioren I'!I29)","v":0},{"$f":"IF('Junioren I'!J29=\"\",0,'Junioren I'!J29)","v":0},{"$f":"IF('Junioren I'!K29=\"\",0,'Junioren I'!K29)","v":0},null,{"$f":"IF(BZ29=\"\",\"\",'Junioren I'!M29)","v":0},{"$f":"IF('Junioren I'!N29=\"\",0,'Junioren I'!N29)","v":0},{"$f":"IF('Junioren I'!O29=\"\",0,'Junioren I'!O29)","v":0},null,{"$f":"IF(CD29=\"\",\"\",'Junioren I'!Q29)","v":0},{"$f":"IF('Junioren I'!R29=\"\",0,'Junioren I'!R29)","v":0},{"$f":"IF('Junioren I'!S29=\"\",0,'Junioren I'!S29)","v":0},null,{"$f":"IF(CJ29=\"\",\"\",Lichtpunkt!A29)","v":0},{"$f":"IF(CJ29=\"\",\"\",Lichtpunkt!B29)","v":0},{"$f":"IF(CJ29=\"\",\"\",Lichtpunkt!C29)","v":0},{"$f":"IF(Lichtpunkt!D29=\"\",0,Lichtpunkt!D29)","v":0},{"$f":"IF(Lichtpunkt!E29=\"\",0,Lichtpunkt!E29)","v":0},null,{"$f":"IF(CP29=\"\",\"\",Lichtpunkt!G29)","v":0},{"$f":"IF(CP29=\"\",\"\",Lichtpunkt!H29)","v":0},{"$f":"IF(CP29=\"\",\"\",Lichtpunkt!I29)","v":0},{"$f":"IF(Lichtpunkt!J29=\"\",0,Lichtpunkt!J29)","v":0},{"$f":"IF(Lichtpunkt!K29=\"\",0,Lichtpunkt!K29)","v":0},null,{"$f":"IF(CT29=\"\",\"\",Lichtpunkt!M29)","v":0},{"$f":"IF(Lichtpunkt!N29=\"\",0,Lichtpunkt!N29)","v":0},{"$f":"IF(Lichtpunkt!O29=\"\",0,Lichtpunkt!O29)","v":0},null,{"$f":"IF(CX29=\"\",\"\",Lichtpunkt!Q29)","v":0},{"$f":"IF(Lichtpunkt!R29=\"\",0,Lichtpunkt!R29)","v":0},{"$f":"IF(Lichtpunkt!S29=\"\",0,Lichtpunkt!S29)","v":0},null,{"$f":"IF('LP-König'!A29=\"\",\"\",'LP-König'!A29)","v":""},{"$f":"IF('LP-König'!B29=\"\",\"\",'LP-König'!B29)","v":""},{"$f":"IF('LP-König'!C29=\"\",\"\",'LP-König'!C29)","v":""}]
[{"$f":"IF(D30=\"\",\"\",Schüler!A30)","v":0},{"$f":"IF(D30=\"\",\"\",Schüler!B30)","v":0},{"$f":"IF(D30=\"\",\"\",Schüler!C30)","v":0},{"$f":"IF(Schüler!D30=\"\",0,Schüler!D30)","v":0},{"$f":"IF(Schüler!E30=\"\",0,Schüler!E30)","v":0},null,{"$f":"IF(J30=\"\",\"\",Schüler!G30)","v":0},{"$f":"IF(J30=\"\",\"\",Schüler!H30)","v":0},{"$f":"IF(J30=\"\",\"\",Schüler!I30)","v":0},{"$f":"IF(Schüler!J30=\"\",0,Schüler!J30)","v":0},{"$f":"IF(Schüler!K30=\"\",0,Schüler!K30)","v":0},null,{"$f":"IF(N30=\"\",\"\",Schüler!M30)","v":0},{"$f":"IF(Schüler!N30=\"\",0,Schüler!N30)","v":0},{"$f":"IF(Schüler!O30=\"\",0,Schüler!O30)","v":0},null,{"$f":"IF(R30=\"\",\"\",Schüler!Q30)","v":0},{"$f":"IF(Schüler!R30=\"\",0,Schüler!R30)","v":0},{"$f":"IF(Schüler!S30=\"\",0,Schüler!S30)","v":0},null,{"$f":"IF(X30=\"\",\"\",Jugend!A30)","v":0},{"$f":"IF(X30=\"\",\"\",Jugend!B30)","v":0},{"$f":"IF(X30=\"\",\"\",Jugend!C30)","v":0},{"$f":"IF(Jugend!D30=\"\",0,Jugend!D30)","v":0},{"$f":"IF(Jugend!E30=\"\",0,Jugend!E30)","v":0},null,{"$f":"IF(AD30=\"\",\"\",Jugend!G30)","v":0},{"$f":"IF(AD30=\"\",\"\",Jugend!H30)","v":0},{"$f":"IF(AD30=\"\",\"\",Jugend!I30)","v":0},{"$f":"IF(Jugend!J30=\"\",0,Jugend!J30)","v":0},{"$f":"IF(Jugend!K30=\"\",0,Jugend!K30)","v":0},null,{"$f":"IF(AH30=\"\",\"\",Jugend!M30)","v":0},{"$f":"IF(Jugend!N30=\"\",0,Jugend!N30)","v":0},{"$f":"IF(Jugend!O30=\"\",0,Jugend!O30)","v":0},null,{"$f":"IF(AL30=\"\",\"\",Jugend!Q30)","v":0},{"$f":"IF(Jugend!R30=\"\",0,Jugend!R30)","v":0},{"$f":"IF(Jugend!S30=\"\",0,Jugend!S30)","v":0},null,{"$f":"IF(AR30=\"\",\"\",'Junioren II'!A30)","v":0},{"$f":"IF(AR30=\"\",\"\",'Junioren II'!B30)","v":0},{"$f":"IF(AR30=\"\",\"\",'Junioren II'!C30)","v":0},{"$f":"IF('Junioren II'!D30=\"\",0,'Junioren II'!D30)","v":0},{"$f":"IF('Junioren II'!E30=\"\",0,'Junioren II'!E30)","v":0},null,{"$f":"IF(AX30=\"\",\"\",'Junioren II'!G30)","v":0},{"$f":"IF(AX30=\"\",\"\",'Junioren II'!H30)","v":0},{"$f":"IF(AX30=\"\",\"\",'Junioren II'!I30)","v":0},{"$f":"IF('Junioren II'!J30=\"\",0,'Junioren II'!J30)","v":0},{"$f":"IF('Junioren II'!K30=\"\",0,'Junioren II'!K30)","v":0},null,{"$f":"IF(BB30=\"\",\"\",'Junioren II'!M30)","v":0},{"$f":"IF('Junioren II'!N30=\"\",0,'Junioren II'!N30)","v":0},{"$f":"IF('Junioren II'!O30=\"\",0,'Junioren II'!O30)","v":0},null,{"$f":"IF(BF30=\"\",\"\",'Junioren II'!Q30)","v":0},{"$f":"IF('Junioren II'!R30=\"\",0,'Junioren II'!R30)","v":0},{"$f":"IF('Junioren II'!S30=\"\",0,'Junioren II'!S30)","v":0},null,{"$f":"IF('UK-König'!A30=\"\",\"\",'UK-König'!A30)","v":""},{"$f":"IF('UK-König'!B30=\"\",\"\",'UK-König'!B30)","v":""},{"$f":"IF('UK-König'!C30=\"\",\"\",'UK-König'!C30)","v":""},null,{"$f":"IF(BP30=\"\",\"\",'Junioren I'!A30)","v":0},{"$f":"IF(BP30=\"\",\"\",'Junioren I'!B30)","v":0},{"$f":"IF(BP30=\"\",\"\",'Junioren I'!C30)","v":0},{"$f":"IF('Junioren I'!D30=\"\",0,'Junioren I'!D30)","v":0},{"$f":"IF('Junioren I'!E30=\"\",0,'Junioren I'!E30)","v":0},null,{"$f":"IF(BV30=\"\",\"\",'Junioren I'!G30)","v":0},{"$f":"IF(BV30=\"\",\"\",'Junioren I'!H30)","v":0},{"$f":"IF(BV30=\"\",\"\",'Junioren I'!I30)","v":0},{"$f":"IF('Junioren I'!J30=\"\",0,'Junioren I'!J30)","v":0},{"$f":"IF('Junioren I'!K30=\"\",0,'Junioren I'!K30)","v":0},null,{"$f":"IF(BZ30=\"\",\"\",'Junioren I'!M30)","v":0},{"$f":"IF('Junioren I'!N30=\"\",0,'Junioren I'!N30)","v":0},{"$f":"IF('Junioren I'!O30=\"\",0,'Junioren I'!O30)","v":0},null,{"$f":"IF(CD30=\"\",\"\",'Junioren I'!Q30)","v":0},{"$f":"IF('Junioren I'!R30=\"\",0,'Junioren I'!R30)","v":0},{"$f":"IF('Junioren I'!S30=\"\",0,'Junioren I'!S30)","v":0},null,{"$f":"IF(CJ30=\"\",\"\",Lichtpunkt!A30)","v":0},{"$f":"IF(CJ30=\"\",\"\",Lichtpunkt!B30)","v":0},{"$f":"IF(CJ30=\"\",\"\",Lichtpunkt!C30)","v":0},{"$f":"IF(Lichtpunkt!D30=\"\",0,Lichtpunkt!D30)","v":0},{"$f":"IF(Lichtpunkt!E30=\"\",0,Lichtpunkt!E30)","v":0},null,{"$f":"IF(CP30=\"\",\"\",Lichtpunkt!G30)","v":0},{"$f":"IF(CP30=\"\",\"\",Lichtpunkt!H30)","v":0},{"$f":"IF(CP30=\"\",\"\",Lichtpunkt!I30)","v":0},{"$f":"IF(Lichtpunkt!J30=\"\",0,Lichtpunkt!J30)","v":0},{"$f":"IF(Lichtpunkt!K30=\"\",0,Lichtpunkt!K30)","v":0},null,{"$f":"IF(CT30=\"\",\"\",Lichtpunkt!M30)","v":0},{"$f":"IF(Lichtpunkt!N30=\"\",0,Lichtpunkt!N30)","v":0},{"$f":"IF(Lichtpunkt!O30=\"\",0,Lichtpunkt!O30)","v":0},null,{"$f":"IF(CX30=\"\",\"\",Lichtpunkt!Q30)","v":0},{"$f":"IF(Lichtpunkt!R30=\"\",0,Lichtpunkt!R30)","v":0},{"$f":"IF(Lichtpunkt!S30=\"\",0,Lichtpunkt!S30)","v":0},null,{"$f":"IF('LP-König'!A30=\"\",\"\",'LP-König'!A30)","v":""},{"$f":"IF('LP-König'!B30=\"\",\"\",'LP-König'!B30)","v":""},{"$f":"IF('LP-König'!C30=\"\",\"\",'LP-König'!C30)","v":""}]
[{"$f":"IF(D31=\"\",\"\",Schüler!A31)","v":0},{"$f":"IF(D31=\"\",\"\",Schüler!B31)","v":0},{"$f":"IF(D31=\"\",\"\",Schüler!C31)","v":0},{"$f":"IF(Schüler!D31=\"\",0,Schüler!D31)","v":0},{"$f":"IF(Schüler!E31=\"\",0,Schüler!E31)","v":0},null,{"$f":"IF(J31=\"\",\"\",Schüler!G31)","v":0},{"$f":"IF(J31=\"\",\"\",Schüler!H31)","v":0},{"$f":"IF(J31=\"\",\"\",Schüler!I31)","v":0},{"$f":"IF(Schüler!J31=\"\",0,Schüler!J31)","v":0},{"$f":"IF(Schüler!K31=\"\",0,Schüler!K31)","v":0},null,{"$f":"IF(N31=\"\",\"\",Schüler!M31)","v":0},{"$f":"IF(Schüler!N31=\"\",0,Schüler!N31)","v":0},{"$f":"IF(Schüler!O31=\"\",0,Schüler!O31)","v":0},null,{"$f":"IF(R31=\"\",\"\",Schüler!Q31)","v":0},{"$f":"IF(Schüler!R31=\"\",0,Schüler!R31)","v":0},{"$f":"IF(Schüler!S31=\"\",0,Schüler!S31)","v":0},null,{"$f":"IF(X31=\"\",\"\",Jugend!A31)","v":0},{"$f":"IF(X31=\"\",\"\",Jugend!B31)","v":0},{"$f":"IF(X31=\"\",\"\",Jugend!C31)","v":0},{"$f":"IF(Jugend!D31=\"\",0,Jugend!D31)","v":0},{"$f":"IF(Jugend!E31=\"\",0,Jugend!E31)","v":0},null,{"$f":"IF(AD31=\"\",\"\",Jugend!G31)","v":0},{"$f":"IF(AD31=\"\",\"\",Jugend!H31)","v":0},{"$f":"IF(AD31=\"\",\"\",Jugend!I31)","v":0},{"$f":"IF(Jugend!J31=\"\",0,Jugend!J31)","v":0},{"$f":"IF(Jugend!K31=\"\",0,Jugend!K31)","v":0},null,{"$f":"IF(AH31=\"\",\"\",Jugend!M31)","v":0},{"$f":"IF(Jugend!N31=\"\",0,Jugend!N31)","v":0},{"$f":"IF(Jugend!O31=\"\",0,Jugend!O31)","v":0},null,{"$f":"IF(AL31=\"\",\"\",Jugend!Q31)","v":0},{"$f":"IF(Jugend!R31=\"\",0,Jugend!R31)","v":0},{"$f":"IF(Jugend!S31=\"\",0,Jugend!S31)","v":0},null,{"$f":"IF(AR31=\"\",\"\",'Junioren II'!A31)","v":0},{"$f":"IF(AR31=\"\",\"\",'Junioren II'!B31)","v":0},{"$f":"IF(AR31=\"\",\"\",'Junioren II'!C31)","v":0},{"$f":"IF('Junioren II'!D31=\"\",0,'Junioren II'!D31)","v":0},{"$f":"IF('Junioren II'!E31=\"\",0,'Junioren II'!E31)","v":0},null,{"$f":"IF(AX31=\"\",\"\",'Junioren II'!G31)","v":0},{"$f":"IF(AX31=\"\",\"\",'Junioren II'!H31)","v":0},{"$f":"IF(AX31=\"\",\"\",'Junioren II'!I31)","v":0},{"$f":"IF('Junioren II'!J31=\"\",0,'Junioren II'!J31)","v":0},{"$f":"IF('Junioren II'!K31=\"\",0,'Junioren II'!K31)","v":0},null,{"$f":"IF(BB31=\"\",\"\",'Junioren II'!M31)","v":0},{"$f":"IF('Junioren II'!N31=\"\",0,'Junioren II'!N31)","v":0},{"$f":"IF('Junioren II'!O31=\"\",0,'Junioren II'!O31)","v":0},null,{"$f":"IF(BF31=\"\",\"\",'Junioren II'!Q31)","v":0},{"$f":"IF('Junioren II'!R31=\"\",0,'Junioren II'!R31)","v":0},{"$f":"IF('Junioren II'!S31=\"\",0,'Junioren II'!S31)","v":0},null,{"$f":"IF('UK-König'!A31=\"\",\"\",'UK-König'!A31)","v":""},{"$f":"IF('UK-König'!B31=\"\",\"\",'UK-König'!B31)","v":""},{"$f":"IF('UK-König'!C31=\"\",\"\",'UK-König'!C31)","v":""},null,{"$f":"IF(BP31=\"\",\"\",'Junioren I'!A31)","v":0},{"$f":"IF(BP31=\"\",\"\",'Junioren I'!B31)","v":0},{"$f":"IF(BP31=\"\",\"\",'Junioren I'!C31)","v":0},{"$f":"IF('Junioren I'!D31=\"\",0,'Junioren I'!D31)","v":0},{"$f":"IF('Junioren I'!E31=\"\",0,'Junioren I'!E31)","v":0},null,{"$f":"IF(BV31=\"\",\"\",'Junioren I'!G31)","v":0},{"$f":"IF(BV31=\"\",\"\",'Junioren I'!H31)","v":0},{"$f":"IF(BV31=\"\",\"\",'Junioren I'!I31)","v":0},{"$f":"IF('Junioren I'!J31=\"\",0,'Junioren I'!J31)","v":0},{"$f":"IF('Junioren I'!K31=\"\",0,'Junioren I'!K31)","v":0},null,{"$f":"IF(BZ31=\"\",\"\",'Junioren I'!M31)","v":0},{"$f":"IF('Junioren I'!N31=\"\",0,'Junioren I'!N31)","v":0},{"$f":"IF('Junioren I'!O31=\"\",0,'Junioren I'!O31)","v":0},null,{"$f":"IF(CD31=\"\",\"\",'Junioren I'!Q31)","v":0},{"$f":"IF('Junioren I'!R31=\"\",0,'Junioren I'!R31)","v":0},{"$f":"IF('Junioren I'!S31=\"\",0,'Junioren I'!S31)","v":0},null,{"$f":"IF(CJ31=\"\",\"\",Lichtpunkt!A31)","v":0},{"$f":"IF(CJ31=\"\",\"\",Lichtpunkt!B31)","v":0},{"$f":"IF(CJ31=\"\",\"\",Lichtpunkt!C31)","v":0},{"$f":"IF(Lichtpunkt!D31=\"\",0,Lichtpunkt!D31)","v":0},{"$f":"IF(Lichtpunkt!E31=\"\",0,Lichtpunkt!E31)","v":0},null,{"$f":"IF(CP31=\"\",\"\",Lichtpunkt!G31)","v":0},{"$f":"IF(CP31=\"\",\"\",Lichtpunkt!H31)","v":0},{"$f":"IF(CP31=\"\",\"\",Lichtpunkt!I31)","v":0},{"$f":"IF(Lichtpunkt!J31=\"\",0,Lichtpunkt!J31)","v":0},{"$f":"IF(Lichtpunkt!K31=\"\",0,Lichtpunkt!K31)","v":0},null,{"$f":"IF(CT31=\"\",\"\",Lichtpunkt!M31)","v":0},{"$f":"IF(Lichtpunkt!N31=\"\",0,Lichtpunkt!N31)","v":0},{"$f":"IF(Lichtpunkt!O31=\"\",0,Lichtpunkt!O31)","v":0},null,{"$f":"IF(CX31=\"\",\"\",Lichtpunkt!Q31)","v":0},{"$f":"IF(Lichtpunkt!R31=\"\",0,Lichtpunkt!R31)","v":0},{"$f":"IF(Lichtpunkt!S31=\"\",0,Lichtpunkt!S31)","v":0},null,{"$f":"IF('LP-König'!A31=\"\",\"\",'LP-König'!A31)","v":""},{"$f":"IF('LP-König'!B31=\"\",\"\",'LP-König'!B31)","v":""},{"$f":"IF('LP-König'!C31=\"\",\"\",'LP-König'!C31)","v":""}]
[{"$f":"IF(D32=\"\",\"\",Schüler!A32)","v":0},{"$f":"IF(D32=\"\",\"\",Schüler!B32)","v":0},{"$f":"IF(D32=\"\",\"\",Schüler!C32)","v":0},{"$f":"IF(Schüler!D32=\"\",0,Schüler!D32)","v":0},{"$f":"IF(Schüler!E32=\"\",0,Schüler!E32)","v":0},null,{"$f":"IF(J32=\"\",\"\",Schüler!G32)","v":0},{"$f":"IF(J32=\"\",\"\",Schüler!H32)","v":0},{"$f":"IF(J32=\"\",\"\",Schüler!I32)","v":0},{"$f":"IF(Schüler!J32=\"\",0,Schüler!J32)","v":0},{"$f":"IF(Schüler!K32=\"\",0,Schüler!K32)","v":0},null,{"$f":"IF(N32=\"\",\"\",Schüler!M32)","v":0},{"$f":"IF(Schüler!N32=\"\",0,Schüler!N32)","v":0},{"$f":"IF(Schüler!O32=\"\",0,Schüler!O32)","v":0},null,{"$f":"IF(R32=\"\",\"\",Schüler!Q32)","v":0},{"$f":"IF(Schüler!R32=\"\",0,Schüler!R32)","v":0},{"$f":"IF(Schüler!S32=\"\",0,Schüler!S32)","v":0},null,{"$f":"IF(X32=\"\",\"\",Jugend!A32)","v":0},{"$f":"IF(X32=\"\",\"\",Jugend!B32)","v":0},{"$f":"IF(X32=\"\",\"\",Jugend!C32)","v":0},{"$f":"IF(Jugend!D32=\"\",0,Jugend!D32)","v":0},{"$f":"IF(Jugend!E32=\"\",0,Jugend!E32)","v":0},null,{"$f":"IF(AD32=\"\",\"\",Jugend!G32)","v":0},{"$f":"IF(AD32=\"\",\"\",Jugend!H32)","v":0},{"$f":"IF(AD32=\"\",\"\",Jugend!I32)","v":0},{"$f":"IF(Jugend!J32=\"\",0,Jugend!J32)","v":0},{"$f":"IF(Jugend!K32=\"\",0,Jugend!K32)","v":0},null,{"$f":"IF(AH32=\"\",\"\",Jugend!M32)","v":0},{"$f":"IF(Jugend!N32=\"\",0,Jugend!N32)","v":0},{"$f":"IF(Jugend!O32=\"\",0,Jugend!O32)","v":0},null,{"$f":"IF(AL32=\"\",\"\",Jugend!Q32)","v":0},{"$f":"IF(Jugend!R32=\"\",0,Jugend!R32)","v":0},{"$f":"IF(Jugend!S32=\"\",0,Jugend!S32)","v":0},null,{"$f":"IF(AR32=\"\",\"\",'Junioren II'!A32)","v":0},{"$f":"IF(AR32=\"\",\"\",'Junioren II'!B32)","v":0},{"$f":"IF(AR32=\"\",\"\",'Junioren II'!C32)","v":0},{"$f":"IF('Junioren II'!D32=\"\",0,'Junioren II'!D32)","v":0},{"$f":"IF('Junioren II'!E32=\"\",0,'Junioren II'!E32)","v":0},null,{"$f":"IF(AX32=\"\",\"\",'Junioren II'!G32)","v":0},{"$f":"IF(AX32=\"\",\"\",'Junioren II'!H32)","v":0},{"$f":"IF(AX32=\"\",\"\",'Junioren II'!I32)","v":0},{"$f":"IF('Junioren II'!J32=\"\",0,'Junioren II'!J32)","v":0},{"$f":"IF('Junioren II'!K32=\"\",0,'Junioren II'!K32)","v":0},null,{"$f":"IF(BB32=\"\",\"\",'Junioren II'!M32)","v":0},{"$f":"IF('Junioren II'!N32=\"\",0,'Junioren II'!N32)","v":0},{"$f":"IF('Junioren II'!O32=\"\",0,'Junioren II'!O32)","v":0},null,{"$f":"IF(BF32=\"\",\"\",'Junioren II'!Q32)","v":0},{"$f":"IF('Junioren II'!R32=\"\",0,'Junioren II'!R32)","v":0},{"$f":"IF('Junioren II'!S32=\"\",0,'Junioren II'!S32)","v":0},null,{"$f":"IF('UK-König'!A32=\"\",\"\",'UK-König'!A32)","v":""},{"$f":"IF('UK-König'!B32=\"\",\"\",'UK-König'!B32)","v":""},{"$f":"IF('UK-König'!C32=\"\",\"\",'UK-König'!C32)","v":""},null,{"$f":"IF(BP32=\"\",\"\",'Junioren I'!A32)","v":0},{"$f":"IF(BP32=\"\",\"\",'Junioren I'!B32)","v":0},{"$f":"IF(BP32=\"\",\"\",'Junioren I'!C32)","v":0},{"$f":"IF('Junioren I'!D32=\"\",0,'Junioren I'!D32)","v":0},{"$f":"IF('Junioren I'!E32=\"\",0,'Junioren I'!E32)","v":0},null,{"$f":"IF(BV32=\"\",\"\",'Junioren I'!G32)","v":0},{"$f":"IF(BV32=\"\",\"\",'Junioren I'!H32)","v":0},{"$f":"IF(BV32=\"\",\"\",'Junioren I'!I32)","v":0},{"$f":"IF('Junioren I'!J32=\"\",0,'Junioren I'!J32)","v":0},{"$f":"IF('Junioren I'!K32=\"\",0,'Junioren I'!K32)","v":0},null,{"$f":"IF(BZ32=\"\",\"\",'Junioren I'!M32)","v":0},{"$f":"IF('Junioren I'!N32=\"\",0,'Junioren I'!N32)","v":0},{"$f":"IF('Junioren I'!O32=\"\",0,'Junioren I'!O32)","v":0},null,{"$f":"IF(CD32=\"\",\"\",'Junioren I'!Q32)","v":0},{"$f":"IF('Junioren I'!R32=\"\",0,'Junioren I'!R32)","v":0},{"$f":"IF('Junioren I'!S32=\"\",0,'Junioren I'!S32)","v":0},null,{"$f":"IF(CJ32=\"\",\"\",Lichtpunkt!A32)","v":0},{"$f":"IF(CJ32=\"\",\"\",Lichtpunkt!B32)","v":0},{"$f":"IF(CJ32=\"\",\"\",Lichtpunkt!C32)","v":0},{"$f":"IF(Lichtpunkt!D32=\"\",0,Lichtpunkt!D32)","v":0},{"$f":"IF(Lichtpunkt!E32=\"\",0,Lichtpunkt!E32)","v":0},null,{"$f":"IF(CP32=\"\",\"\",Lichtpunkt!G32)","v":0},{"$f":"IF(CP32=\"\",\"\",Lichtpunkt!H32)","v":0},{"$f":"IF(CP32=\"\",\"\",Lichtpunkt!I32)","v":0},{"$f":"IF(Lichtpunkt!J32=\"\",0,Lichtpunkt!J32)","v":0},{"$f":"IF(Lichtpunkt!K32=\"\",0,Lichtpunkt!K32)","v":0},null,{"$f":"IF(CT32=\"\",\"\",Lichtpunkt!M32)","v":0},{"$f":"IF(Lichtpunkt!N32=\"\",0,Lichtpunkt!N32)","v":0},{"$f":"IF(Lichtpunkt!O32=\"\",0,Lichtpunkt!O32)","v":0},null,{"$f":"IF(CX32=\"\",\"\",Lichtpunkt!Q32)","v":0},{"$f":"IF(Lichtpunkt!R32=\"\",0,Lichtpunkt!R32)","v":0},{"$f":"IF(Lichtpunkt!S32=\"\",0,Lichtpunkt!S32)","v":0},null,{"$f":"IF('LP-König'!A32=\"\",\"\",'LP-König'!A32)","v":""},{"$f":"IF('LP-König'!B32=\"\",\"\",'LP-König'!B32)","v":""},{"$f":"IF('LP-König'!C32=\"\",\"\",'LP-König'!C32)","v":""}]
[{"$f":"IF(D33=\"\",\"\",Schüler!A33)","v":0},{"$f":"IF(D33=\"\",\"\",Schüler!B33)","v":0},{"$f":"IF(D33=\"\",\"\",Schüler!C33)","v":0},{"$f":"IF(Schüler!D33=\"\",0,Schüler!D33)","v":0},{"$f":"IF(Schüler!E33=\"\",0,Schüler!E33)","v":0},null,{"$f":"IF(J33=\"\",\"\",Schüler!G33)","v":0},{"$f":"IF(J33=\"\",\"\",Schüler!H33)","v":0},{"$f":"IF(J33=\"\",\"\",Schüler!I33)","v":0},{"$f":"IF(Schüler!J33=\"\",0,Schüler!J33)","v":0},{"$f":"IF(Schüler!K33=\"\",0,Schüler!K33)","v":0},null,{"$f":"IF(N33=\"\",\"\",Schüler!M33)","v":0},{"$f":"IF(Schüler!N33=\"\",0,Schüler!N33)","v":0},{"$f":"IF(Schüler!O33=\"\",0,Schüler!O33)","v":0},null,{"$f":"IF(R33=\"\",\"\",Schüler!Q33)","v":0},{"$f":"IF(Schüler!R33=\"\",0,Schüler!R33)","v":0},{"$f":"IF(Schüler!S33=\"\",0,Schüler!S33)","v":0},null,{"$f":"IF(X33=\"\",\"\",Jugend!A33)","v":0},{"$f":"IF(X33=\"\",\"\",Jugend!B33)","v":0},{"$f":"IF(X33=\"\",\"\",Jugend!C33)","v":0},{"$f":"IF(Jugend!D33=\"\",0,Jugend!D33)","v":0},{"$f":"IF(Jugend!E33=\"\",0,Jugend!E33)","v":0},null,{"$f":"IF(AD33=\"\",\"\",Jugend!G33)","v":0},{"$f":"IF(AD33=\"\",\"\",Jugend!H33)","v":0},{"$f":"IF(AD33=\"\",\"\",Jugend!I33)","v":0},{"$f":"IF(Jugend!J33=\"\",0,Jugend!J33)","v":0},{"$f":"IF(Jugend!K33=\"\",0,Jugend!K33)","v":0},null,{"$f":"IF(AH33=\"\",\"\",Jugend!M33)","v":0},{"$f":"IF(Jugend!N33=\"\",0,Jugend!N33)","v":0},{"$f":"IF(Jugend!O33=\"\",0,Jugend!O33)","v":0},null,{"$f":"IF(AL33=\"\",\"\",Jugend!Q33)","v":0},{"$f":"IF(Jugend!R33=\"\",0,Jugend!R33)","v":0},{"$f":"IF(Jugend!S33=\"\",0,Jugend!S33)","v":0},null,{"$f":"IF(AR33=\"\",\"\",'Junioren II'!A33)","v":0},{"$f":"IF(AR33=\"\",\"\",'Junioren II'!B33)","v":0},{"$f":"IF(AR33=\"\",\"\",'Junioren II'!C33)","v":0},{"$f":"IF('Junioren II'!D33=\"\",0,'Junioren II'!D33)","v":0},{"$f":"IF('Junioren II'!E33=\"\",0,'Junioren II'!E33)","v":0},null,{"$f":"IF(AX33=\"\",\"\",'Junioren II'!G33)","v":0},{"$f":"IF(AX33=\"\",\"\",'Junioren II'!H33)","v":0},{"$f":"IF(AX33=\"\",\"\",'Junioren II'!I33)","v":0},{"$f":"IF('Junioren II'!J33=\"\",0,'Junioren II'!J33)","v":0},{"$f":"IF('Junioren II'!K33=\"\",0,'Junioren II'!K33)","v":0},null,{"$f":"IF(BB33=\"\",\"\",'Junioren II'!M33)","v":0},{"$f":"IF('Junioren II'!N33=\"\",0,'Junioren II'!N33)","v":0},{"$f":"IF('Junioren II'!O33=\"\",0,'Junioren II'!O33)","v":0},null,{"$f":"IF(BF33=\"\",\"\",'Junioren II'!Q33)","v":0},{"$f":"IF('Junioren II'!R33=\"\",0,'Junioren II'!R33)","v":0},{"$f":"IF('Junioren II'!S33=\"\",0,'Junioren II'!S33)","v":0},null,{"$f":"IF('UK-König'!A33=\"\",\"\",'UK-König'!A33)","v":""},{"$f":"IF('UK-König'!B33=\"\",\"\",'UK-König'!B33)","v":""},{"$f":"IF('UK-König'!C33=\"\",\"\",'UK-König'!C33)","v":""},null,{"$f":"IF(BP33=\"\",\"\",'Junioren I'!A33)","v":0},{"$f":"IF(BP33=\"\",\"\",'Junioren I'!B33)","v":0},{"$f":"IF(BP33=\"\",\"\",'Junioren I'!C33)","v":0},{"$f":"IF('Junioren I'!D33=\"\",0,'Junioren I'!D33)","v":0},{"$f":"IF('Junioren I'!E33=\"\",0,'Junioren I'!E33)","v":0},null,{"$f":"IF(BV33=\"\",\"\",'Junioren I'!G33)","v":0},{"$f":"IF(BV33=\"\",\"\",'Junioren I'!H33)","v":0},{"$f":"IF(BV33=\"\",\"\",'Junioren I'!I33)","v":0},{"$f":"IF('Junioren I'!J33=\"\",0,'Junioren I'!J33)","v":0},{"$f":"IF('Junioren I'!K33=\"\",0,'Junioren I'!K33)","v":0},null,{"$f":"IF(BZ33=\"\",\"\",'Junioren I'!M33)","v":0},{"$f":"IF('Junioren I'!N33=\"\",0,'Junioren I'!N33)","v":0},{"$f":"IF('Junioren I'!O33=\"\",0,'Junioren I'!O33)","v":0},null,{"$f":"IF(CD33=\"\",\"\",'Junioren I'!Q33)","v":0},{"$f":"IF('Junioren I'!R33=\"\",0,'Junioren I'!R33)","v":0},{"$f":"IF('Junioren I'!S33=\"\",0,'Junioren I'!S33)","v":0},null,{"$f":"IF(CJ33=\"\",\"\",Lichtpunkt!A33)","v":0},{"$f":"IF(CJ33=\"\",\"\",Lichtpunkt!B33)","v":0},{"$f":"IF(CJ33=\"\",\"\",Lichtpunkt!C33)","v":0},{"$f":"IF(Lichtpunkt!D33=\"\",0,Lichtpunkt!D33)","v":0},{"$f":"IF(Lichtpunkt!E33=\"\",0,Lichtpunkt!E33)","v":0},null,{"$f":"IF(CP33=\"\",\"\",Lichtpunkt!G33)","v":0},{"$f":"IF(CP33=\"\",\"\",Lichtpunkt!H33)","v":0},{"$f":"IF(CP33=\"\",\"\",Lichtpunkt!I33)","v":0},{"$f":"IF(Lichtpunkt!J33=\"\",0,Lichtpunkt!J33)","v":0},{"$f":"IF(Lichtpunkt!K33=\"\",0,Lichtpunkt!K33)","v":0},null,{"$f":"IF(CT33=\"\",\"\",Lichtpunkt!M33)","v":0},{"$f":"IF(Lichtpunkt!N33=\"\",0,Lichtpunkt!N33)","v":0},{"$f":"IF(Lichtpunkt!O33=\"\",0,Lichtpunkt!O33)","v":0},null,{"$f":"IF(CX33=\"\",\"\",Lichtpunkt!Q33)","v":0},{"$f":"IF(Lichtpunkt!R33=\"\",0,Lichtpunkt!R33)","v":0},{"$f":"IF(Lichtpunkt!S33=\"\",0,Lichtpunkt!S33)","v":0},null,{"$f":"IF('LP-König'!A33=\"\",\"\",'LP-König'!A33)","v":""},{"$f":"IF('LP-König'!B33=\"\",\"\",'LP-König'!B33)","v":""},{"$f":"IF('LP-König'!C33=\"\",\"\",'LP-König'!C33)","v":""}]
[{"$f":"IF(D34=\"\",\"\",Schüler!A34)","v":0},{"$f":"IF(D34=\"\",\"\",Schüler!B34)","v":0},{"$f":"IF(D34=\"\",\"\",Schüler!C34)","v":0},{"$f":"IF(Schüler!D34=\"\",0,Schüler!D34)","v":0},{"$f":"IF(Schüler!E34=\"\",0,Schüler!E34)","v":0},null,{"$f":"IF(J34=\"\",\"\",Schüler!G34)","v":0},{"$f":"IF(J34=\"\",\"\",Schüler!H34)","v":0},{"$f":"IF(J34=\"\",\"\",Schüler!I34)","v":0},{"$f":"IF(Schüler!J34=\"\",0,Schüler!J34)","v":0},{"$f":"IF(Schüler!K34=\"\",0,Schüler!K34)","v":0},null,{"$f":"IF(N34=\"\",\"\",Schüler!M34)","v":0},{"$f":"IF(Schüler!N34=\"\",0,Schüler!N34)","v":0},{"$f":"IF(Schüler!O34=\"\",0,Schüler!O34)","v":0},null,{"$f":"IF(R34=\"\",\"\",Schüler!Q34)","v":0},{"$f":"IF(Schüler!R34=\"\",0,Schüler!R34)","v":0},{"$f":"IF(Schüler!S34=\"\",0,Schüler!S34)","v":0},null,{"$f":"IF(X34=\"\",\"\",Jugend!A34)","v":0},{"$f":"IF(X34=\"\",\"\",Jugend!B34)","v":0},{"$f":"IF(X34=\"\",\"\",Jugend!C34)","v":0},{"$f":"IF(Jugend!D34=\"\",0,Jugend!D34)","v":0},{"$f":"IF(Jugend!E34=\"\",0,Jugend!E34)","v":0},null,{"$f":"IF(AD34=\"\",\"\",Jugend!G34)","v":0},{"$f":"IF(AD34=\"\",\"\",Jugend!H34)","v":0},{"$f":"IF(AD34=\"\",\"\",Jugend!I34)","v":0},{"$f":"IF(Jugend!J34=\"\",0,Jugend!J34)","v":0},{"$f":"IF(Jugend!K34=\"\",0,Jugend!K34)","v":0},null,{"$f":"IF(AH34=\"\",\"\",Jugend!M34)","v":0},{"$f":"IF(Jugend!N34=\"\",0,Jugend!N34)","v":0},{"$f":"IF(Jugend!O34=\"\",0,Jugend!O34)","v":0},null,{"$f":"IF(AL34=\"\",\"\",Jugend!Q34)","v":0},{"$f":"IF(Jugend!R34=\"\",0,Jugend!R34)","v":0},{"$f":"IF(Jugend!S34=\"\",0,Jugend!S34)","v":0},null,{"$f":"IF(AR34=\"\",\"\",'Junioren II'!A34)","v":0},{"$f":"IF(AR34=\"\",\"\",'Junioren II'!B34)","v":0},{"$f":"IF(AR34=\"\",\"\",'Junioren II'!C34)","v":0},{"$f":"IF('Junioren II'!D34=\"\",0,'Junioren II'!D34)","v":0},{"$f":"IF('Junioren II'!E34=\"\",0,'Junioren II'!E34)","v":0},null,{"$f":"IF(AX34=\"\",\"\",'Junioren II'!G34)","v":0},{"$f":"IF(AX34=\"\",\"\",'Junioren II'!H34)","v":0},{"$f":"IF(AX34=\"\",\"\",'Junioren II'!I34)","v":0},{"$f":"IF('Junioren II'!J34=\"\",0,'Junioren II'!J34)","v":0},{"$f":"IF('Junioren II'!K34=\"\",0,'Junioren II'!K34)","v":0},null,{"$f":"IF(BB34=\"\",\"\",'Junioren II'!M34)","v":0},{"$f":"IF('Junioren II'!N34=\"\",0,'Junioren II'!N34)","v":0},{"$f":"IF('Junioren II'!O34=\"\",0,'Junioren II'!O34)","v":0},null,{"$f":"IF(BF34=\"\",\"\",'Junioren II'!Q34)","v":0},{"$f":"IF('Junioren II'!R34=\"\",0,'Junioren II'!R34)","v":0},{"$f":"IF('Junioren II'!S34=\"\",0,'Junioren II'!S34)","v":0},null,{"$f":"IF('UK-König'!A34=\"\",\"\",'UK-König'!A34)","v":""},{"$f":"IF('UK-König'!B34=\"\",\"\",'UK-König'!B34)","v":""},{"$f":"IF('UK-König'!C34=\"\",\"\",'UK-König'!C34)","v":""},null,{"$f":"IF(BP34=\"\",\"\",'Junioren I'!A34)","v":0},{"$f":"IF(BP34=\"\",\"\",'Junioren I'!B34)","v":0},{"$f":"IF(BP34=\"\",\"\",'Junioren I'!C34)","v":0},{"$f":"IF('Junioren I'!D34=\"\",0,'Junioren I'!D34)","v":0},{"$f":"IF('Junioren I'!E34=\"\",0,'Junioren I'!E34)","v":0},null,{"$f":"IF(BV34=\"\",\"\",'Junioren I'!G34)","v":0},{"$f":"IF(BV34=\"\",\"\",'Junioren I'!H34)","v":0},{"$f":"IF(BV34=\"\",\"\",'Junioren I'!I34)","v":0},{"$f":"IF('Junioren I'!J34=\"\",0,'Junioren I'!J34)","v":0},{"$f":"IF('Junioren I'!K34=\"\",0,'Junioren I'!K34)","v":0},null,{"$f":"IF(BZ34=\"\",\"\",'Junioren I'!M34)","v":0},{"$f":"IF('Junioren I'!N34=\"\",0,'Junioren I'!N34)","v":0},{"$f":"IF('Junioren I'!O34=\"\",0,'Junioren I'!O34)","v":0},null,{"$f":"IF(CD34=\"\",\"\",'Junioren I'!Q34)","v":0},{"$f":"IF('Junioren I'!R34=\"\",0,'Junioren I'!R34)","v":0},{"$f":"IF('Junioren I'!S34=\"\",0,'Junioren I'!S34)","v":0},null,{"$f":"IF(CJ34=\"\",\"\",Lichtpunkt!A34)","v":0},{"$f":"IF(CJ34=\"\",\"\",Lichtpunkt!B34)","v":0},{"$f":"IF(CJ34=\"\",\"\",Lichtpunkt!C34)","v":0},{"$f":"IF(Lichtpunkt!D34=\"\",0,Lichtpunkt!D34)","v":0},{"$f":"IF(Lichtpunkt!E34=\"\",0,Lichtpunkt!E34)","v":0},null,{"$f":"IF(CP34=\"\",\"\",Lichtpunkt!G34)","v":0},{"$f":"IF(CP34=\"\",\"\",Lichtpunkt!H34)","v":0},{"$f":"IF(CP34=\"\",\"\",Lichtpunkt!I34)","v":0},{"$f":"IF(Lichtpunkt!J34=\"\",0,Lichtpunkt!J34)","v":0},{"$f":"IF(Lichtpunkt!K34=\"\",0,Lichtpunkt!K34)","v":0},null,{"$f":"IF(CT34=\"\",\"\",Lichtpunkt!M34)","v":0},{"$f":"IF(Lichtpunkt!N34=\"\",0,Lichtpunkt!N34)","v":0},{"$f":"IF(Lichtpunkt!O34=\"\",0,Lichtpunkt!O34)","v":0},null,{"$f":"IF(CX34=\"\",\"\",Lichtpunkt!Q34)","v":0},{"$f":"IF(Lichtpunkt!R34=\"\",0,Lichtpunkt!R34)","v":0},{"$f":"IF(Lichtpunkt!S34=\"\",0,Lichtpunkt!S34)","v":0},null,{"$f":"IF('LP-König'!A34=\"\",\"\",'LP-König'!A34)","v":""},{"$f":"IF('LP-König'!B34=\"\",\"\",'LP-König'!B34)","v":""},{"$f":"IF('LP-König'!C34=\"\",\"\",'LP-König'!C34)","v":""}]
[{"$f":"IF(D35=\"\",\"\",Schüler!A35)","v":0},{"$f":"IF(D35=\"\",\"\",Schüler!B35)","v":0},{"$f":"IF(D35=\"\",\"\",Schüler!C35)","v":0},{"$f":"IF(Schüler!D35=\"\",0,Schüler!D35)","v":0},{"$f":"IF(Schüler!E35=\"\",0,Schüler!E35)","v":0},null,{"$f":"IF(J35=\"\",\"\",Schüler!G35)","v":0},{"$f":"IF(J35=\"\",\"\",Schüler!H35)","v":0},{"$f":"IF(J35=\"\",\"\",Schüler!I35)","v":0},{"$f":"IF(Schüler!J35=\"\",0,Schüler!J35)","v":0},{"$f":"IF(Schüler!K35=\"\",0,Schüler!K35)","v":0},null,{"$f":"IF(N35=\"\",\"\",Schüler!M35)","v":0},{"$f":"IF(Schüler!N35=\"\",0,Schüler!N35)","v":0},{"$f":"IF(Schüler!O35=\"\",0,Schüler!O35)","v":0},null,{"$f":"IF(R35=\"\",\"\",Schüler!Q35)","v":0},{"$f":"IF(Schüler!R35=\"\",0,Schüler!R35)","v":0},{"$f":"IF(Schüler!S35=\"\",0,Schüler!S35)","v":0},null,{"$f":"IF(X35=\"\",\"\",Jugend!A35)","v":0},{"$f":"IF(X35=\"\",\"\",Jugend!B35)","v":0},{"$f":"IF(X35=\"\",\"\",Jugend!C35)","v":0},{"$f":"IF(Jugend!D35=\"\",0,Jugend!D35)","v":0},{"$f":"IF(Jugend!E35=\"\",0,Jugend!E35)","v":0},null,{"$f":"IF(AD35=\"\",\"\",Jugend!G35)","v":0},{"$f":"IF(AD35=\"\",\"\",Jugend!H35)","v":0},{"$f":"IF(AD35=\"\",\"\",Jugend!I35)","v":0},{"$f":"IF(Jugend!J35=\"\",0,Jugend!J35)","v":0},{"$f":"IF(Jugend!K35=\"\",0,Jugend!K35)","v":0},null,{"$f":"IF(AH35=\"\",\"\",Jugend!M35)","v":0},{"$f":"IF(Jugend!N35=\"\",0,Jugend!N35)","v":0},{"$f":"IF(Jugend!O35=\"\",0,Jugend!O35)","v":0},null,{"$f":"IF(AL35=\"\",\"\",Jugend!Q35)","v":0},{"$f":"IF(Jugend!R35=\"\",0,Jugend!R35)","v":0},{"$f":"IF(Jugend!S35=\"\",0,Jugend!S35)","v":0},null,{"$f":"IF(AR35=\"\",\"\",'Junioren II'!A35)","v":0},{"$f":"IF(AR35=\"\",\"\",'Junioren II'!B35)","v":0},{"$f":"IF(AR35=\"\",\"\",'Junioren II'!C35)","v":0},{"$f":"IF('Junioren II'!D35=\"\",0,'Junioren II'!D35)","v":0},{"$f":"IF('Junioren II'!E35=\"\",0,'Junioren II'!E35)","v":0},null,{"$f":"IF(AX35=\"\",\"\",'Junioren II'!G35)","v":0},{"$f":"IF(AX35=\"\",\"\",'Junioren II'!H35)","v":0},{"$f":"IF(AX35=\"\",\"\",'Junioren II'!I35)","v":0},{"$f":"IF('Junioren II'!J35=\"\",0,'Junioren II'!J35)","v":0},{"$f":"IF('Junioren II'!K35=\"\",0,'Junioren II'!K35)","v":0},null,{"$f":"IF(BB35=\"\",\"\",'Junioren II'!M35)","v":0},{"$f":"IF('Junioren II'!N35=\"\",0,'Junioren II'!N35)","v":0},{"$f":"IF('Junioren II'!O35=\"\",0,'Junioren II'!O35)","v":0},null,{"$f":"IF(BF35=\"\",\"\",'Junioren II'!Q35)","v":0},{"$f":"IF('Junioren II'!R35=\"\",0,'Junioren II'!R35)","v":0},{"$f":"IF('Junioren II'!S35=\"\",0,'Junioren II'!S35)","v":0},null,{"$f":"IF('UK-König'!A35=\"\",\"\",'UK-König'!A35)","v":""},{"$f":"IF('UK-König'!B35=\"\",\"\",'UK-König'!B35)","v":""},{"$f":"IF('UK-König'!C35=\"\",\"\",'UK-König'!C35)","v":""},null,{"$f":"IF(BP35=\"\",\"\",'Junioren I'!A35)","v":0},{"$f":"IF(BP35=\"\",\"\",'Junioren I'!B35)","v":0},{"$f":"IF(BP35=\"\",\"\",'Junioren I'!C35)","v":0},{"$f":"IF('Junioren I'!D35=\"\",0,'Junioren I'!D35)","v":0},{"$f":"IF('Junioren I'!E35=\"\",0,'Junioren I'!E35)","v":0},null,{"$f":"IF(BV35=\"\",\"\",'Junioren I'!G35)","v":0},{"$f":"IF(BV35=\"\",\"\",'Junioren I'!H35)","v":0},{"$f":"IF(BV35=\"\",\"\",'Junioren I'!I35)","v":0},{"$f":"IF('Junioren I'!J35=\"\",0,'Junioren I'!J35)","v":0},{"$f":"IF('Junioren I'!K35=\"\",0,'Junioren I'!K35)","v":0},null,{"$f":"IF(BZ35=\"\",\"\",'Junioren I'!M35)","v":0},{"$f":"IF('Junioren I'!N35=\"\",0,'Junioren I'!N35)","v":0},{"$f":"IF('Junioren I'!O35=\"\",0,'Junioren I'!O35)","v":0},null,{"$f":"IF(CD35=\"\",\"\",'Junioren I'!Q35)","v":0},{"$f":"IF('Junioren I'!R35=\"\",0,'Junioren I'!R35)","v":0},{"$f":"IF('Junioren I'!S35=\"\",0,'Junioren I'!S35)","v":0},null,{"$f":"IF(CJ35=\"\",\"\",Lichtpunkt!A35)","v":0},{"$f":"IF(CJ35=\"\",\"\",Lichtpunkt!B35)","v":0},{"$f":"IF(CJ35=\"\",\"\",Lichtpunkt!C35)","v":0},{"$f":"IF(Lichtpunkt!D35=\"\",0,Lichtpunkt!D35)","v":0},{"$f":"IF(Lichtpunkt!E35=\"\",0,Lichtpunkt!E35)","v":0},null,{"$f":"IF(CP35=\"\",\"\",Lichtpunkt!G35)","v":0},{"$f":"IF(CP35=\"\",\"\",Lichtpunkt!H35)","v":0},{"$f":"IF(CP35=\"\",\"\",Lichtpunkt!I35)","v":0},{"$f":"IF(Lichtpunkt!J35=\"\",0,Lichtpunkt!J35)","v":0},{"$f":"IF(Lichtpunkt!K35=\"\",0,Lichtpunkt!K35)","v":0},null,{"$f":"IF(CT35=\"\",\"\",Lichtpunkt!M35)","v":0},{"$f":"IF(Lichtpunkt!N35=\"\",0,Lichtpunkt!N35)","v":0},{"$f":"IF(Lichtpunkt!O35=\"\",0,Lichtpunkt!O35)","v":0},null,{"$f":"IF(CX35=\"\",\"\",Lichtpunkt!Q35)","v":0},{"$f":"IF(Lichtpunkt!R35=\"\",0,Lichtpunkt!R35)","v":0},{"$f":"IF(Lichtpunkt!S35=\"\",0,Lichtpunkt!S35)","v":0},null,{"$f":"IF('LP-König'!A35=\"\",\"\",'LP-König'!A35)","v":""},{"$f":"IF('LP-König'!B35=\"\",\"\",'LP-König'!B35)","v":""},{"$f":"IF('LP-König'!C35=\"\",\"\",'LP-König'!C35)","v":""}]
[{"$f":"IF(D36=\"\",\"\",Schüler!A36)","v":0},{"$f":"IF(D36=\"\",\"\",Schüler!B36)","v":0},{"$f":"IF(D36=\"\",\"\",Schüler!C36)","v":0},{"$f":"IF(Schüler!D36=\"\",0,Schüler!D36)","v":0},{"$f":"IF(Schüler!E36=\"\",0,Schüler!E36)","v":0},null,{"$f":"IF(J36=\"\",\"\",Schüler!G36)","v":0},{"$f":"IF(J36=\"\",\"\",Schüler!H36)","v":0},{"$f":"IF(J36=\"\",\"\",Schüler!I36)","v":0},{"$f":"IF(Schüler!J36=\"\",0,Schüler!J36)","v":0},{"$f":"IF(Schüler!K36=\"\",0,Schüler!K36)","v":0},null,{"$f":"IF(N36=\"\",\"\",Schüler!M36)","v":0},{"$f":"IF(Schüler!N36=\"\",0,Schüler!N36)","v":0},{"$f":"IF(Schüler!O36=\"\",0,Schüler!O36)","v":0},null,{"$f":"IF(R36=\"\",\"\",Schüler!Q36)","v":0},{"$f":"IF(Schüler!R36=\"\",0,Schüler!R36)","v":0},{"$f":"IF(Schüler!S36=\"\",0,Schüler!S36)","v":0},null,{"$f":"IF(X36=\"\",\"\",Jugend!A36)","v":0},{"$f":"IF(X36=\"\",\"\",Jugend!B36)","v":0},{"$f":"IF(X36=\"\",\"\",Jugend!C36)","v":0},{"$f":"IF(Jugend!D36=\"\",0,Jugend!D36)","v":0},{"$f":"IF(Jugend!E36=\"\",0,Jugend!E36)","v":0},null,{"$f":"IF(AD36=\"\",\"\",Jugend!G36)","v":0},{"$f":"IF(AD36=\"\",\"\",Jugend!H36)","v":0},{"$f":"IF(AD36=\"\",\"\",Jugend!I36)","v":0},{"$f":"IF(Jugend!J36=\"\",0,Jugend!J36)","v":0},{"$f":"IF(Jugend!K36=\"\",0,Jugend!K36)","v":0},null,{"$f":"IF(AH36=\"\",\"\",Jugend!M36)","v":0},{"$f":"IF(Jugend!N36=\"\",0,Jugend!N36)","v":0},{"$f":"IF(Jugend!O36=\"\",0,Jugend!O36)","v":0},null,{"$f":"IF(AL36=\"\",\"\",Jugend!Q36)","v":0},{"$f":"IF(Jugend!R36=\"\",0,Jugend!R36)","v":0},{"$f":"IF(Jugend!S36=\"\",0,Jugend!S36)","v":0},null,{"$f":"IF(AR36=\"\",\"\",'Junioren II'!A36)","v":0},{"$f":"IF(AR36=\"\",\"\",'Junioren II'!B36)","v":0},{"$f":"IF(AR36=\"\",\"\",'Junioren II'!C36)","v":0},{"$f":"IF('Junioren II'!D36=\"\",0,'Junioren II'!D36)","v":0},{"$f":"IF('Junioren II'!E36=\"\",0,'Junioren II'!E36)","v":0},null,{"$f":"IF(AX36=\"\",\"\",'Junioren II'!G36)","v":0},{"$f":"IF(AX36=\"\",\"\",'Junioren II'!H36)","v":0},{"$f":"IF(AX36=\"\",\"\",'Junioren II'!I36)","v":0},{"$f":"IF('Junioren II'!J36=\"\",0,'Junioren II'!J36)","v":0},{"$f":"IF('Junioren II'!K36=\"\",0,'Junioren II'!K36)","v":0},null,{"$f":"IF(BB36=\"\",\"\",'Junioren II'!M36)","v":0},{"$f":"IF('Junioren II'!N36=\"\",0,'Junioren II'!N36)","v":0},{"$f":"IF('Junioren II'!O36=\"\",0,'Junioren II'!O36)","v":0},null,{"$f":"IF(BF36=\"\",\"\",'Junioren II'!Q36)","v":0},{"$f":"IF('Junioren II'!R36=\"\",0,'Junioren II'!R36)","v":0},{"$f":"IF('Junioren II'!S36=\"\",0,'Junioren II'!S36)","v":0},null,{"$f":"IF('UK-König'!A36=\"\",\"\",'UK-König'!A36)","v":""},{"$f":"IF('UK-König'!B36=\"\",\"\",'UK-König'!B36)","v":""},{"$f":"IF('UK-König'!C36=\"\",\"\",'UK-König'!C36)","v":""},null,{"$f":"IF(BP36=\"\",\"\",'Junioren I'!A36)","v":0},{"$f":"IF(BP36=\"\",\"\",'Junioren I'!B36)","v":0},{"$f":"IF(BP36=\"\",\"\",'Junioren I'!C36)","v":0},{"$f":"IF('Junioren I'!D36=\"\",0,'Junioren I'!D36)","v":0},{"$f":"IF('Junioren I'!E36=\"\",0,'Junioren I'!E36)","v":0},null,{"$f":"IF(BV36=\"\",\"\",'Junioren I'!G36)","v":0},{"$f":"IF(BV36=\"\",\"\",'Junioren I'!H36)","v":0},{"$f":"IF(BV36=\"\",\"\",'Junioren I'!I36)","v":0},{"$f":"IF('Junioren I'!J36=\"\",0,'Junioren I'!J36)","v":0},{"$f":"IF('Junioren I'!K36=\"\",0,'Junioren I'!K36)","v":0},null,{"$f":"IF(BZ36=\"\",\"\",'Junioren I'!M36)","v":0},{"$f":"IF('Junioren I'!N36=\"\",0,'Junioren I'!N36)","v":0},{"$f":"IF('Junioren I'!O36=\"\",0,'Junioren I'!O36)","v":0},null,{"$f":"IF(CD36=\"\",\"\",'Junioren I'!Q36)","v":0},{"$f":"IF('Junioren I'!R36=\"\",0,'Junioren I'!R36)","v":0},{"$f":"IF('Junioren I'!S36=\"\",0,'Junioren I'!S36)","v":0},null,{"$f":"IF(CJ36=\"\",\"\",Lichtpunkt!A36)","v":0},{"$f":"IF(CJ36=\"\",\"\",Lichtpunkt!B36)","v":0},{"$f":"IF(CJ36=\"\",\"\",Lichtpunkt!C36)","v":0},{"$f":"IF(Lichtpunkt!D36=\"\",0,Lichtpunkt!D36)","v":0},{"$f":"IF(Lichtpunkt!E36=\"\",0,Lichtpunkt!E36)","v":0},null,{"$f":"IF(CP36=\"\",\"\",Lichtpunkt!G36)","v":0},{"$f":"IF(CP36=\"\",\"\",Lichtpunkt!H36)","v":0},{"$f":"IF(CP36=\"\",\"\",Lichtpunkt!I36)","v":0},{"$f":"IF(Lichtpunkt!J36=\"\",0,Lichtpunkt!J36)","v":0},{"$f":"IF(Lichtpunkt!K36=\"\",0,Lichtpunkt!K36)","v":0},null,{"$f":"IF(CT36=\"\",\"\",Lichtpunkt!M36)","v":0},{"$f":"IF(Lichtpunkt!N36=\"\",0,Lichtpunkt!N36)","v":0},{"$f":"IF(Lichtpunkt!O36=\"\",0,Lichtpunkt!O36)","v":0},null,{"$f":"IF(CX36=\"\",\"\",Lichtpunkt!Q36)","v":0},{"$f":"IF(Lichtpunkt!R36=\"\",0,Lichtpunkt!R36)","v":0},{"$f":"IF(Lichtpunkt!S36=\"\",0,Lichtpunkt!S36)","v":0},null,{"$f":"IF('LP-König'!A36=\"\",\"\",'LP-König'!A36)","v":""},{"$f":"IF('LP-König'!B36=\"\",\"\",'LP-König'!B36)","v":""},{"$f":"IF('LP-König'!C36=\"\",\"\",'LP-König'!C36)","v":""}]
[{"$f":"IF(D37=\"\",\"\",Schüler!A37)","v":0},{"$f":"IF(D37=\"\",\"\",Schüler!B37)","v":0},{"$f":"IF(D37=\"\",\"\",Schüler!C37)","v":0},{"$f":"IF(Schüler!D37=\"\",0,Schüler!D37)","v":0},{"$f":"IF(Schüler!E37=\"\",0,Schüler!E37)","v":0},null,{"$f":"IF(J37=\"\",\"\",Schüler!G37)","v":0},{"$f":"IF(J37=\"\",\"\",Schüler!H37)","v":0},{"$f":"IF(J37=\"\",\"\",Schüler!I37)","v":0},{"$f":"IF(Schüler!J37=\"\",0,Schüler!J37)","v":0},{"$f":"IF(Schüler!K37=\"\",0,Schüler!K37)","v":0},null,{"$f":"IF(N37=\"\",\"\",Schüler!M37)","v":0},{"$f":"IF(Schüler!N37=\"\",0,Schüler!N37)","v":0},{"$f":"IF(Schüler!O37=\"\",0,Schüler!O37)","v":0},null,{"$f":"IF(R37=\"\",\"\",Schüler!Q37)","v":0},{"$f":"IF(Schüler!R37=\"\",0,Schüler!R37)","v":0},{"$f":"IF(Schüler!S37=\"\",0,Schüler!S37)","v":0},null,{"$f":"IF(X37=\"\",\"\",Jugend!A37)","v":0},{"$f":"IF(X37=\"\",\"\",Jugend!B37)","v":0},{"$f":"IF(X37=\"\",\"\",Jugend!C37)","v":0},{"$f":"IF(Jugend!D37=\"\",0,Jugend!D37)","v":0},{"$f":"IF(Jugend!E37=\"\",0,Jugend!E37)","v":0},null,{"$f":"IF(AD37=\"\",\"\",Jugend!G37)","v":0},{"$f":"IF(AD37=\"\",\"\",Jugend!H37)","v":0},{"$f":"IF(AD37=\"\",\"\",Jugend!I37)","v":0},{"$f":"IF(Jugend!J37=\"\",0,Jugend!J37)","v":0},{"$f":"IF(Jugend!K37=\"\",0,Jugend!K37)","v":0},null,{"$f":"IF(AH37=\"\",\"\",Jugend!M37)","v":0},{"$f":"IF(Jugend!N37=\"\",0,Jugend!N37)","v":0},{"$f":"IF(Jugend!O37=\"\",0,Jugend!O37)","v":0},null,{"$f":"IF(AL37=\"\",\"\",Jugend!Q37)","v":0},{"$f":"IF(Jugend!R37=\"\",0,Jugend!R37)","v":0},{"$f":"IF(Jugend!S37=\"\",0,Jugend!S37)","v":0},null,{"$f":"IF(AR37=\"\",\"\",'Junioren II'!A37)","v":0},{"$f":"IF(AR37=\"\",\"\",'Junioren II'!B37)","v":0},{"$f":"IF(AR37=\"\",\"\",'Junioren II'!C37)","v":0},{"$f":"IF('Junioren II'!D37=\"\",0,'Junioren II'!D37)","v":0},{"$f":"IF('Junioren II'!E37=\"\",0,'Junioren II'!E37)","v":0},null,{"$f":"IF(AX37=\"\",\"\",'Junioren II'!G37)","v":0},{"$f":"IF(AX37=\"\",\"\",'Junioren II'!H37)","v":0},{"$f":"IF(AX37=\"\",\"\",'Junioren II'!I37)","v":0},{"$f":"IF('Junioren II'!J37=\"\",0,'Junioren II'!J37)","v":0},{"$f":"IF('Junioren II'!K37=\"\",0,'Junioren II'!K37)","v":0},null,{"$f":"IF(BB37=\"\",\"\",'Junioren II'!M37)","v":0},{"$f":"IF('Junioren II'!N37=\"\",0,'Junioren II'!N37)","v":0},{"$f":"IF('Junioren II'!O37=\"\",0,'Junioren II'!O37)","v":0},null,{"$f":"IF(BF37=\"\",\"\",'Junioren II'!Q37)","v":0},{"$f":"IF('Junioren II'!R37=\"\",0,'Junioren II'!R37)","v":0},{"$f":"IF('Junioren II'!S37=\"\",0,'Junioren II'!S37)","v":0},null,{"$f":"IF('UK-König'!A37=\"\",\"\",'UK-König'!A37)","v":""},{"$f":"IF('UK-König'!B37=\"\",\"\",'UK-König'!B37)","v":""},{"$f":"IF('UK-König'!C37=\"\",\"\",'UK-König'!C37)","v":""},null,{"$f":"IF(BP37=\"\",\"\",'Junioren I'!A37)","v":0},{"$f":"IF(BP37=\"\",\"\",'Junioren I'!B37)","v":0},{"$f":"IF(BP37=\"\",\"\",'Junioren I'!C37)","v":0},{"$f":"IF('Junioren I'!D37=\"\",0,'Junioren I'!D37)","v":0},{"$f":"IF('Junioren I'!E37=\"\",0,'Junioren I'!E37)","v":0},null,{"$f":"IF(BV37=\"\",\"\",'Junioren I'!G37)","v":0},{"$f":"IF(BV37=\"\",\"\",'Junioren I'!H37)","v":0},{"$f":"IF(BV37=\"\",\"\",'Junioren I'!I37)","v":0},{"$f":"IF('Junioren I'!J37=\"\",0,'Junioren I'!J37)","v":0},{"$f":"IF('Junioren I'!K37=\"\",0,'Junioren I'!K37)","v":0},null,{"$f":"IF(BZ37=\"\",\"\",'Junioren I'!M37)","v":0},{"$f":"IF('Junioren I'!N37=\"\",0,'Junioren I'!N37)","v":0},{"$f":"IF('Junioren I'!O37=\"\",0,'Junioren I'!O37)","v":0},null,{"$f":"IF(CD37=\"\",\"\",'Junioren I'!Q37)","v":0},{"$f":"IF('Junioren I'!R37=\"\",0,'Junioren I'!R37)","v":0},{"$f":"IF('Junioren I'!S37=\"\",0,'Junioren I'!S37)","v":0},null,{"$f":"IF(CJ37=\"\",\"\",Lichtpunkt!A37)","v":0},{"$f":"IF(CJ37=\"\",\"\",Lichtpunkt!B37)","v":0},{"$f":"IF(CJ37=\"\",\"\",Lichtpunkt!C37)","v":0},{"$f":"IF(Lichtpunkt!D37=\"\",0,Lichtpunkt!D37)","v":0},{"$f":"IF(Lichtpunkt!E37=\"\",0,Lichtpunkt!E37)","v":0},null,{"$f":"IF(CP37=\"\",\"\",Lichtpunkt!G37)","v":0},{"$f":"IF(CP37=\"\",\"\",Lichtpunkt!H37)","v":0},{"$f":"IF(CP37=\"\",\"\",Lichtpunkt!I37)","v":0},{"$f":"IF(Lichtpunkt!J37=\"\",0,Lichtpunkt!J37)","v":0},{"$f":"IF(Lichtpunkt!K37=\"\",0,Lichtpunkt!K37)","v":0},null,{"$f":"IF(CT37=\"\",\"\",Lichtpunkt!M37)","v":0},{"$f":"IF(Lichtpunkt!N37=\"\",0,Lichtpunkt!N37)","v":0},{"$f":"IF(Lichtpunkt!O37=\"\",0,Lichtpunkt!O37)","v":0},null,{"$f":"IF(CX37=\"\",\"\",Lichtpunkt!Q37)","v":0},{"$f":"IF(Lichtpunkt!R37=\"\",0,Lichtpunkt!R37)","v":0},{"$f":"IF(Lichtpunkt!S37=\"\",0,Lichtpunkt!S37)","v":0},null,{"$f":"IF('LP-König'!A37=\"\",\"\",'LP-König'!A37)","v":""},{"$f":"IF('LP-König'!B37=\"\",\"\",'LP-König'!B37)","v":""},{"$f":"IF('LP-König'!C37=\"\",\"\",'LP-König'!C37)","v":""}]
[{"$f":"IF(D38=\"\",\"\",Schüler!A38)","v":0},{"$f":"IF(D38=\"\",\"\",Schüler!B38)","v":0},{"$f":"IF(D38=\"\",\"\",Schüler!C38)","v":0},{"$f":"IF(Schüler!D38=\"\",0,Schüler!D38)","v":0},{"$f":"IF(Schüler!E38=\"\",0,Schüler!E38)","v":0},null,{"$f":"IF(J38=\"\",\"\",Schüler!G38)","v":0},{"$f":"IF(J38=\"\",\"\",Schüler!H38)","v":0},{"$f":"IF(J38=\"\",\"\",Schüler!I38)","v":0},{"$f":"IF(Schüler!J38=\"\",0,Schüler!J38)","v":0},{"$f":"IF(Schüler!K38=\"\",0,Schüler!K38)","v":0},null,{"$f":"IF(N38=\"\",\"\",Schüler!M38)","v":0},{"$f":"IF(Schüler!N38=\"\",0,Schüler!N38)","v":0},{"$f":"IF(Schüler!O38=\"\",0,Schüler!O38)","v":0},null,{"$f":"IF(R38=\"\",\"\",Schüler!Q38)","v":0},{"$f":"IF(Schüler!R38=\"\",0,Schüler!R38)","v":0},{"$f":"IF(Schüler!S38=\"\",0,Schüler!S38)","v":0},null,{"$f":"IF(X38=\"\",\"\",Jugend!A38)","v":0},{"$f":"IF(X38=\"\",\"\",Jugend!B38)","v":0},{"$f":"IF(X38=\"\",\"\",Jugend!C38)","v":0},{"$f":"IF(Jugend!D38=\"\",0,Jugend!D38)","v":0},{"$f":"IF(Jugend!E38=\"\",0,Jugend!E38)","v":0},null,{"$f":"IF(AD38=\"\",\"\",Jugend!G38)","v":0},{"$f":"IF(AD38=\"\",\"\",Jugend!H38)","v":0},{"$f":"IF(AD38=\"\",\"\",Jugend!I38)","v":0},{"$f":"IF(Jugend!J38=\"\",0,Jugend!J38)","v":0},{"$f":"IF(Jugend!K38=\"\",0,Jugend!K38)","v":0},null,{"$f":"IF(AH38=\"\",\"\",Jugend!M38)","v":0},{"$f":"IF(Jugend!N38=\"\",0,Jugend!N38)","v":0},{"$f":"IF(Jugend!O38=\"\",0,Jugend!O38)","v":0},null,{"$f":"IF(AL38=\"\",\"\",Jugend!Q38)","v":0},{"$f":"IF(Jugend!R38=\"\",0,Jugend!R38)","v":0},{"$f":"IF(Jugend!S38=\"\",0,Jugend!S38)","v":0},null,{"$f":"IF(AR38=\"\",\"\",'Junioren II'!A38)","v":0},{"$f":"IF(AR38=\"\",\"\",'Junioren II'!B38)","v":0},{"$f":"IF(AR38=\"\",\"\",'Junioren II'!C38)","v":0},{"$f":"IF('Junioren II'!D38=\"\",0,'Junioren II'!D38)","v":0},{"$f":"IF('Junioren II'!E38=\"\",0,'Junioren II'!E38)","v":0},null,{"$f":"IF(AX38=\"\",\"\",'Junioren II'!G38)","v":0},{"$f":"IF(AX38=\"\",\"\",'Junioren II'!H38)","v":0},{"$f":"IF(AX38=\"\",\"\",'Junioren II'!I38)","v":0},{"$f":"IF('Junioren II'!J38=\"\",0,'Junioren II'!J38)","v":0},{"$f":"IF('Junioren II'!K38=\"\",0,'Junioren II'!K38)","v":0},null,{"$f":"IF(BB38=\"\",\"\",'Junioren II'!M38)","v":0},{"$f":"IF('Junioren II'!N38=\"\",0,'Junioren II'!N38)","v":0},{"$f":"IF('Junioren II'!O38=\"\",0,'Junioren II'!O38)","v":0},null,{"$f":"IF(BF38=\"\",\"\",'Junioren II'!Q38)","v":0},{"$f":"IF('Junioren II'!R38=\"\",0,'Junioren II'!R38)","v":0},{"$f":"IF('Junioren II'!S38=\"\",0,'Junioren II'!S38)","v":0},null,{"$f":"IF('UK-König'!A38=\"\",\"\",'UK-König'!A38)","v":""},{"$f":"IF('UK-König'!B38=\"\",\"\",'UK-König'!B38)","v":""},{"$f":"IF('UK-König'!C38=\"\",\"\",'UK-König'!C38)","v":""},null,{"$f":"IF(BP38=\"\",\"\",'Junioren I'!A38)","v":0},{"$f":"IF(BP38=\"\",\"\",'Junioren I'!B38)","v":0},{"$f":"IF(BP38=\"\",\"\",'Junioren I'!C38)","v":0},{"$f":"IF('Junioren I'!D38=\"\",0,'Junioren I'!D38)","v":0},{"$f":"IF('Junioren I'!E38=\"\",0,'Junioren I'!E38)","v":0},null,{"$f":"IF(BV38=\"\",\"\",'Junioren I'!G38)","v":0},{"$f":"IF(BV38=\"\",\"\",'Junioren I'!H38)","v":0},{"$f":"IF(BV38=\"\",\"\",'Junioren I'!I38)","v":0},{"$f":"IF('Junioren I'!J38=\"\",0,'Junioren I'!J38)","v":0},{"$f":"IF('Junioren I'!K38=\"\",0,'Junioren I'!K38)","v":0},null,{"$f":"IF(BZ38=\"\",\"\",'Junioren I'!M38)","v":0},{"$f":"IF('Junioren I'!N38=\"\",0,'Junioren I'!N38)","v":0},{"$f":"IF('Junioren I'!O38=\"\",0,'Junioren I'!O38)","v":0},null,{"$f":"IF(CD38=\"\",\"\",'Junioren I'!Q38)","v":0},{"$f":"IF('Junioren I'!R38=\"\",0,'Junioren I'!R38)","v":0},{"$f":"IF('Junioren I'!S38=\"\",0,'Junioren I'!S38)","v":0},null,{"$f":"IF(CJ38=\"\",\"\",Lichtpunkt!A38)","v":0},{"$f":"IF(CJ38=\"\",\"\",Lichtpunkt!B38)","v":0},{"$f":"IF(CJ38=\"\",\"\",Lichtpunkt!C38)","v":0},{"$f":"IF(Lichtpunkt!D38=\"\",0,Lichtpunkt!D38)","v":0},{"$f":"IF(Lichtpunkt!E38=\"\",0,Lichtpunkt!E38)","v":0},null,{"$f":"IF(CP38=\"\",\"\",Lichtpunkt!G38)","v":0},{"$f":"IF(CP38=\"\",\"\",Lichtpunkt!H38)","v":0},{"$f":"IF(CP38=\"\",\"\",Lichtpunkt!I38)","v":0},{"$f":"IF(Lichtpunkt!J38=\"\",0,Lichtpunkt!J38)","v":0},{"$f":"IF(Lichtpunkt!K38=\"\",0,Lichtpunkt!K38)","v":0},null,{"$f":"IF(CT38=\"\",\"\",Lichtpunkt!M38)","v":0},{"$f":"IF(Lichtpunkt!N38=\"\",0,Lichtpunkt!N38)","v":0},{"$f":"IF(Lichtpunkt!O38=\"\",0,Lichtpunkt!O38)","v":0},null,{"$f":"IF(CX38=\"\",\"\",Lichtpunkt!Q38)","v":0},{"$f":"IF(Lichtpunkt!R38=\"\",0,Lichtpunkt!R38)","v":0},{"$f":"IF(Lichtpunkt!S38=\"\",0,Lichtpunkt!S38)","v":0},null,{"$f":"IF('LP-König'!A38=\"\",\"\",'LP-König'!A38)","v":""},{"$f":"IF('LP-König'!B38=\"\",\"\",'LP-König'!B38)","v":""},{"$f":"IF('LP-König'!C38=\"\",\"\",'LP-König'!C38)","v":""}]
[{"$f":"IF(D39=\"\",\"\",Schüler!A39)","v":0},{"$f":"IF(D39=\"\",\"\",Schüler!B39)","v":0},{"$f":"IF(D39=\"\",\"\",Schüler!C39)","v":0},{"$f":"IF(Schüler!D39=\"\",0,Schüler!D39)","v":0},{"$f":"IF(Schüler!E39=\"\",0,Schüler!E39)","v":0},null,{"$f":"IF(J39=\"\",\"\",Schüler!G39)","v":0},{"$f":"IF(J39=\"\",\"\",Schüler!H39)","v":0},{"$f":"IF(J39=\"\",\"\",Schüler!I39)","v":0},{"$f":"IF(Schüler!J39=\"\",0,Schüler!J39)","v":0},{"$f":"IF(Schüler!K39=\"\",0,Schüler!K39)","v":0},null,{"$f":"IF(N39=\"\",\"\",Schüler!M39)","v":0},{"$f":"IF(Schüler!N39=\"\",0,Schüler!N39)","v":0},{"$f":"IF(Schüler!O39=\"\",0,Schüler!O39)","v":0},null,{"$f":"IF(R39=\"\",\"\",Schüler!Q39)","v":0},{"$f":"IF(Schüler!R39=\"\",0,Schüler!R39)","v":0},{"$f":"IF(Schüler!S39=\"\",0,Schüler!S39)","v":0},null,{"$f":"IF(X39=\"\",\"\",Jugend!A39)","v":0},{"$f":"IF(X39=\"\",\"\",Jugend!B39)","v":0},{"$f":"IF(X39=\"\",\"\",Jugend!C39)","v":0},{"$f":"IF(Jugend!D39=\"\",0,Jugend!D39)","v":0},{"$f":"IF(Jugend!E39=\"\",0,Jugend!E39)","v":0},null,{"$f":"IF(AD39=\"\",\"\",Jugend!G39)","v":0},{"$f":"IF(AD39=\"\",\"\",Jugend!H39)","v":0},{"$f":"IF(AD39=\"\",\"\",Jugend!I39)","v":0},{"$f":"IF(Jugend!J39=\"\",0,Jugend!J39)","v":0},{"$f":"IF(Jugend!K39=\"\",0,Jugend!K39)","v":0},null,{"$f":"IF(AH39=\"\",\"\",Jugend!M39)","v":0},{"$f":"IF(Jugend!N39=\"\",0,Jugend!N39)","v":0},{"$f":"IF(Jugend!O39=\"\",0,Jugend!O39)","v":0},null,{"$f":"IF(AL39=\"\",\"\",Jugend!Q39)","v":0},{"$f":"IF(Jugend!R39=\"\",0,Jugend!R39)","v":0},{"$f":"IF(Jugend!S39=\"\",0,Jugend!S39)","v":0},null,{"$f":"IF(AR39=\"\",\"\",'Junioren II'!A39)","v":0},{"$f":"IF(AR39=\"\",\"\",'Junioren II'!B39)","v":0},{"$f":"IF(AR39=\"\",\"\",'Junioren II'!C39)","v":0},{"$f":"IF('Junioren II'!D39=\"\",0,'Junioren II'!D39)","v":0},{"$f":"IF('Junioren II'!E39=\"\",0,'Junioren II'!E39)","v":0},null,{"$f":"IF(AX39=\"\",\"\",'Junioren II'!G39)","v":0},{"$f":"IF(AX39=\"\",\"\",'Junioren II'!H39)","v":0},{"$f":"IF(AX39=\"\",\"\",'Junioren II'!I39)","v":0},{"$f":"IF('Junioren II'!J39=\"\",0,'Junioren II'!J39)","v":0},{"$f":"IF('Junioren II'!K39=\"\",0,'Junioren II'!K39)","v":0},null,{"$f":"IF(BB39=\"\",\"\",'Junioren II'!M39)","v":0},{"$f":"IF('Junioren II'!N39=\"\",0,'Junioren II'!N39)","v":0},{"$f":"IF('Junioren II'!O39=\"\",0,'Junioren II'!O39)","v":0},null,{"$f":"IF(BF39=\"\",\"\",'Junioren II'!Q39)","v":0},{"$f":"IF('Junioren II'!R39=\"\",0,'Junioren II'!R39)","v":0},{"$f":"IF('Junioren II'!S39=\"\",0,'Junioren II'!S39)","v":0},null,{"$f":"IF('UK-König'!A39=\"\",\"\",'UK-König'!A39)","v":""},{"$f":"IF('UK-König'!B39=\"\",\"\",'UK-König'!B39)","v":""},{"$f":"IF('UK-König'!C39=\"\",\"\",'UK-König'!C39)","v":""},null,{"$f":"IF(BP39=\"\",\"\",'Junioren I'!A39)","v":0},{"$f":"IF(BP39=\"\",\"\",'Junioren I'!B39)","v":0},{"$f":"IF(BP39=\"\",\"\",'Junioren I'!C39)","v":0},{"$f":"IF('Junioren I'!D39=\"\",0,'Junioren I'!D39)","v":0},{"$f":"IF('Junioren I'!E39=\"\",0,'Junioren I'!E39)","v":0},null,{"$f":"IF(BV39=\"\",\"\",'Junioren I'!G39)","v":0},{"$f":"IF(BV39=\"\",\"\",'Junioren I'!H39)","v":0},{"$f":"IF(BV39=\"\",\"\",'Junioren I'!I39)","v":0},{"$f":"IF('Junioren I'!J39=\"\",0,'Junioren I'!J39)","v":0},{"$f":"IF('Junioren I'!K39=\"\",0,'Junioren I'!K39)","v":0},null,{"$f":"IF(BZ39=\"\",\"\",'Junioren I'!M39)","v":0},{"$f":"IF('Junioren I'!N39=\"\",0,'Junioren I'!N39)","v":0},{"$f":"IF('Junioren I'!O39=\"\",0,'Junioren I'!O39)","v":0},null,{"$f":"IF(CD39=\"\",\"\",'Junioren I'!Q39)","v":0},{"$f":"IF('Junioren I'!R39=\"\",0,'Junioren I'!R39)","v":0},{"$f":"IF('Junioren I'!S39=\"\",0,'Junioren I'!S39)","v":0},null,{"$f":"IF(CJ39=\"\",\"\",Lichtpunkt!A39)","v":0},{"$f":"IF(CJ39=\"\",\"\",Lichtpunkt!B39)","v":0},{"$f":"IF(CJ39=\"\",\"\",Lichtpunkt!C39)","v":0},{"$f":"IF(Lichtpunkt!D39=\"\",0,Lichtpunkt!D39)","v":0},{"$f":"IF(Lichtpunkt!E39=\"\",0,Lichtpunkt!E39)","v":0},null,{"$f":"IF(CP39=\"\",\"\",Lichtpunkt!G39)","v":0},{"$f":"IF(CP39=\"\",\"\",Lichtpunkt!H39)","v":0},{"$f":"IF(CP39=\"\",\"\",Lichtpunkt!I39)","v":0},{"$f":"IF(Lichtpunkt!J39=\"\",0,Lichtpunkt!J39)","v":0},{"$f":"IF(Lichtpunkt!K39=\"\",0,Lichtpunkt!K39)","v":0},null,{"$f":"IF(CT39=\"\",\"\",Lichtpunkt!M39)","v":0},{"$f":"IF(Lichtpunkt!N39=\"\",0,Lichtpunkt!N39)","v":0},{"$f":"IF(Lichtpunkt!O39=\"\",0,Lichtpunkt!O39)","v":0},null,{"$f":"IF(CX39=\"\",\"\",Lichtpunkt!Q39)","v":0},{"$f":"IF(Lichtpunkt!R39=\"\",0,Lichtpunkt!R39)","v":0},{"$f":"IF(Lichtpunkt!S39=\"\",0,Lichtpunkt!S39)","v":0},null,{"$f":"IF('LP-König'!A39=\"\",\"\",'LP-König'!A39)","v":""},{"$f":"IF('LP-König'!B39=\"\",\"\",'LP-König'!B39)","v":""},{"$f":"IF('LP-König'!C39=\"\",\"\",'LP-König'!C39)","v":""}]
[{"$f":"IF(D40=\"\",\"\",Schüler!A40)","v":0},{"$f":"IF(D40=\"\",\"\",Schüler!B40)","v":0},{"$f":"IF(D40=\"\",\"\",Schüler!C40)","v":0},{"$f":"IF(Schüler!D40=\"\",0,Schüler!D40)","v":0},{"$f":"IF(Schüler!E40=\"\",0,Schüler!E40)","v":0},null,{"$f":"IF(J40=\"\",\"\",Schüler!G40)","v":0},{"$f":"IF(J40=\"\",\"\",Schüler!H40)","v":0},{"$f":"IF(J40=\"\",\"\",Schüler!I40)","v":0},{"$f":"IF(Schüler!J40=\"\",0,Schüler!J40)","v":0},{"$f":"IF(Schüler!K40=\"\",0,Schüler!K40)","v":0},null,{"$f":"IF(N40=\"\",\"\",Schüler!M40)","v":0},{"$f":"IF(Schüler!N40=\"\",0,Schüler!N40)","v":0},{"$f":"IF(Schüler!O40=\"\",0,Schüler!O40)","v":0},null,{"$f":"IF(R40=\"\",\"\",Schüler!Q40)","v":0},{"$f":"IF(Schüler!R40=\"\",0,Schüler!R40)","v":0},{"$f":"IF(Schüler!S40=\"\",0,Schüler!S40)","v":0},null,{"$f":"IF(X40=\"\",\"\",Jugend!A40)","v":0},{"$f":"IF(X40=\"\",\"\",Jugend!B40)","v":0},{"$f":"IF(X40=\"\",\"\",Jugend!C40)","v":0},{"$f":"IF(Jugend!D40=\"\",0,Jugend!D40)","v":0},{"$f":"IF(Jugend!E40=\"\",0,Jugend!E40)","v":0},null,{"$f":"IF(AD40=\"\",\"\",Jugend!G40)","v":0},{"$f":"IF(AD40=\"\",\"\",Jugend!H40)","v":0},{"$f":"IF(AD40=\"\",\"\",Jugend!I40)","v":0},{"$f":"IF(Jugend!J40=\"\",0,Jugend!J40)","v":0},{"$f":"IF(Jugend!K40=\"\",0,Jugend!K40)","v":0},null,{"$f":"IF(AH40=\"\",\"\",Jugend!M40)","v":0},{"$f":"IF(Jugend!N40=\"\",0,Jugend!N40)","v":0},{"$f":"IF(Jugend!O40=\"\",0,Jugend!O40)","v":0},null,{"$f":"IF(AL40=\"\",\"\",Jugend!Q40)","v":0},{"$f":"IF(Jugend!R40=\"\",0,Jugend!R40)","v":0},{"$f":"IF(Jugend!S40=\"\",0,Jugend!S40)","v":0},null,{"$f":"IF(AR40=\"\",\"\",'Junioren II'!A40)","v":0},{"$f":"IF(AR40=\"\",\"\",'Junioren II'!B40)","v":0},{"$f":"IF(AR40=\"\",\"\",'Junioren II'!C40)","v":0},{"$f":"IF('Junioren II'!D40=\"\",0,'Junioren II'!D40)","v":0},{"$f":"IF('Junioren II'!E40=\"\",0,'Junioren II'!E40)","v":0},null,{"$f":"IF(AX40=\"\",\"\",'Junioren II'!G40)","v":0},{"$f":"IF(AX40=\"\",\"\",'Junioren II'!H40)","v":0},{"$f":"IF(AX40=\"\",\"\",'Junioren II'!I40)","v":0},{"$f":"IF('Junioren II'!J40=\"\",0,'Junioren II'!J40)","v":0},{"$f":"IF('Junioren II'!K40=\"\",0,'Junioren II'!K40)","v":0},null,{"$f":"IF(BB40=\"\",\"\",'Junioren II'!M40)","v":0},{"$f":"IF('Junioren II'!N40=\"\",0,'Junioren II'!N40)","v":0},{"$f":"IF('Junioren II'!O40=\"\",0,'Junioren II'!O40)","v":0},null,{"$f":"IF(BF40=\"\",\"\",'Junioren II'!Q40)","v":0},{"$f":"IF('Junioren II'!R40=\"\",0,'Junioren II'!R40)","v":0},{"$f":"IF('Junioren II'!S40=\"\",0,'Junioren II'!S40)","v":0},null,{"$f":"IF('UK-König'!A40=\"\",\"\",'UK-König'!A40)","v":""},{"$f":"IF('UK-König'!B40=\"\",\"\",'UK-König'!B40)","v":""},{"$f":"IF('UK-König'!C40=\"\",\"\",'UK-König'!C40)","v":""},null,{"$f":"IF(BP40=\"\",\"\",'Junioren I'!A40)","v":0},{"$f":"IF(BP40=\"\",\"\",'Junioren I'!B40)","v":0},{"$f":"IF(BP40=\"\",\"\",'Junioren I'!C40)","v":0},{"$f":"IF('Junioren I'!D40=\"\",0,'Junioren I'!D40)","v":0},{"$f":"IF('Junioren I'!E40=\"\",0,'Junioren I'!E40)","v":0},null,{"$f":"IF(BV40=\"\",\"\",'Junioren I'!G40)","v":0},{"$f":"IF(BV40=\"\",\"\",'Junioren I'!H40)","v":0},{"$f":"IF(BV40=\"\",\"\",'Junioren I'!I40)","v":0},{"$f":"IF('Junioren I'!J40=\"\",0,'Junioren I'!J40)","v":0},{"$f":"IF('Junioren I'!K40=\"\",0,'Junioren I'!K40)","v":0},null,{"$f":"IF(BZ40=\"\",\"\",'Junioren I'!M40)","v":0},{"$f":"IF('Junioren I'!N40=\"\",0,'Junioren I'!N40)","v":0},{"$f":"IF('Junioren I'!O40=\"\",0,'Junioren I'!O40)","v":0},null,{"$f":"IF(CD40=\"\",\"\",'Junioren I'!Q40)","v":0},{"$f":"IF('Junioren I'!R40=\"\",0,'Junioren I'!R40)","v":0},{"$f":"IF('Junioren I'!S40=\"\",0,'Junioren I'!S40)","v":0},null,{"$f":"IF(CJ40=\"\",\"\",Lichtpunkt!A40)","v":0},{"$f":"IF(CJ40=\"\",\"\",Lichtpunkt!B40)","v":0},{"$f":"IF(CJ40=\"\",\"\",Lichtpunkt!C40)","v":0},{"$f":"IF(Lichtpunkt!D40=\"\",0,Lichtpunkt!D40)","v":0},{"$f":"IF(Lichtpunkt!E40=\"\",0,Lichtpunkt!E40)","v":0},null,{"$f":"IF(CP40=\"\",\"\",Lichtpunkt!G40)","v":0},{"$f":"IF(CP40=\"\",\"\",Lichtpunkt!H40)","v":0},{"$f":"IF(CP40=\"\",\"\",Lichtpunkt!I40)","v":0},{"$f":"IF(Lichtpunkt!J40=\"\",0,Lichtpunkt!J40)","v":0},{"$f":"IF(Lichtpunkt!K40=\"\",0,Lichtpunkt!K40)","v":0},null,{"$f":"IF(CT40=\"\",\"\",Lichtpunkt!M40)","v":0},{"$f":"IF(Lichtpunkt!N40=\"\",0,Lichtpunkt!N40)","v":0},{"$f":"IF(Lichtpunkt!O40=\"\",0,Lichtpunkt!O40)","v":0},null,{"$f":"IF(CX40=\"\",\"\",Lichtpunkt!Q40)","v":0},{"$f":"IF(Lichtpunkt!R40=\"\",0,Lichtpunkt!R40)","v":0},{"$f":"IF(Lichtpunkt!S40=\"\",0,Lichtpunkt!S40)","v":0},null,{"$f":"IF('LP-König'!A40=\"\",\"\",'LP-König'!A40)","v":""},{"$f":"IF('LP-König'!B40=\"\",\"\",'LP-König'!B40)","v":""},{"$f":"IF('LP-König'!C40=\"\",\"\",'LP-König'!C40)","v":""}]
[{"$f":"IF(D41=\"\",\"\",Schüler!A41)","v":0},{"$f":"IF(D41=\"\",\"\",Schüler!B41)","v":0},{"$f":"IF(D41=\"\",\"\",Schüler!C41)","v":0},{"$f":"IF(Schüler!D41=\"\",0,Schüler!D41)","v":0},{"$f":"IF(Schüler!E41=\"\",0,Schüler!E41)","v":0},null,{"$f":"IF(J41=\"\",\"\",Schüler!G41)","v":0},{"$f":"IF(J41=\"\",\"\",Schüler!H41)","v":0},{"$f":"IF(J41=\"\",\"\",Schüler!I41)","v":0},{"$f":"IF(Schüler!J41=\"\",0,Schüler!J41)","v":0},{"$f":"IF(Schüler!K41=\"\",0,Schüler!K41)","v":0},null,{"$f":"IF(N41=\"\",\"\",Schüler!M41)","v":0},{"$f":"IF(Schüler!N41=\"\",0,Schüler!N41)","v":0},{"$f":"IF(Schüler!O41=\"\",0,Schüler!O41)","v":0},null,{"$f":"IF(R41=\"\",\"\",Schüler!Q41)","v":0},{"$f":"IF(Schüler!R41=\"\",0,Schüler!R41)","v":0},{"$f":"IF(Schüler!S41=\"\",0,Schüler!S41)","v":0},null,{"$f":"IF(X41=\"\",\"\",Jugend!A41)","v":0},{"$f":"IF(X41=\"\",\"\",Jugend!B41)","v":0},{"$f":"IF(X41=\"\",\"\",Jugend!C41)","v":0},{"$f":"IF(Jugend!D41=\"\",0,Jugend!D41)","v":0},{"$f":"IF(Jugend!E41=\"\",0,Jugend!E41)","v":0},null,{"$f":"IF(AD41=\"\",\"\",Jugend!G41)","v":0},{"$f":"IF(AD41=\"\",\"\",Jugend!H41)","v":0},{"$f":"IF(AD41=\"\",\"\",Jugend!I41)","v":0},{"$f":"IF(Jugend!J41=\"\",0,Jugend!J41)","v":0},{"$f":"IF(Jugend!K41=\"\",0,Jugend!K41)","v":0},null,{"$f":"IF(AH41=\"\",\"\",Jugend!M41)","v":0},{"$f":"IF(Jugend!N41=\"\",0,Jugend!N41)","v":0},{"$f":"IF(Jugend!O41=\"\",0,Jugend!O41)","v":0},null,{"$f":"IF(AL41=\"\",\"\",Jugend!Q41)","v":0},{"$f":"IF(Jugend!R41=\"\",0,Jugend!R41)","v":0},{"$f":"IF(Jugend!S41=\"\",0,Jugend!S41)","v":0},null,{"$f":"IF(AR41=\"\",\"\",'Junioren II'!A41)","v":0},{"$f":"IF(AR41=\"\",\"\",'Junioren II'!B41)","v":0},{"$f":"IF(AR41=\"\",\"\",'Junioren II'!C41)","v":0},{"$f":"IF('Junioren II'!D41=\"\",0,'Junioren II'!D41)","v":0},{"$f":"IF('Junioren II'!E41=\"\",0,'Junioren II'!E41)","v":0},null,{"$f":"IF(AX41=\"\",\"\",'Junioren II'!G41)","v":0},{"$f":"IF(AX41=\"\",\"\",'Junioren II'!H41)","v":0},{"$f":"IF(AX41=\"\",\"\",'Junioren II'!I41)","v":0},{"$f":"IF('Junioren II'!J41=\"\",0,'Junioren II'!J41)","v":0},{"$f":"IF('Junioren II'!K41=\"\",0,'Junioren II'!K41)","v":0},null,{"$f":"IF(BB41=\"\",\"\",'Junioren II'!M41)","v":0},{"$f":"IF('Junioren II'!N41=\"\",0,'Junioren II'!N41)","v":0},{"$f":"IF('Junioren II'!O41=\"\",0,'Junioren II'!O41)","v":0},null,{"$f":"IF(BF41=\"\",\"\",'Junioren II'!Q41)","v":0},{"$f":"IF('Junioren II'!R41=\"\",0,'Junioren II'!R41)","v":0},{"$f":"IF('Junioren II'!S41=\"\",0,'Junioren II'!S41)","v":0},null,{"$f":"IF('UK-König'!A41=\"\",\"\",'UK-König'!A41)","v":""},{"$f":"IF('UK-König'!B41=\"\",\"\",'UK-König'!B41)","v":""},{"$f":"IF('UK-König'!C41=\"\",\"\",'UK-König'!C41)","v":""},null,{"$f":"IF(BP41=\"\",\"\",'Junioren I'!A41)","v":0},{"$f":"IF(BP41=\"\",\"\",'Junioren I'!B41)","v":0},{"$f":"IF(BP41=\"\",\"\",'Junioren I'!C41)","v":0},{"$f":"IF('Junioren I'!D41=\"\",0,'Junioren I'!D41)","v":0},{"$f":"IF('Junioren I'!E41=\"\",0,'Junioren I'!E41)","v":0},null,{"$f":"IF(BV41=\"\",\"\",'Junioren I'!G41)","v":0},{"$f":"IF(BV41=\"\",\"\",'Junioren I'!H41)","v":0},{"$f":"IF(BV41=\"\",\"\",'Junioren I'!I41)","v":0},{"$f":"IF('Junioren I'!J41=\"\",0,'Junioren I'!J41)","v":0},{"$f":"IF('Junioren I'!K41=\"\",0,'Junioren I'!K41)","v":0},null,{"$f":"IF(BZ41=\"\",\"\",'Junioren I'!M41)","v":0},{"$f":"IF('Junioren I'!N41=\"\",0,'Junioren I'!N41)","v":0},{"$f":"IF('Junioren I'!O41=\"\",0,'Junioren I'!O41)","v":0},null,{"$f":"IF(CD41=\"\",\"\",'Junioren I'!Q41)","v":0},{"$f":"IF('Junioren I'!R41=\"\",0,'Junioren I'!R41)","v":0},{"$f":"IF('Junioren I'!S41=\"\",0,'Junioren I'!S41)","v":0},null,{"$f":"IF(CJ41=\"\",\"\",Lichtpunkt!A41)","v":0},{"$f":"IF(CJ41=\"\",\"\",Lichtpunkt!B41)","v":0},{"$f":"IF(CJ41=\"\",\"\",Lichtpunkt!C41)","v":0},{"$f":"IF(Lichtpunkt!D41=\"\",0,Lichtpunkt!D41)","v":0},{"$f":"IF(Lichtpunkt!E41=\"\",0,Lichtpunkt!E41)","v":0},null,{"$f":"IF(CP41=\"\",\"\",Lichtpunkt!G41)","v":0},{"$f":"IF(CP41=\"\",\"\",Lichtpunkt!H41)","v":0},{"$f":"IF(CP41=\"\",\"\",Lichtpunkt!I41)","v":0},{"$f":"IF(Lichtpunkt!J41=\"\",0,Lichtpunkt!J41)","v":0},{"$f":"IF(Lichtpunkt!K41=\"\",0,Lichtpunkt!K41)","v":0},null,{"$f":"IF(CT41=\"\",\"\",Lichtpunkt!M41)","v":0},{"$f":"IF(Lichtpunkt!N41=\"\",0,Lichtpunkt!N41)","v":0},{"$f":"IF(Lichtpunkt!O41=\"\",0,Lichtpunkt!O41)","v":0},null,{"$f":"IF(CX41=\"\",\"\",Lichtpunkt!Q41)","v":0},{"$f":"IF(Lichtpunkt!R41=\"\",0,Lichtpunkt!R41)","v":0},{"$f":"IF(Lichtpunkt!S41=\"\",0,Lichtpunkt!S41)","v":0},null,{"$f":"IF('LP-König'!A41=\"\",\"\",'LP-König'!A41)","v":""},{"$f":"IF('LP-König'!B41=\"\",\"\",'LP-König'!B41)","v":""},{"$f":"IF('LP-König'!C41=\"\",\"\",'LP-König'!C41)","v":""}]
[{"$f":"IF(D42=\"\",\"\",Schüler!A42)","v":0},{"$f":"IF(D42=\"\",\"\",Schüler!B42)","v":0},{"$f":"IF(D42=\"\",\"\",Schüler!C42)","v":0},{"$f":"IF(Schüler!D42=\"\",0,Schüler!D42)","v":0},{"$f":"IF(Schüler!E42=\"\",0,Schüler!E42)","v":0},null,{"$f":"IF(J42=\"\",\"\",Schüler!G42)","v":0},{"$f":"IF(J42=\"\",\"\",Schüler!H42)","v":0},{"$f":"IF(J42=\"\",\"\",Schüler!I42)","v":0},{"$f":"IF(Schüler!J42=\"\",0,Schüler!J42)","v":0},{"$f":"IF(Schüler!K42=\"\",0,Schüler!K42)","v":0},null,{"$f":"IF(N42=\"\",\"\",Schüler!M42)","v":0},{"$f":"IF(Schüler!N42=\"\",0,Schüler!N42)","v":0},{"$f":"IF(Schüler!O42=\"\",0,Schüler!O42)","v":0},null,{"$f":"IF(R42=\"\",\"\",Schüler!Q42)","v":0},{"$f":"IF(Schüler!R42=\"\",0,Schüler!R42)","v":0},{"$f":"IF(Schüler!S42=\"\",0,Schüler!S42)","v":0},null,{"$f":"IF(X42=\"\",\"\",Jugend!A42)","v":0},{"$f":"IF(X42=\"\",\"\",Jugend!B42)","v":0},{"$f":"IF(X42=\"\",\"\",Jugend!C42)","v":0},{"$f":"IF(Jugend!D42=\"\",0,Jugend!D42)","v":0},{"$f":"IF(Jugend!E42=\"\",0,Jugend!E42)","v":0},null,{"$f":"IF(AD42=\"\",\"\",Jugend!G42)","v":0},{"$f":"IF(AD42=\"\",\"\",Jugend!H42)","v":0},{"$f":"IF(AD42=\"\",\"\",Jugend!I42)","v":0},{"$f":"IF(Jugend!J42=\"\",0,Jugend!J42)","v":0},{"$f":"IF(Jugend!K42=\"\",0,Jugend!K42)","v":0},null,{"$f":"IF(AH42=\"\",\"\",Jugend!M42)","v":0},{"$f":"IF(Jugend!N42=\"\",0,Jugend!N42)","v":0},{"$f":"IF(Jugend!O42=\"\",0,Jugend!O42)","v":0},null,{"$f":"IF(AL42=\"\",\"\",Jugend!Q42)","v":0},{"$f":"IF(Jugend!R42=\"\",0,Jugend!R42)","v":0},{"$f":"IF(Jugend!S42=\"\",0,Jugend!S42)","v":0},null,{"$f":"IF(AR42=\"\",\"\",'Junioren II'!A42)","v":0},{"$f":"IF(AR42=\"\",\"\",'Junioren II'!B42)","v":0},{"$f":"IF(AR42=\"\",\"\",'Junioren II'!C42)","v":0},{"$f":"IF('Junioren II'!D42=\"\",0,'Junioren II'!D42)","v":0},{"$f":"IF('Junioren II'!E42=\"\",0,'Junioren II'!E42)","v":0},null,{"$f":"IF(AX42=\"\",\"\",'Junioren II'!G42)","v":0},{"$f":"IF(AX42=\"\",\"\",'Junioren II'!H42)","v":0},{"$f":"IF(AX42=\"\",\"\",'Junioren II'!I42)","v":0},{"$f":"IF('Junioren II'!J42=\"\",0,'Junioren II'!J42)","v":0},{"$f":"IF('Junioren II'!K42=\"\",0,'Junioren II'!K42)","v":0},null,{"$f":"IF(BB42=\"\",\"\",'Junioren II'!M42)","v":0},{"$f":"IF('Junioren II'!N42=\"\",0,'Junioren II'!N42)","v":0},{"$f":"IF('Junioren II'!O42=\"\",0,'Junioren II'!O42)","v":0},null,{"$f":"IF(BF42=\"\",\"\",'Junioren II'!Q42)","v":0},{"$f":"IF('Junioren II'!R42=\"\",0,'Junioren II'!R42)","v":0},{"$f":"IF('Junioren II'!S42=\"\",0,'Junioren II'!S42)","v":0},null,{"$f":"IF('UK-König'!A42=\"\",\"\",'UK-König'!A42)","v":""},{"$f":"IF('UK-König'!B42=\"\",\"\",'UK-König'!B42)","v":""},{"$f":"IF('UK-König'!C42=\"\",\"\",'UK-König'!C42)","v":""},null,{"$f":"IF(BP42=\"\",\"\",'Junioren I'!A42)","v":0},{"$f":"IF(BP42=\"\",\"\",'Junioren I'!B42)","v":0},{"$f":"IF(BP42=\"\",\"\",'Junioren I'!C42)","v":0},{"$f":"IF('Junioren I'!D42=\"\",0,'Junioren I'!D42)","v":0},{"$f":"IF('Junioren I'!E42=\"\",0,'Junioren I'!E42)","v":0},null,{"$f":"IF(BV42=\"\",\"\",'Junioren I'!G42)","v":0},{"$f":"IF(BV42=\"\",\"\",'Junioren I'!H42)","v":0},{"$f":"IF(BV42=\"\",\"\",'Junioren I'!I42)","v":0},{"$f":"IF('Junioren I'!J42=\"\",0,'Junioren I'!J42)","v":0},{"$f":"IF('Junioren I'!K42=\"\",0,'Junioren I'!K42)","v":0},null,{"$f":"IF(BZ42=\"\",\"\",'Junioren I'!M42)","v":0},{"$f":"IF('Junioren I'!N42=\"\",0,'Junioren I'!N42)","v":0},{"$f":"IF('Junioren I'!O42=\"\",0,'Junioren I'!O42)","v":0},null,{"$f":"IF(CD42=\"\",\"\",'Junioren I'!Q42)","v":0},{"$f":"IF('Junioren I'!R42=\"\",0,'Junioren I'!R42)","v":0},{"$f":"IF('Junioren I'!S42=\"\",0,'Junioren I'!S42)","v":0},null,{"$f":"IF(CJ42=\"\",\"\",Lichtpunkt!A42)","v":0},{"$f":"IF(CJ42=\"\",\"\",Lichtpunkt!B42)","v":0},{"$f":"IF(CJ42=\"\",\"\",Lichtpunkt!C42)","v":0},{"$f":"IF(Lichtpunkt!D42=\"\",0,Lichtpunkt!D42)","v":0},{"$f":"IF(Lichtpunkt!E42=\"\",0,Lichtpunkt!E42)","v":0},null,{"$f":"IF(CP42=\"\",\"\",Lichtpunkt!G42)","v":0},{"$f":"IF(CP42=\"\",\"\",Lichtpunkt!H42)","v":0},{"$f":"IF(CP42=\"\",\"\",Lichtpunkt!I42)","v":0},{"$f":"IF(Lichtpunkt!J42=\"\",0,Lichtpunkt!J42)","v":0},{"$f":"IF(Lichtpunkt!K42=\"\",0,Lichtpunkt!K42)","v":0},null,{"$f":"IF(CT42=\"\",\"\",Lichtpunkt!M42)","v":0},{"$f":"IF(Lichtpunkt!N42=\"\",0,Lichtpunkt!N42)","v":0},{"$f":"IF(Lichtpunkt!O42=\"\",0,Lichtpunkt!O42)","v":0},null,{"$f":"IF(CX42=\"\",\"\",Lichtpunkt!Q42)","v":0},{"$f":"IF(Lichtpunkt!R42=\"\",0,Lichtpunkt!R42)","v":0},{"$f":"IF(Lichtpunkt!S42=\"\",0,Lichtpunkt!S42)","v":0},null,{"$f":"IF('LP-König'!A42=\"\",\"\",'LP-König'!A42)","v":""},{"$f":"IF('LP-König'!B42=\"\",\"\",'LP-König'!B42)","v":""},{"$f":"IF('LP-König'!C42=\"\",\"\",'LP-König'!C42)","v":""}]
[{"$f":"IF(D43=\"\",\"\",Schüler!A43)","v":0},{"$f":"IF(D43=\"\",\"\",Schüler!B43)","v":0},{"$f":"IF(D43=\"\",\"\",Schüler!C43)","v":0},{"$f":"IF(Schüler!D43=\"\",0,Schüler!D43)","v":0},{"$f":"IF(Schüler!E43=\"\",0,Schüler!E43)","v":0},null,{"$f":"IF(J43=\"\",\"\",Schüler!G43)","v":0},{"$f":"IF(J43=\"\",\"\",Schüler!H43)","v":0},{"$f":"IF(J43=\"\",\"\",Schüler!I43)","v":0},{"$f":"IF(Schüler!J43=\"\",0,Schüler!J43)","v":0},{"$f":"IF(Schüler!K43=\"\",0,Schüler!K43)","v":0},null,{"$f":"IF(N43=\"\",\"\",Schüler!M43)","v":0},{"$f":"IF(Schüler!N43=\"\",0,Schüler!N43)","v":0},{"$f":"IF(Schüler!O43=\"\",0,Schüler!O43)","v":0},null,{"$f":"IF(R43=\"\",\"\",Schüler!Q43)","v":0},{"$f":"IF(Schüler!R43=\"\",0,Schüler!R43)","v":0},{"$f":"IF(Schüler!S43=\"\",0,Schüler!S43)","v":0},null,{"$f":"IF(X43=\"\",\"\",Jugend!A43)","v":0},{"$f":"IF(X43=\"\",\"\",Jugend!B43)","v":0},{"$f":"IF(X43=\"\",\"\",Jugend!C43)","v":0},{"$f":"IF(Jugend!D43=\"\",0,Jugend!D43)","v":0},{"$f":"IF(Jugend!E43=\"\",0,Jugend!E43)","v":0},null,{"$f":"IF(AD43=\"\",\"\",Jugend!G43)","v":0},{"$f":"IF(AD43=\"\",\"\",Jugend!H43)","v":0},{"$f":"IF(AD43=\"\",\"\",Jugend!I43)","v":0},{"$f":"IF(Jugend!J43=\"\",0,Jugend!J43)","v":0},{"$f":"IF(Jugend!K43=\"\",0,Jugend!K43)","v":0},null,{"$f":"IF(AH43=\"\",\"\",Jugend!M43)","v":0},{"$f":"IF(Jugend!N43=\"\",0,Jugend!N43)","v":0},{"$f":"IF(Jugend!O43=\"\",0,Jugend!O43)","v":0},null,{"$f":"IF(AL43=\"\",\"\",Jugend!Q43)","v":0},{"$f":"IF(Jugend!R43=\"\",0,Jugend!R43)","v":0},{"$f":"IF(Jugend!S43=\"\",0,Jugend!S43)","v":0},null,{"$f":"IF(AR43=\"\",\"\",'Junioren II'!A43)","v":0},{"$f":"IF(AR43=\"\",\"\",'Junioren II'!B43)","v":0},{"$f":"IF(AR43=\"\",\"\",'Junioren II'!C43)","v":0},{"$f":"IF('Junioren II'!D43=\"\",0,'Junioren II'!D43)","v":0},{"$f":"IF('Junioren II'!E43=\"\",0,'Junioren II'!E43)","v":0},null,{"$f":"IF(AX43=\"\",\"\",'Junioren II'!G43)","v":0},{"$f":"IF(AX43=\"\",\"\",'Junioren II'!H43)","v":0},{"$f":"IF(AX43=\"\",\"\",'Junioren II'!I43)","v":0},{"$f":"IF('Junioren II'!J43=\"\",0,'Junioren II'!J43)","v":0},{"$f":"IF('Junioren II'!K43=\"\",0,'Junioren II'!K43)","v":0},null,{"$f":"IF(BB43=\"\",\"\",'Junioren II'!M43)","v":0},{"$f":"IF('Junioren II'!N43=\"\",0,'Junioren II'!N43)","v":0},{"$f":"IF('Junioren II'!O43=\"\",0,'Junioren II'!O43)","v":0},null,{"$f":"IF(BF43=\"\",\"\",'Junioren II'!Q43)","v":0},{"$f":"IF('Junioren II'!R43=\"\",0,'Junioren II'!R43)","v":0},{"$f":"IF('Junioren II'!S43=\"\",0,'Junioren II'!S43)","v":0},null,{"$f":"IF('UK-König'!A43=\"\",\"\",'UK-König'!A43)","v":""},{"$f":"IF('UK-König'!B43=\"\",\"\",'UK-König'!B43)","v":""},{"$f":"IF('UK-König'!C43=\"\",\"\",'UK-König'!C43)","v":""},null,{"$f":"IF(BP43=\"\",\"\",'Junioren I'!A43)","v":0},{"$f":"IF(BP43=\"\",\"\",'Junioren I'!B43)","v":0},{"$f":"IF(BP43=\"\",\"\",'Junioren I'!C43)","v":0},{"$f":"IF('Junioren I'!D43=\"\",0,'Junioren I'!D43)","v":0},{"$f":"IF('Junioren I'!E43=\"\",0,'Junioren I'!E43)","v":0},null,{"$f":"IF(BV43=\"\",\"\",'Junioren I'!G43)","v":0},{"$f":"IF(BV43=\"\",\"\",'Junioren I'!H43)","v":0},{"$f":"IF(BV43=\"\",\"\",'Junioren I'!I43)","v":0},{"$f":"IF('Junioren I'!J43=\"\",0,'Junioren I'!J43)","v":0},{"$f":"IF('Junioren I'!K43=\"\",0,'Junioren I'!K43)","v":0},null,{"$f":"IF(BZ43=\"\",\"\",'Junioren I'!M43)","v":0},{"$f":"IF('Junioren I'!N43=\"\",0,'Junioren I'!N43)","v":0},{"$f":"IF('Junioren I'!O43=\"\",0,'Junioren I'!O43)","v":0},null,{"$f":"IF(CD43=\"\",\"\",'Junioren I'!Q43)","v":0},{"$f":"IF('Junioren I'!R43=\"\",0,'Junioren I'!R43)","v":0},{"$f":"IF('Junioren I'!S43=\"\",0,'Junioren I'!S43)","v":0},null,{"$f":"IF(CJ43=\"\",\"\",Lichtpunkt!A43)","v":0},{"$f":"IF(CJ43=\"\",\"\",Lichtpunkt!B43)","v":0},{"$f":"IF(CJ43=\"\",\"\",Lichtpunkt!C43)","v":0},{"$f":"IF(Lichtpunkt!D43=\"\",0,Lichtpunkt!D43)","v":0},{"$f":"IF(Lichtpunkt!E43=\"\",0,Lichtpunkt!E43)","v":0},null,{"$f":"IF(CP43=\"\",\"\",Lichtpunkt!G43)","v":0},{"$f":"IF(CP43=\"\",\"\",Lichtpunkt!H43)","v":0},{"$f":"IF(CP43=\"\",\"\",Lichtpunkt!I43)","v":0},{"$f":"IF(Lichtpunkt!J43=\"\",0,Lichtpunkt!J43)","v":0},{"$f":"IF(Lichtpunkt!K43=\"\",0,Lichtpunkt!K43)","v":0},null,{"$f":"IF(CT43=\"\",\"\",Lichtpunkt!M43)","v":0},{"$f":"IF(Lichtpunkt!N43=\"\",0,Lichtpunkt!N43)","v":0},{"$f":"IF(Lichtpunkt!O43=\"\",0,Lichtpunkt!O43)","v":0},null,{"$f":"IF(CX43=\"\",\"\",Lichtpunkt!Q43)","v":0},{"$f":"IF(Lichtpunkt!R43=\"\",0,Lichtpunkt!R43)","v":0},{"$f":"IF(Lichtpunkt!S43=\"\",0,Lichtpunkt!S43)","v":0},null,{"$f":"IF('LP-König'!A43=\"\",\"\",'LP-König'!A43)","v":""},{"$f":"IF('LP-König'!B43=\"\",\"\",'LP-König'!B43)","v":""},{"$f":"IF('LP-König'!C43=\"\",\"\",'LP-König'!C43)","v":""}]
[{"$f":"IF(D44=\"\",\"\",Schüler!A44)","v":0},{"$f":"IF(D44=\"\",\"\",Schüler!B44)","v":0},{"$f":"IF(D44=\"\",\"\",Schüler!C44)","v":0},{"$f":"IF(Schüler!D44=\"\",0,Schüler!D44)","v":0},{"$f":"IF(Schüler!E44=\"\",0,Schüler!E44)","v":0},null,{"$f":"IF(J44=\"\",\"\",Schüler!G44)","v":0},{"$f":"IF(J44=\"\",\"\",Schüler!H44)","v":0},{"$f":"IF(J44=\"\",\"\",Schüler!I44)","v":0},{"$f":"IF(Schüler!J44=\"\",0,Schüler!J44)","v":0},{"$f":"IF(Schüler!K44=\"\",0,Schüler!K44)","v":0},null,{"$f":"IF(N44=\"\",\"\",Schüler!M44)","v":0},{"$f":"IF(Schüler!N44=\"\",0,Schüler!N44)","v":0},{"$f":"IF(Schüler!O44=\"\",0,Schüler!O44)","v":0},null,{"$f":"IF(R44=\"\",\"\",Schüler!Q44)","v":0},{"$f":"IF(Schüler!R44=\"\",0,Schüler!R44)","v":0},{"$f":"IF(Schüler!S44=\"\",0,Schüler!S44)","v":0},null,{"$f":"IF(X44=\"\",\"\",Jugend!A44)","v":0},{"$f":"IF(X44=\"\",\"\",Jugend!B44)","v":0},{"$f":"IF(X44=\"\",\"\",Jugend!C44)","v":0},{"$f":"IF(Jugend!D44=\"\",0,Jugend!D44)","v":0},{"$f":"IF(Jugend!E44=\"\",0,Jugend!E44)","v":0},null,{"$f":"IF(AD44=\"\",\"\",Jugend!G44)","v":0},{"$f":"IF(AD44=\"\",\"\",Jugend!H44)","v":0},{"$f":"IF(AD44=\"\",\"\",Jugend!I44)","v":0},{"$f":"IF(Jugend!J44=\"\",0,Jugend!J44)","v":0},{"$f":"IF(Jugend!K44=\"\",0,Jugend!K44)","v":0},null,{"$f":"IF(AH44=\"\",\"\",Jugend!M44)","v":0},{"$f":"IF(Jugend!N44=\"\",0,Jugend!N44)","v":0},{"$f":"IF(Jugend!O44=\"\",0,Jugend!O44)","v":0},null,{"$f":"IF(AL44=\"\",\"\",Jugend!Q44)","v":0},{"$f":"IF(Jugend!R44=\"\",0,Jugend!R44)","v":0},{"$f":"IF(Jugend!S44=\"\",0,Jugend!S44)","v":0},null,{"$f":"IF(AR44=\"\",\"\",'Junioren II'!A44)","v":0},{"$f":"IF(AR44=\"\",\"\",'Junioren II'!B44)","v":0},{"$f":"IF(AR44=\"\",\"\",'Junioren II'!C44)","v":0},{"$f":"IF('Junioren II'!D44=\"\",0,'Junioren II'!D44)","v":0},{"$f":"IF('Junioren II'!E44=\"\",0,'Junioren II'!E44)","v":0},null,{"$f":"IF(AX44=\"\",\"\",'Junioren II'!G44)","v":0},{"$f":"IF(AX44=\"\",\"\",'Junioren II'!H44)","v":0},{"$f":"IF(AX44=\"\",\"\",'Junioren II'!I44)","v":0},{"$f":"IF('Junioren II'!J44=\"\",0,'Junioren II'!J44)","v":0},{"$f":"IF('Junioren II'!K44=\"\",0,'Junioren II'!K44)","v":0},null,{"$f":"IF(BB44=\"\",\"\",'Junioren II'!M44)","v":0},{"$f":"IF('Junioren II'!N44=\"\",0,'Junioren II'!N44)","v":0},{"$f":"IF('Junioren II'!O44=\"\",0,'Junioren II'!O44)","v":0},null,{"$f":"IF(BF44=\"\",\"\",'Junioren II'!Q44)","v":0},{"$f":"IF('Junioren II'!R44=\"\",0,'Junioren II'!R44)","v":0},{"$f":"IF('Junioren II'!S44=\"\",0,'Junioren II'!S44)","v":0},null,{"$f":"IF('UK-König'!A44=\"\",\"\",'UK-König'!A44)","v":""},{"$f":"IF('UK-König'!B44=\"\",\"\",'UK-König'!B44)","v":""},{"$f":"IF('UK-König'!C44=\"\",\"\",'UK-König'!C44)","v":""},null,{"$f":"IF(BP44=\"\",\"\",'Junioren I'!A44)","v":0},{"$f":"IF(BP44=\"\",\"\",'Junioren I'!B44)","v":0},{"$f":"IF(BP44=\"\",\"\",'Junioren I'!C44)","v":0},{"$f":"IF('Junioren I'!D44=\"\",0,'Junioren I'!D44)","v":0},{"$f":"IF('Junioren I'!E44=\"\",0,'Junioren I'!E44)","v":0},null,{"$f":"IF(BV44=\"\",\"\",'Junioren I'!G44)","v":0},{"$f":"IF(BV44=\"\",\"\",'Junioren I'!H44)","v":0},{"$f":"IF(BV44=\"\",\"\",'Junioren I'!I44)","v":0},{"$f":"IF('Junioren I'!J44=\"\",0,'Junioren I'!J44)","v":0},{"$f":"IF('Junioren I'!K44=\"\",0,'Junioren I'!K44)","v":0},null,{"$f":"IF(BZ44=\"\",\"\",'Junioren I'!M44)","v":0},{"$f":"IF('Junioren I'!N44=\"\",0,'Junioren I'!N44)","v":0},{"$f":"IF('Junioren I'!O44=\"\",0,'Junioren I'!O44)","v":0},null,{"$f":"IF(CD44=\"\",\"\",'Junioren I'!Q44)","v":0},{"$f":"IF('Junioren I'!R44=\"\",0,'Junioren I'!R44)","v":0},{"$f":"IF('Junioren I'!S44=\"\",0,'Junioren I'!S44)","v":0},null,{"$f":"IF(CJ44=\"\",\"\",Lichtpunkt!A44)","v":0},{"$f":"IF(CJ44=\"\",\"\",Lichtpunkt!B44)","v":0},{"$f":"IF(CJ44=\"\",\"\",Lichtpunkt!C44)","v":0},{"$f":"IF(Lichtpunkt!D44=\"\",0,Lichtpunkt!D44)","v":0},{"$f":"IF(Lichtpunkt!E44=\"\",0,Lichtpunkt!E44)","v":0},null,{"$f":"IF(CP44=\"\",\"\",Lichtpunkt!G44)","v":0},{"$f":"IF(CP44=\"\",\"\",Lichtpunkt!H44)","v":0},{"$f":"IF(CP44=\"\",\"\",Lichtpunkt!I44)","v":0},{"$f":"IF(Lichtpunkt!J44=\"\",0,Lichtpunkt!J44)","v":0},{"$f":"IF(Lichtpunkt!K44=\"\",0,Lichtpunkt!K44)","v":0},null,{"$f":"IF(CT44=\"\",\"\",Lichtpunkt!M44)","v":0},{"$f":"IF(Lichtpunkt!N44=\"\",0,Lichtpunkt!N44)","v":0},{"$f":"IF(Lichtpunkt!O44=\"\",0,Lichtpunkt!O44)","v":0},null,{"$f":"IF(CX44=\"\",\"\",Lichtpunkt!Q44)","v":0},{"$f":"IF(Lichtpunkt!R44=\"\",0,Lichtpunkt!R44)","v":0},{"$f":"IF(Lichtpunkt!S44=\"\",0,Lichtpunkt!S44)","v":0},null,{"$f":"IF('LP-König'!A44=\"\",\"\",'LP-König'!A44)","v":""},{"$f":"IF('LP-König'!B44=\"\",\"\",'LP-König'!B44)","v":""},{"$f":"IF('LP-König'!C44=\"\",\"\",'LP-König'!C44)","v":""}]
[{"$f":"IF(D45=\"\",\"\",Schüler!A45)","v":0},{"$f":"IF(D45=\"\",\"\",Schüler!B45)","v":0},{"$f":"IF(D45=\"\",\"\",Schüler!C45)","v":0},{"$f":"IF(Schüler!D45=\"\",0,Schüler!D45)","v":0},{"$f":"IF(Schüler!E45=\"\",0,Schüler!E45)","v":0},null,{"$f":"IF(J45=\"\",\"\",Schüler!G45)","v":0},{"$f":"IF(J45=\"\",\"\",Schüler!H45)","v":0},{"$f":"IF(J45=\"\",\"\",Schüler!I45)","v":0},{"$f":"IF(Schüler!J45=\"\",0,Schüler!J45)","v":0},{"$f":"IF(Schüler!K45=\"\",0,Schüler!K45)","v":0},null,{"$f":"IF(N45=\"\",\"\",Schüler!M45)","v":0},{"$f":"IF(Schüler!N45=\"\",0,Schüler!N45)","v":0},{"$f":"IF(Schüler!O45=\"\",0,Schüler!O45)","v":0},null,{"$f":"IF(R45=\"\",\"\",Schüler!Q45)","v":0},{"$f":"IF(Schüler!R45=\"\",0,Schüler!R45)","v":0},{"$f":"IF(Schüler!S45=\"\",0,Schüler!S45)","v":0},null,{"$f":"IF(X45=\"\",\"\",Jugend!A45)","v":0},{"$f":"IF(X45=\"\",\"\",Jugend!B45)","v":0},{"$f":"IF(X45=\"\",\"\",Jugend!C45)","v":0},{"$f":"IF(Jugend!D45=\"\",0,Jugend!D45)","v":0},{"$f":"IF(Jugend!E45=\"\",0,Jugend!E45)","v":0},null,{"$f":"IF(AD45=\"\",\"\",Jugend!G45)","v":0},{"$f":"IF(AD45=\"\",\"\",Jugend!H45)","v":0},{"$f":"IF(AD45=\"\",\"\",Jugend!I45)","v":0},{"$f":"IF(Jugend!J45=\"\",0,Jugend!J45)","v":0},{"$f":"IF(Jugend!K45=\"\",0,Jugend!K45)","v":0},null,{"$f":"IF(AH45=\"\",\"\",Jugend!M45)","v":0},{"$f":"IF(Jugend!N45=\"\",0,Jugend!N45)","v":0},{"$f":"IF(Jugend!O45=\"\",0,Jugend!O45)","v":0},null,{"$f":"IF(AL45=\"\",\"\",Jugend!Q45)","v":0},{"$f":"IF(Jugend!R45=\"\",0,Jugend!R45)","v":0},{"$f":"IF(Jugend!S45=\"\",0,Jugend!S45)","v":0},null,{"$f":"IF(AR45=\"\",\"\",'Junioren II'!A45)","v":0},{"$f":"IF(AR45=\"\",\"\",'Junioren II'!B45)","v":0},{"$f":"IF(AR45=\"\",\"\",'Junioren II'!C45)","v":0},{"$f":"IF('Junioren II'!D45=\"\",0,'Junioren II'!D45)","v":0},{"$f":"IF('Junioren II'!E45=\"\",0,'Junioren II'!E45)","v":0},null,{"$f":"IF(AX45=\"\",\"\",'Junioren II'!G45)","v":0},{"$f":"IF(AX45=\"\",\"\",'Junioren II'!H45)","v":0},{"$f":"IF(AX45=\"\",\"\",'Junioren II'!I45)","v":0},{"$f":"IF('Junioren II'!J45=\"\",0,'Junioren II'!J45)","v":0},{"$f":"IF('Junioren II'!K45=\"\",0,'Junioren II'!K45)","v":0},null,{"$f":"IF(BB45=\"\",\"\",'Junioren II'!M45)","v":0},{"$f":"IF('Junioren II'!N45=\"\",0,'Junioren II'!N45)","v":0},{"$f":"IF('Junioren II'!O45=\"\",0,'Junioren II'!O45)","v":0},null,{"$f":"IF(BF45=\"\",\"\",'Junioren II'!Q45)","v":0},{"$f":"IF('Junioren II'!R45=\"\",0,'Junioren II'!R45)","v":0},{"$f":"IF('Junioren II'!S45=\"\",0,'Junioren II'!S45)","v":0},null,{"$f":"IF('UK-König'!A45=\"\",\"\",'UK-König'!A45)","v":""},{"$f":"IF('UK-König'!B45=\"\",\"\",'UK-König'!B45)","v":""},{"$f":"IF('UK-König'!C45=\"\",\"\",'UK-König'!C45)","v":""},null,{"$f":"IF(BP45=\"\",\"\",'Junioren I'!A45)","v":0},{"$f":"IF(BP45=\"\",\"\",'Junioren I'!B45)","v":0},{"$f":"IF(BP45=\"\",\"\",'Junioren I'!C45)","v":0},{"$f":"IF('Junioren I'!D45=\"\",0,'Junioren I'!D45)","v":0},{"$f":"IF('Junioren I'!E45=\"\",0,'Junioren I'!E45)","v":0},null,{"$f":"IF(BV45=\"\",\"\",'Junioren I'!G45)","v":0},{"$f":"IF(BV45=\"\",\"\",'Junioren I'!H45)","v":0},{"$f":"IF(BV45=\"\",\"\",'Junioren I'!I45)","v":0},{"$f":"IF('Junioren I'!J45=\"\",0,'Junioren I'!J45)","v":0},{"$f":"IF('Junioren I'!K45=\"\",0,'Junioren I'!K45)","v":0},null,{"$f":"IF(BZ45=\"\",\"\",'Junioren I'!M45)","v":0},{"$f":"IF('Junioren I'!N45=\"\",0,'Junioren I'!N45)","v":0},{"$f":"IF('Junioren I'!O45=\"\",0,'Junioren I'!O45)","v":0},null,{"$f":"IF(CD45=\"\",\"\",'Junioren I'!Q45)","v":0},{"$f":"IF('Junioren I'!R45=\"\",0,'Junioren I'!R45)","v":0},{"$f":"IF('Junioren I'!S45=\"\",0,'Junioren I'!S45)","v":0},null,{"$f":"IF(CJ45=\"\",\"\",Lichtpunkt!A45)","v":0},{"$f":"IF(CJ45=\"\",\"\",Lichtpunkt!B45)","v":0},{"$f":"IF(CJ45=\"\",\"\",Lichtpunkt!C45)","v":0},{"$f":"IF(Lichtpunkt!D45=\"\",0,Lichtpunkt!D45)","v":0},{"$f":"IF(Lichtpunkt!E45=\"\",0,Lichtpunkt!E45)","v":0},null,{"$f":"IF(CP45=\"\",\"\",Lichtpunkt!G45)","v":0},{"$f":"IF(CP45=\"\",\"\",Lichtpunkt!H45)","v":0},{"$f":"IF(CP45=\"\",\"\",Lichtpunkt!I45)","v":0},{"$f":"IF(Lichtpunkt!J45=\"\",0,Lichtpunkt!J45)","v":0},{"$f":"IF(Lichtpunkt!K45=\"\",0,Lichtpunkt!K45)","v":0},null,{"$f":"IF(CT45=\"\",\"\",Lichtpunkt!M45)","v":0},{"$f":"IF(Lichtpunkt!N45=\"\",0,Lichtpunkt!N45)","v":0},{"$f":"IF(Lichtpunkt!O45=\"\",0,Lichtpunkt!O45)","v":0},null,{"$f":"IF(CX45=\"\",\"\",Lichtpunkt!Q45)","v":0},{"$f":"IF(Lichtpunkt!R45=\"\",0,Lichtpunkt!R45)","v":0},{"$f":"IF(Lichtpunkt!S45=\"\",0,Lichtpunkt!S45)","v":0},null,{"$f":"IF('LP-König'!A45=\"\",\"\",'LP-König'!A45)","v":""},{"$f":"IF('LP-König'!B45=\"\",\"\",'LP-König'!B45)","v":""},{"$f":"IF('LP-König'!C45=\"\",\"\",'LP-König'!C45)","v":""}]
[{"$f":"IF(D46=\"\",\"\",Schüler!A46)","v":0},{"$f":"IF(D46=\"\",\"\",Schüler!B46)","v":0},{"$f":"IF(D46=\"\",\"\",Schüler!C46)","v":0},{"$f":"IF(Schüler!D46=\"\",0,Schüler!D46)","v":0},{"$f":"IF(Schüler!E46=\"\",0,Schüler!E46)","v":0},null,{"$f":"IF(J46=\"\",\"\",Schüler!G46)","v":0},{"$f":"IF(J46=\"\",\"\",Schüler!H46)","v":0},{"$f":"IF(J46=\"\",\"\",Schüler!I46)","v":0},{"$f":"IF(Schüler!J46=\"\",0,Schüler!J46)","v":0},{"$f":"IF(Schüler!K46=\"\",0,Schüler!K46)","v":0},null,{"$f":"IF(N46=\"\",\"\",Schüler!M46)","v":0},{"$f":"IF(Schüler!N46=\"\",0,Schüler!N46)","v":0},{"$f":"IF(Schüler!O46=\"\",0,Schüler!O46)","v":0},null,{"$f":"IF(R46=\"\",\"\",Schüler!Q46)","v":0},{"$f":"IF(Schüler!R46=\"\",0,Schüler!R46)","v":0},{"$f":"IF(Schüler!S46=\"\",0,Schüler!S46)","v":0},null,{"$f":"IF(X46=\"\",\"\",Jugend!A46)","v":0},{"$f":"IF(X46=\"\",\"\",Jugend!B46)","v":0},{"$f":"IF(X46=\"\",\"\",Jugend!C46)","v":0},{"$f":"IF(Jugend!D46=\"\",0,Jugend!D46)","v":0},{"$f":"IF(Jugend!E46=\"\",0,Jugend!E46)","v":0},null,{"$f":"IF(AD46=\"\",\"\",Jugend!G46)","v":0},{"$f":"IF(AD46=\"\",\"\",Jugend!H46)","v":0},{"$f":"IF(AD46=\"\",\"\",Jugend!I46)","v":0},{"$f":"IF(Jugend!J46=\"\",0,Jugend!J46)","v":0},{"$f":"IF(Jugend!K46=\"\",0,Jugend!K46)","v":0},null,{"$f":"IF(AH46=\"\",\"\",Jugend!M46)","v":0},{"$f":"IF(Jugend!N46=\"\",0,Jugend!N46)","v":0},{"$f":"IF(Jugend!O46=\"\",0,Jugend!O46)","v":0},null,{"$f":"IF(AL46=\"\",\"\",Jugend!Q46)","v":0},{"$f":"IF(Jugend!R46=\"\",0,Jugend!R46)","v":0},{"$f":"IF(Jugend!S46=\"\",0,Jugend!S46)","v":0},null,{"$f":"IF(AR46=\"\",\"\",'Junioren II'!A46)","v":0},{"$f":"IF(AR46=\"\",\"\",'Junioren II'!B46)","v":0},{"$f":"IF(AR46=\"\",\"\",'Junioren II'!C46)","v":0},{"$f":"IF('Junioren II'!D46=\"\",0,'Junioren II'!D46)","v":0},{"$f":"IF('Junioren II'!E46=\"\",0,'Junioren II'!E46)","v":0},null,{"$f":"IF(AX46=\"\",\"\",'Junioren II'!G46)","v":0},{"$f":"IF(AX46=\"\",\"\",'Junioren II'!H46)","v":0},{"$f":"IF(AX46=\"\",\"\",'Junioren II'!I46)","v":0},{"$f":"IF('Junioren II'!J46=\"\",0,'Junioren II'!J46)","v":0},{"$f":"IF('Junioren II'!K46=\"\",0,'Junioren II'!K46)","v":0},null,{"$f":"IF(BB46=\"\",\"\",'Junioren II'!M46)","v":0},{"$f":"IF('Junioren II'!N46=\"\",0,'Junioren II'!N46)","v":0},{"$f":"IF('Junioren II'!O46=\"\",0,'Junioren II'!O46)","v":0},null,{"$f":"IF(BF46=\"\",\"\",'Junioren II'!Q46)","v":0},{"$f":"IF('Junioren II'!R46=\"\",0,'Junioren II'!R46)","v":0},{"$f":"IF('Junioren II'!S46=\"\",0,'Junioren II'!S46)","v":0},null,{"$f":"IF('UK-König'!A46=\"\",\"\",'UK-König'!A46)","v":""},{"$f":"IF('UK-König'!B46=\"\",\"\",'UK-König'!B46)","v":""},{"$f":"IF('UK-König'!C46=\"\",\"\",'UK-König'!C46)","v":""},null,{"$f":"IF(BP46=\"\",\"\",'Junioren I'!A46)","v":0},{"$f":"IF(BP46=\"\",\"\",'Junioren I'!B46)","v":0},{"$f":"IF(BP46=\"\",\"\",'Junioren I'!C46)","v":0},{"$f":"IF('Junioren I'!D46=\"\",0,'Junioren I'!D46)","v":0},{"$f":"IF('Junioren I'!E46=\"\",0,'Junioren I'!E46)","v":0},null,{"$f":"IF(BV46=\"\",\"\",'Junioren I'!G46)","v":0},{"$f":"IF(BV46=\"\",\"\",'Junioren I'!H46)","v":0},{"$f":"IF(BV46=\"\",\"\",'Junioren I'!I46)","v":0},{"$f":"IF('Junioren I'!J46=\"\",0,'Junioren I'!J46)","v":0},{"$f":"IF('Junioren I'!K46=\"\",0,'Junioren I'!K46)","v":0},null,{"$f":"IF(BZ46=\"\",\"\",'Junioren I'!M46)","v":0},{"$f":"IF('Junioren I'!N46=\"\",0,'Junioren I'!N46)","v":0},{"$f":"IF('Junioren I'!O46=\"\",0,'Junioren I'!O46)","v":0},null,{"$f":"IF(CD46=\"\",\"\",'Junioren I'!Q46)","v":0},{"$f":"IF('Junioren I'!R46=\"\",0,'Junioren I'!R46)","v":0},{"$f":"IF('Junioren I'!S46=\"\",0,'Junioren I'!S46)","v":0},null,{"$f":"IF(CJ46=\"\",\"\",Lichtpunkt!A46)","v":0},{"$f":"IF(CJ46=\"\",\"\",Lichtpunkt!B46)","v":0},{"$f":"IF(CJ46=\"\",\"\",Lichtpunkt!C46)","v":0},{"$f":"IF(Lichtpunkt!D46=\"\",0,Lichtpunkt!D46)","v":0},{"$f":"IF(Lichtpunkt!E46=\"\",0,Lichtpunkt!E46)","v":0},null,{"$f":"IF(CP46=\"\",\"\",Lichtpunkt!G46)","v":0},{"$f":"IF(CP46=\"\",\"\",Lichtpunkt!H46)","v":0},{"$f":"IF(CP46=\"\",\"\",Lichtpunkt!I46)","v":0},{"$f":"IF(Lichtpunkt!J46=\"\",0,Lichtpunkt!J46)","v":0},{"$f":"IF(Lichtpunkt!K46=\"\",0,Lichtpunkt!K46)","v":0},null,{"$f":"IF(CT46=\"\",\"\",Lichtpunkt!M46)","v":0},{"$f":"IF(Lichtpunkt!N46=\"\",0,Lichtpunkt!N46)","v":0},{"$f":"IF(Lichtpunkt!O46=\"\",0,Lichtpunkt!O46)","v":0},null,{"$f":"IF(CX46=\"\",\"\",Lichtpunkt!Q46)","v":0},{"$f":"IF(Lichtpunkt!R46=\"\",0,Lichtpunkt!R46)","v":0},{"$f":"IF(Lichtpunkt!S46=\"\",0,Lichtpunkt!S46)","v":0},null,{"$f":"IF('LP-König'!A46=\"\",\"\",'LP-König'!A46)","v":""},{"$f":"IF('LP-König'!B46=\"\",\"\",'LP-König'!B46)","v":""},{"$f":"IF('LP-König'!C46=\"\",\"\",'LP-König'!C46)","v":""}]
[{"$f":"IF(D47=\"\",\"\",Schüler!A47)","v":0},{"$f":"IF(D47=\"\",\"\",Schüler!B47)","v":0},{"$f":"IF(D47=\"\",\"\",Schüler!C47)","v":0},{"$f":"IF(Schüler!D47=\"\",0,Schüler!D47)","v":0},{"$f":"IF(Schüler!E47=\"\",0,Schüler!E47)","v":0},null,{"$f":"IF(J47=\"\",\"\",Schüler!G47)","v":0},{"$f":"IF(J47=\"\",\"\",Schüler!H47)","v":0},{"$f":"IF(J47=\"\",\"\",Schüler!I47)","v":0},{"$f":"IF(Schüler!J47=\"\",0,Schüler!J47)","v":0},{"$f":"IF(Schüler!K47=\"\",0,Schüler!K47)","v":0},null,{"$f":"IF(N47=\"\",\"\",Schüler!M47)","v":0},{"$f":"IF(Schüler!N47=\"\",0,Schüler!N47)","v":0},{"$f":"IF(Schüler!O47=\"\",0,Schüler!O47)","v":0},null,{"$f":"IF(R47=\"\",\"\",Schüler!Q47)","v":0},{"$f":"IF(Schüler!R47=\"\",0,Schüler!R47)","v":0},{"$f":"IF(Schüler!S47=\"\",0,Schüler!S47)","v":0},null,{"$f":"IF(X47=\"\",\"\",Jugend!A47)","v":0},{"$f":"IF(X47=\"\",\"\",Jugend!B47)","v":0},{"$f":"IF(X47=\"\",\"\",Jugend!C47)","v":0},{"$f":"IF(Jugend!D47=\"\",0,Jugend!D47)","v":0},{"$f":"IF(Jugend!E47=\"\",0,Jugend!E47)","v":0},null,{"$f":"IF(AD47=\"\",\"\",Jugend!G47)","v":0},{"$f":"IF(AD47=\"\",\"\",Jugend!H47)","v":0},{"$f":"IF(AD47=\"\",\"\",Jugend!I47)","v":0},{"$f":"IF(Jugend!J47=\"\",0,Jugend!J47)","v":0},{"$f":"IF(Jugend!K47=\"\",0,Jugend!K47)","v":0},null,{"$f":"IF(AH47=\"\",\"\",Jugend!M47)","v":0},{"$f":"IF(Jugend!N47=\"\",0,Jugend!N47)","v":0},{"$f":"IF(Jugend!O47=\"\",0,Jugend!O47)","v":0},null,{"$f":"IF(AL47=\"\",\"\",Jugend!Q47)","v":0},{"$f":"IF(Jugend!R47=\"\",0,Jugend!R47)","v":0},{"$f":"IF(Jugend!S47=\"\",0,Jugend!S47)","v":0},null,{"$f":"IF(AR47=\"\",\"\",'Junioren II'!A47)","v":0},{"$f":"IF(AR47=\"\",\"\",'Junioren II'!B47)","v":0},{"$f":"IF(AR47=\"\",\"\",'Junioren II'!C47)","v":0},{"$f":"IF('Junioren II'!D47=\"\",0,'Junioren II'!D47)","v":0},{"$f":"IF('Junioren II'!E47=\"\",0,'Junioren II'!E47)","v":0},null,{"$f":"IF(AX47=\"\",\"\",'Junioren II'!G47)","v":0},{"$f":"IF(AX47=\"\",\"\",'Junioren II'!H47)","v":0},{"$f":"IF(AX47=\"\",\"\",'Junioren II'!I47)","v":0},{"$f":"IF('Junioren II'!J47=\"\",0,'Junioren II'!J47)","v":0},{"$f":"IF('Junioren II'!K47=\"\",0,'Junioren II'!K47)","v":0},null,{"$f":"IF(BB47=\"\",\"\",'Junioren II'!M47)","v":0},{"$f":"IF('Junioren II'!N47=\"\",0,'Junioren II'!N47)","v":0},{"$f":"IF('Junioren II'!O47=\"\",0,'Junioren II'!O47)","v":0},null,{"$f":"IF(BF47=\"\",\"\",'Junioren II'!Q47)","v":0},{"$f":"IF('Junioren II'!R47=\"\",0,'Junioren II'!R47)","v":0},{"$f":"IF('Junioren II'!S47=\"\",0,'Junioren II'!S47)","v":0},null,{"$f":"IF('UK-König'!A47=\"\",\"\",'UK-König'!A47)","v":""},{"$f":"IF('UK-König'!B47=\"\",\"\",'UK-König'!B47)","v":""},{"$f":"IF('UK-König'!C47=\"\",\"\",'UK-König'!C47)","v":""},null,{"$f":"IF(BP47=\"\",\"\",'Junioren I'!A47)","v":0},{"$f":"IF(BP47=\"\",\"\",'Junioren I'!B47)","v":0},{"$f":"IF(BP47=\"\",\"\",'Junioren I'!C47)","v":0},{"$f":"IF('Junioren I'!D47=\"\",0,'Junioren I'!D47)","v":0},{"$f":"IF('Junioren I'!E47=\"\",0,'Junioren I'!E47)","v":0},null,{"$f":"IF(BV47=\"\",\"\",'Junioren I'!G47)","v":0},{"$f":"IF(BV47=\"\",\"\",'Junioren I'!H47)","v":0},{"$f":"IF(BV47=\"\",\"\",'Junioren I'!I47)","v":0},{"$f":"IF('Junioren I'!J47=\"\",0,'Junioren I'!J47)","v":0},{"$f":"IF('Junioren I'!K47=\"\",0,'Junioren I'!K47)","v":0},null,{"$f":"IF(BZ47=\"\",\"\",'Junioren I'!M47)","v":0},{"$f":"IF('Junioren I'!N47=\"\",0,'Junioren I'!N47)","v":0},{"$f":"IF('Junioren I'!O47=\"\",0,'Junioren I'!O47)","v":0},null,{"$f":"IF(CD47=\"\",\"\",'Junioren I'!Q47)","v":0},{"$f":"IF('Junioren I'!R47=\"\",0,'Junioren I'!R47)","v":0},{"$f":"IF('Junioren I'!S47=\"\",0,'Junioren I'!S47)","v":0},null,{"$f":"IF(CJ47=\"\",\"\",Lichtpunkt!A47)","v":0},{"$f":"IF(CJ47=\"\",\"\",Lichtpunkt!B47)","v":0},{"$f":"IF(CJ47=\"\",\"\",Lichtpunkt!C47)","v":0},{"$f":"IF(Lichtpunkt!D47=\"\",0,Lichtpunkt!D47)","v":0},{"$f":"IF(Lichtpunkt!E47=\"\",0,Lichtpunkt!E47)","v":0},null,{"$f":"IF(CP47=\"\",\"\",Lichtpunkt!G47)","v":0},{"$f":"IF(CP47=\"\",\"\",Lichtpunkt!H47)","v":0},{"$f":"IF(CP47=\"\",\"\",Lichtpunkt!I47)","v":0},{"$f":"IF(Lichtpunkt!J47=\"\",0,Lichtpunkt!J47)","v":0},{"$f":"IF(Lichtpunkt!K47=\"\",0,Lichtpunkt!K47)","v":0},null,{"$f":"IF(CT47=\"\",\"\",Lichtpunkt!M47)","v":0},{"$f":"IF(Lichtpunkt!N47=\"\",0,Lichtpunkt!N47)","v":0},{"$f":"IF(Lichtpunkt!O47=\"\",0,Lichtpunkt!O47)","v":0},null,{"$f":"IF(CX47=\"\",\"\",Lichtpunkt!Q47)","v":0},{"$f":"IF(Lichtpunkt!R47=\"\",0,Lichtpunkt!R47)","v":0},{"$f":"IF(Lichtpunkt!S47=\"\",0,Lichtpunkt!S47)","v":0},null,{"$f":"IF('LP-König'!A47=\"\",\"\",'LP-König'!A47)","v":""},{"$f":"IF('LP-König'!B47=\"\",\"\",'LP-König'!B47)","v":""},{"$f":"IF('LP-König'!C47=\"\",\"\",'LP-König'!C47)","v":""}]
[{"$f":"IF(D48=\"\",\"\",Schüler!A48)","v":0},{"$f":"IF(D48=\"\",\"\",Schüler!B48)","v":0},{"$f":"IF(D48=\"\",\"\",Schüler!C48)","v":0},{"$f":"IF(Schüler!D48=\"\",0,Schüler!D48)","v":0},{"$f":"IF(Schüler!E48=\"\",0,Schüler!E48)","v":0},null,{"$f":"IF(J48=\"\",\"\",Schüler!G48)","v":0},{"$f":"IF(J48=\"\",\"\",Schüler!H48)","v":0},{"$f":"IF(J48=\"\",\"\",Schüler!I48)","v":0},{"$f":"IF(Schüler!J48=\"\",0,Schüler!J48)","v":0},{"$f":"IF(Schüler!K48=\"\",0,Schüler!K48)","v":0},null,{"$f":"IF(N48=\"\",\"\",Schüler!M48)","v":0},{"$f":"IF(Schüler!N48=\"\",0,Schüler!N48)","v":0},{"$f":"IF(Schüler!O48=\"\",0,Schüler!O48)","v":0},null,{"$f":"IF(R48=\"\",\"\",Schüler!Q48)","v":0},{"$f":"IF(Schüler!R48=\"\",0,Schüler!R48)","v":0},{"$f":"IF(Schüler!S48=\"\",0,Schüler!S48)","v":0},null,{"$f":"IF(X48=\"\",\"\",Jugend!A48)","v":0},{"$f":"IF(X48=\"\",\"\",Jugend!B48)","v":0},{"$f":"IF(X48=\"\",\"\",Jugend!C48)","v":0},{"$f":"IF(Jugend!D48=\"\",0,Jugend!D48)","v":0},{"$f":"IF(Jugend!E48=\"\",0,Jugend!E48)","v":0},null,{"$f":"IF(AD48=\"\",\"\",Jugend!G48)","v":0},{"$f":"IF(AD48=\"\",\"\",Jugend!H48)","v":0},{"$f":"IF(AD48=\"\",\"\",Jugend!I48)","v":0},{"$f":"IF(Jugend!J48=\"\",0,Jugend!J48)","v":0},{"$f":"IF(Jugend!K48=\"\",0,Jugend!K48)","v":0},null,{"$f":"IF(AH48=\"\",\"\",Jugend!M48)","v":0},{"$f":"IF(Jugend!N48=\"\",0,Jugend!N48)","v":0},{"$f":"IF(Jugend!O48=\"\",0,Jugend!O48)","v":0},null,{"$f":"IF(AL48=\"\",\"\",Jugend!Q48)","v":0},{"$f":"IF(Jugend!R48=\"\",0,Jugend!R48)","v":0},{"$f":"IF(Jugend!S48=\"\",0,Jugend!S48)","v":0},null,{"$f":"IF(AR48=\"\",\"\",'Junioren II'!A48)","v":0},{"$f":"IF(AR48=\"\",\"\",'Junioren II'!B48)","v":0},{"$f":"IF(AR48=\"\",\"\",'Junioren II'!C48)","v":0},{"$f":"IF('Junioren II'!D48=\"\",0,'Junioren II'!D48)","v":0},{"$f":"IF('Junioren II'!E48=\"\",0,'Junioren II'!E48)","v":0},null,{"$f":"IF(AX48=\"\",\"\",'Junioren II'!G48)","v":0},{"$f":"IF(AX48=\"\",\"\",'Junioren II'!H48)","v":0},{"$f":"IF(AX48=\"\",\"\",'Junioren II'!I48)","v":0},{"$f":"IF('Junioren II'!J48=\"\",0,'Junioren II'!J48)","v":0},{"$f":"IF('Junioren II'!K48=\"\",0,'Junioren II'!K48)","v":0},null,{"$f":"IF(BB48=\"\",\"\",'Junioren II'!M48)","v":0},{"$f":"IF('Junioren II'!N48=\"\",0,'Junioren II'!N48)","v":0},{"$f":"IF('Junioren II'!O48=\"\",0,'Junioren II'!O48)","v":0},null,{"$f":"IF(BF48=\"\",\"\",'Junioren II'!Q48)","v":0},{"$f":"IF('Junioren II'!R48=\"\",0,'Junioren II'!R48)","v":0},{"$f":"IF('Junioren II'!S48=\"\",0,'Junioren II'!S48)","v":0},null,{"$f":"IF('UK-König'!A48=\"\",\"\",'UK-König'!A48)","v":""},{"$f":"IF('UK-König'!B48=\"\",\"\",'UK-König'!B48)","v":""},{"$f":"IF('UK-König'!C48=\"\",\"\",'UK-König'!C48)","v":""},null,{"$f":"IF(BP48=\"\",\"\",'Junioren I'!A48)","v":0},{"$f":"IF(BP48=\"\",\"\",'Junioren I'!B48)","v":0},{"$f":"IF(BP48=\"\",\"\",'Junioren I'!C48)","v":0},{"$f":"IF('Junioren I'!D48=\"\",0,'Junioren I'!D48)","v":0},{"$f":"IF('Junioren I'!E48=\"\",0,'Junioren I'!E48)","v":0},null,{"$f":"IF(BV48=\"\",\"\",'Junioren I'!G48)","v":0},{"$f":"IF(BV48=\"\",\"\",'Junioren I'!H48)","v":0},{"$f":"IF(BV48=\"\",\"\",'Junioren I'!I48)","v":0},{"$f":"IF('Junioren I'!J48=\"\",0,'Junioren I'!J48)","v":0},{"$f":"IF('Junioren I'!K48=\"\",0,'Junioren I'!K48)","v":0},null,{"$f":"IF(BZ48=\"\",\"\",'Junioren I'!M48)","v":0},{"$f":"IF('Junioren I'!N48=\"\",0,'Junioren I'!N48)","v":0},{"$f":"IF('Junioren I'!O48=\"\",0,'Junioren I'!O48)","v":0},null,{"$f":"IF(CD48=\"\",\"\",'Junioren I'!Q48)","v":0},{"$f":"IF('Junioren I'!R48=\"\",0,'Junioren I'!R48)","v":0},{"$f":"IF('Junioren I'!S48=\"\",0,'Junioren I'!S48)","v":0},null,{"$f":"IF(CJ48=\"\",\"\",Lichtpunkt!A48)","v":0},{"$f":"IF(CJ48=\"\",\"\",Lichtpunkt!B48)","v":0},{"$f":"IF(CJ48=\"\",\"\",Lichtpunkt!C48)","v":0},{"$f":"IF(Lichtpunkt!D48=\"\",0,Lichtpunkt!D48)","v":0},{"$f":"IF(Lichtpunkt!E48=\"\",0,Lichtpunkt!E48)","v":0},null,{"$f":"IF(CP48=\"\",\"\",Lichtpunkt!G48)","v":0},{"$f":"IF(CP48=\"\",\"\",Lichtpunkt!H48)","v":0},{"$f":"IF(CP48=\"\",\"\",Lichtpunkt!I48)","v":0},{"$f":"IF(Lichtpunkt!J48=\"\",0,Lichtpunkt!J48)","v":0},{"$f":"IF(Lichtpunkt!K48=\"\",0,Lichtpunkt!K48)","v":0},null,{"$f":"IF(CT48=\"\",\"\",Lichtpunkt!M48)","v":0},{"$f":"IF(Lichtpunkt!N48=\"\",0,Lichtpunkt!N48)","v":0},{"$f":"IF(Lichtpunkt!O48=\"\",0,Lichtpunkt!O48)","v":0},null,{"$f":"IF(CX48=\"\",\"\",Lichtpunkt!Q48)","v":0},{"$f":"IF(Lichtpunkt!R48=\"\",0,Lichtpunkt!R48)","v":0},{"$f":"IF(Lichtpunkt!S48=\"\",0,Lichtpunkt!S48)","v":0},null,{"$f":"IF('LP-König'!A48=\"\",\"\",'LP-König'!A48)","v":""},{"$f":"IF('LP-König'!B48=\"\",\"\",'LP-König'!B48)","v":""},{"$f":"IF('LP-König'!C48=\"\",\"\",'LP-König'!C48)","v":""}]
[{"$f":"IF(D49=\"\",\"\",Schüler!A49)","v":0},{"$f":"IF(D49=\"\",\"\",Schüler!B49)","v":0},{"$f":"IF(D49=\"\",\"\",Schüler!C49)","v":0},{"$f":"IF(Schüler!D49=\"\",0,Schüler!D49)","v":0},{"$f":"IF(Schüler!E49=\"\",0,Schüler!E49)","v":0},null,{"$f":"IF(J49=\"\",\"\",Schüler!G49)","v":0},{"$f":"IF(J49=\"\",\"\",Schüler!H49)","v":0},{"$f":"IF(J49=\"\",\"\",Schüler!I49)","v":0},{"$f":"IF(Schüler!J49=\"\",0,Schüler!J49)","v":0},{"$f":"IF(Schüler!K49=\"\",0,Schüler!K49)","v":0},null,{"$f":"IF(N49=\"\",\"\",Schüler!M49)","v":0},{"$f":"IF(Schüler!N49=\"\",0,Schüler!N49)","v":0},{"$f":"IF(Schüler!O49=\"\",0,Schüler!O49)","v":0},null,{"$f":"IF(R49=\"\",\"\",Schüler!Q49)","v":0},{"$f":"IF(Schüler!R49=\"\",0,Schüler!R49)","v":0},{"$f":"IF(Schüler!S49=\"\",0,Schüler!S49)","v":0},null,{"$f":"IF(X49=\"\",\"\",Jugend!A49)","v":0},{"$f":"IF(X49=\"\",\"\",Jugend!B49)","v":0},{"$f":"IF(X49=\"\",\"\",Jugend!C49)","v":0},{"$f":"IF(Jugend!D49=\"\",0,Jugend!D49)","v":0},{"$f":"IF(Jugend!E49=\"\",0,Jugend!E49)","v":0},null,{"$f":"IF(AD49=\"\",\"\",Jugend!G49)","v":0},{"$f":"IF(AD49=\"\",\"\",Jugend!H49)","v":0},{"$f":"IF(AD49=\"\",\"\",Jugend!I49)","v":0},{"$f":"IF(Jugend!J49=\"\",0,Jugend!J49)","v":0},{"$f":"IF(Jugend!K49=\"\",0,Jugend!K49)","v":0},null,{"$f":"IF(AH49=\"\",\"\",Jugend!M49)","v":0},{"$f":"IF(Jugend!N49=\"\",0,Jugend!N49)","v":0},{"$f":"IF(Jugend!O49=\"\",0,Jugend!O49)","v":0},null,{"$f":"IF(AL49=\"\",\"\",Jugend!Q49)","v":0},{"$f":"IF(Jugend!R49=\"\",0,Jugend!R49)","v":0},{"$f":"IF(Jugend!S49=\"\",0,Jugend!S49)","v":0},null,{"$f":"IF(AR49=\"\",\"\",'Junioren II'!A49)","v":0},{"$f":"IF(AR49=\"\",\"\",'Junioren II'!B49)","v":0},{"$f":"IF(AR49=\"\",\"\",'Junioren II'!C49)","v":0},{"$f":"IF('Junioren II'!D49=\"\",0,'Junioren II'!D49)","v":0},{"$f":"IF('Junioren II'!E49=\"\",0,'Junioren II'!E49)","v":0},null,{"$f":"IF(AX49=\"\",\"\",'Junioren II'!G49)","v":0},{"$f":"IF(AX49=\"\",\"\",'Junioren II'!H49)","v":0},{"$f":"IF(AX49=\"\",\"\",'Junioren II'!I49)","v":0},{"$f":"IF('Junioren II'!J49=\"\",0,'Junioren II'!J49)","v":0},{"$f":"IF('Junioren II'!K49=\"\",0,'Junioren II'!K49)","v":0},null,{"$f":"IF(BB49=\"\",\"\",'Junioren II'!M49)","v":0},{"$f":"IF('Junioren II'!N49=\"\",0,'Junioren II'!N49)","v":0},{"$f":"IF('Junioren II'!O49=\"\",0,'Junioren II'!O49)","v":0},null,{"$f":"IF(BF49=\"\",\"\",'Junioren II'!Q49)","v":0},{"$f":"IF('Junioren II'!R49=\"\",0,'Junioren II'!R49)","v":0},{"$f":"IF('Junioren II'!S49=\"\",0,'Junioren II'!S49)","v":0},null,{"$f":"IF('UK-König'!A49=\"\",\"\",'UK-König'!A49)","v":""},{"$f":"IF('UK-König'!B49=\"\",\"\",'UK-König'!B49)","v":""},{"$f":"IF('UK-König'!C49=\"\",\"\",'UK-König'!C49)","v":""},null,{"$f":"IF(BP49=\"\",\"\",'Junioren I'!A49)","v":0},{"$f":"IF(BP49=\"\",\"\",'Junioren I'!B49)","v":0},{"$f":"IF(BP49=\"\",\"\",'Junioren I'!C49)","v":0},{"$f":"IF('Junioren I'!D49=\"\",0,'Junioren I'!D49)","v":0},{"$f":"IF('Junioren I'!E49=\"\",0,'Junioren I'!E49)","v":0},null,{"$f":"IF(BV49=\"\",\"\",'Junioren I'!G49)","v":0},{"$f":"IF(BV49=\"\",\"\",'Junioren I'!H49)","v":0},{"$f":"IF(BV49=\"\",\"\",'Junioren I'!I49)","v":0},{"$f":"IF('Junioren I'!J49=\"\",0,'Junioren I'!J49)","v":0},{"$f":"IF('Junioren I'!K49=\"\",0,'Junioren I'!K49)","v":0},null,{"$f":"IF(BZ49=\"\",\"\",'Junioren I'!M49)","v":0},{"$f":"IF('Junioren I'!N49=\"\",0,'Junioren I'!N49)","v":0},{"$f":"IF('Junioren I'!O49=\"\",0,'Junioren I'!O49)","v":0},null,{"$f":"IF(CD49=\"\",\"\",'Junioren I'!Q49)","v":0},{"$f":"IF('Junioren I'!R49=\"\",0,'Junioren I'!R49)","v":0},{"$f":"IF('Junioren I'!S49=\"\",0,'Junioren I'!S49)","v":0},null,{"$f":"IF(CJ49=\"\",\"\",Lichtpunkt!A49)","v":0},{"$f":"IF(CJ49=\"\",\"\",Lichtpunkt!B49)","v":0},{"$f":"IF(CJ49=\"\",\"\",Lichtpunkt!C49)","v":0},{"$f":"IF(Lichtpunkt!D49=\"\",0,Lichtpunkt!D49)","v":0},{"$f":"IF(Lichtpunkt!E49=\"\",0,Lichtpunkt!E49)","v":0},null,{"$f":"IF(CP49=\"\",\"\",Lichtpunkt!G49)","v":0},{"$f":"IF(CP49=\"\",\"\",Lichtpunkt!H49)","v":0},{"$f":"IF(CP49=\"\",\"\",Lichtpunkt!I49)","v":0},{"$f":"IF(Lichtpunkt!J49=\"\",0,Lichtpunkt!J49)","v":0},{"$f":"IF(Lichtpunkt!K49=\"\",0,Lichtpunkt!K49)","v":0},null,{"$f":"IF(CT49=\"\",\"\",Lichtpunkt!M49)","v":0},{"$f":"IF(Lichtpunkt!N49=\"\",0,Lichtpunkt!N49)","v":0},{"$f":"IF(Lichtpunkt!O49=\"\",0,Lichtpunkt!O49)","v":0},null,{"$f":"IF(CX49=\"\",\"\",Lichtpunkt!Q49)","v":0},{"$f":"IF(Lichtpunkt!R49=\"\",0,Lichtpunkt!R49)","v":0},{"$f":"IF(Lichtpunkt!S49=\"\",0,Lichtpunkt!S49)","v":0},null,{"$f":"IF('LP-König'!A49=\"\",\"\",'LP-König'!A49)","v":""},{"$f":"IF('LP-König'!B49=\"\",\"\",'LP-König'!B49)","v":""},{"$f":"IF('LP-König'!C49=\"\",\"\",'LP-König'!C49)","v":""}]
[{"$f":"IF(D50=\"\",\"\",Schüler!A50)","v":0},{"$f":"IF(D50=\"\",\"\",Schüler!B50)","v":0},{"$f":"IF(D50=\"\",\"\",Schüler!C50)","v":0},{"$f":"IF(Schüler!D50=\"\",0,Schüler!D50)","v":0},{"$f":"IF(Schüler!E50=\"\",0,Schüler!E50)","v":0},null,{"$f":"IF(J50=\"\",\"\",Schüler!G50)","v":0},{"$f":"IF(J50=\"\",\"\",Schüler!H50)","v":0},{"$f":"IF(J50=\"\",\"\",Schüler!I50)","v":0},{"$f":"IF(Schüler!J50=\"\",0,Schüler!J50)","v":0},{"$f":"IF(Schüler!K50=\"\",0,Schüler!K50)","v":0},null,{"$f":"IF(N50=\"\",\"\",Schüler!M50)","v":0},{"$f":"IF(Schüler!N50=\"\",0,Schüler!N50)","v":0},{"$f":"IF(Schüler!O50=\"\",0,Schüler!O50)","v":0},null,{"$f":"IF(R50=\"\",\"\",Schüler!Q50)","v":0},{"$f":"IF(Schüler!R50=\"\",0,Schüler!R50)","v":0},{"$f":"IF(Schüler!S50=\"\",0,Schüler!S50)","v":0},null,{"$f":"IF(X50=\"\",\"\",Jugend!A50)","v":0},{"$f":"IF(X50=\"\",\"\",Jugend!B50)","v":0},{"$f":"IF(X50=\"\",\"\",Jugend!C50)","v":0},{"$f":"IF(Jugend!D50=\"\",0,Jugend!D50)","v":0},{"$f":"IF(Jugend!E50=\"\",0,Jugend!E50)","v":0},null,{"$f":"IF(AD50=\"\",\"\",Jugend!G50)","v":0},{"$f":"IF(AD50=\"\",\"\",Jugend!H50)","v":0},{"$f":"IF(AD50=\"\",\"\",Jugend!I50)","v":0},{"$f":"IF(Jugend!J50=\"\",0,Jugend!J50)","v":0},{"$f":"IF(Jugend!K50=\"\",0,Jugend!K50)","v":0},null,{"$f":"IF(AH50=\"\",\"\",Jugend!M50)","v":0},{"$f":"IF(Jugend!N50=\"\",0,Jugend!N50)","v":0},{"$f":"IF(Jugend!O50=\"\",0,Jugend!O50)","v":0},null,{"$f":"IF(AL50=\"\",\"\",Jugend!Q50)","v":0},{"$f":"IF(Jugend!R50=\"\",0,Jugend!R50)","v":0},{"$f":"IF(Jugend!S50=\"\",0,Jugend!S50)","v":0},null,{"$f":"IF(AR50=\"\",\"\",'Junioren II'!A50)","v":0},{"$f":"IF(AR50=\"\",\"\",'Junioren II'!B50)","v":0},{"$f":"IF(AR50=\"\",\"\",'Junioren II'!C50)","v":0},{"$f":"IF('Junioren II'!D50=\"\",0,'Junioren II'!D50)","v":0},{"$f":"IF('Junioren II'!E50=\"\",0,'Junioren II'!E50)","v":0},null,{"$f":"IF(AX50=\"\",\"\",'Junioren II'!G50)","v":0},{"$f":"IF(AX50=\"\",\"\",'Junioren II'!H50)","v":0},{"$f":"IF(AX50=\"\",\"\",'Junioren II'!I50)","v":0},{"$f":"IF('Junioren II'!J50=\"\",0,'Junioren II'!J50)","v":0},{"$f":"IF('Junioren II'!K50=\"\",0,'Junioren II'!K50)","v":0},null,{"$f":"IF(BB50=\"\",\"\",'Junioren II'!M50)","v":0},{"$f":"IF('Junioren II'!N50=\"\",0,'Junioren II'!N50)","v":0},{"$f":"IF('Junioren II'!O50=\"\",0,'Junioren II'!O50)","v":0},null,{"$f":"IF(BF50=\"\",\"\",'Junioren II'!Q50)","v":0},{"$f":"IF('Junioren II'!R50=\"\",0,'Junioren II'!R50)","v":0},{"$f":"IF('Junioren II'!S50=\"\",0,'Junioren II'!S50)","v":0},null,{"$f":"IF('UK-König'!A50=\"\",\"\",'UK-König'!A50)","v":""},{"$f":"IF('UK-König'!B50=\"\",\"\",'UK-König'!B50)","v":""},{"$f":"IF('UK-König'!C50=\"\",\"\",'UK-König'!C50)","v":""},null,{"$f":"IF(BP50=\"\",\"\",'Junioren I'!A50)","v":0},{"$f":"IF(BP50=\"\",\"\",'Junioren I'!B50)","v":0},{"$f":"IF(BP50=\"\",\"\",'Junioren I'!C50)","v":0},{"$f":"IF('Junioren I'!D50=\"\",0,'Junioren I'!D50)","v":0},{"$f":"IF('Junioren I'!E50=\"\",0,'Junioren I'!E50)","v":0},null,{"$f":"IF(BV50=\"\",\"\",'Junioren I'!G50)","v":0},{"$f":"IF(BV50=\"\",\"\",'Junioren I'!H50)","v":0},{"$f":"IF(BV50=\"\",\"\",'Junioren I'!I50)","v":0},{"$f":"IF('Junioren I'!J50=\"\",0,'Junioren I'!J50)","v":0},{"$f":"IF('Junioren I'!K50=\"\",0,'Junioren I'!K50)","v":0},null,{"$f":"IF(BZ50=\"\",\"\",'Junioren I'!M50)","v":0},{"$f":"IF('Junioren I'!N50=\"\",0,'Junioren I'!N50)","v":0},{"$f":"IF('Junioren I'!O50=\"\",0,'Junioren I'!O50)","v":0},null,{"$f":"IF(CD50=\"\",\"\",'Junioren I'!Q50)","v":0},{"$f":"IF('Junioren I'!R50=\"\",0,'Junioren I'!R50)","v":0},{"$f":"IF('Junioren I'!S50=\"\",0,'Junioren I'!S50)","v":0},null,{"$f":"IF(CJ50=\"\",\"\",Lichtpunkt!A50)","v":0},{"$f":"IF(CJ50=\"\",\"\",Lichtpunkt!B50)","v":0},{"$f":"IF(CJ50=\"\",\"\",Lichtpunkt!C50)","v":0},{"$f":"IF(Lichtpunkt!D50=\"\",0,Lichtpunkt!D50)","v":0},{"$f":"IF(Lichtpunkt!E50=\"\",0,Lichtpunkt!E50)","v":0},null,{"$f":"IF(CP50=\"\",\"\",Lichtpunkt!G50)","v":0},{"$f":"IF(CP50=\"\",\"\",Lichtpunkt!H50)","v":0},{"$f":"IF(CP50=\"\",\"\",Lichtpunkt!I50)","v":0},{"$f":"IF(Lichtpunkt!J50=\"\",0,Lichtpunkt!J50)","v":0},{"$f":"IF(Lichtpunkt!K50=\"\",0,Lichtpunkt!K50)","v":0},null,{"$f":"IF(CT50=\"\",\"\",Lichtpunkt!M50)","v":0},{"$f":"IF(Lichtpunkt!N50=\"\",0,Lichtpunkt!N50)","v":0},{"$f":"IF(Lichtpunkt!O50=\"\",0,Lichtpunkt!O50)","v":0},null,{"$f":"IF(CX50=\"\",\"\",Lichtpunkt!Q50)","v":0},{"$f":"IF(Lichtpunkt!R50=\"\",0,Lichtpunkt!R50)","v":0},{"$f":"IF(Lichtpunkt!S50=\"\",0,Lichtpunkt!S50)","v":0},null,{"$f":"IF('LP-König'!A50=\"\",\"\",'LP-König'!A50)","v":""},{"$f":"IF('LP-König'!B50=\"\",\"\",'LP-König'!B50)","v":""},{"$f":"IF('LP-König'!C50=\"\",\"\",'LP-König'!C50)","v":""}]
[{"$f":"IF(D51=\"\",\"\",Schüler!A51)","v":0},{"$f":"IF(D51=\"\",\"\",Schüler!B51)","v":0},{"$f":"IF(D51=\"\",\"\",Schüler!C51)","v":0},{"$f":"IF(Schüler!D51=\"\",0,Schüler!D51)","v":0},{"$f":"IF(Schüler!E51=\"\",0,Schüler!E51)","v":0},null,{"$f":"IF(J51=\"\",\"\",Schüler!G51)","v":0},{"$f":"IF(J51=\"\",\"\",Schüler!H51)","v":0},{"$f":"IF(J51=\"\",\"\",Schüler!I51)","v":0},{"$f":"IF(Schüler!J51=\"\",0,Schüler!J51)","v":0},{"$f":"IF(Schüler!K51=\"\",0,Schüler!K51)","v":0},null,{"$f":"IF(N51=\"\",\"\",Schüler!M51)","v":0},{"$f":"IF(Schüler!N51=\"\",0,Schüler!N51)","v":0},{"$f":"IF(Schüler!O51=\"\",0,Schüler!O51)","v":0},null,{"$f":"IF(R51=\"\",\"\",Schüler!Q51)","v":0},{"$f":"IF(Schüler!R51=\"\",0,Schüler!R51)","v":0},{"$f":"IF(Schüler!S51=\"\",0,Schüler!S51)","v":0},null,{"$f":"IF(X51=\"\",\"\",Jugend!A51)","v":0},{"$f":"IF(X51=\"\",\"\",Jugend!B51)","v":0},{"$f":"IF(X51=\"\",\"\",Jugend!C51)","v":0},{"$f":"IF(Jugend!D51=\"\",0,Jugend!D51)","v":0},{"$f":"IF(Jugend!E51=\"\",0,Jugend!E51)","v":0},null,{"$f":"IF(AD51=\"\",\"\",Jugend!G51)","v":0},{"$f":"IF(AD51=\"\",\"\",Jugend!H51)","v":0},{"$f":"IF(AD51=\"\",\"\",Jugend!I51)","v":0},{"$f":"IF(Jugend!J51=\"\",0,Jugend!J51)","v":0},{"$f":"IF(Jugend!K51=\"\",0,Jugend!K51)","v":0},null,{"$f":"IF(AH51=\"\",\"\",Jugend!M51)","v":0},{"$f":"IF(Jugend!N51=\"\",0,Jugend!N51)","v":0},{"$f":"IF(Jugend!O51=\"\",0,Jugend!O51)","v":0},null,{"$f":"IF(AL51=\"\",\"\",Jugend!Q51)","v":0},{"$f":"IF(Jugend!R51=\"\",0,Jugend!R51)","v":0},{"$f":"IF(Jugend!S51=\"\",0,Jugend!S51)","v":0},null,{"$f":"IF(AR51=\"\",\"\",'Junioren II'!A51)","v":0},{"$f":"IF(AR51=\"\",\"\",'Junioren II'!B51)","v":0},{"$f":"IF(AR51=\"\",\"\",'Junioren II'!C51)","v":0},{"$f":"IF('Junioren II'!D51=\"\",0,'Junioren II'!D51)","v":0},{"$f":"IF('Junioren II'!E51=\"\",0,'Junioren II'!E51)","v":0},null,{"$f":"IF(AX51=\"\",\"\",'Junioren II'!G51)","v":0},{"$f":"IF(AX51=\"\",\"\",'Junioren II'!H51)","v":0},{"$f":"IF(AX51=\"\",\"\",'Junioren II'!I51)","v":0},{"$f":"IF('Junioren II'!J51=\"\",0,'Junioren II'!J51)","v":0},{"$f":"IF('Junioren II'!K51=\"\",0,'Junioren II'!K51)","v":0},null,{"$f":"IF(BB51=\"\",\"\",'Junioren II'!M51)","v":0},{"$f":"IF('Junioren II'!N51=\"\",0,'Junioren II'!N51)","v":0},{"$f":"IF('Junioren II'!O51=\"\",0,'Junioren II'!O51)","v":0},null,{"$f":"IF(BF51=\"\",\"\",'Junioren II'!Q51)","v":0},{"$f":"IF('Junioren II'!R51=\"\",0,'Junioren II'!R51)","v":0},{"$f":"IF('Junioren II'!S51=\"\",0,'Junioren II'!S51)","v":0},null,{"$f":"IF('UK-König'!A51=\"\",\"\",'UK-König'!A51)","v":""},{"$f":"IF('UK-König'!B51=\"\",\"\",'UK-König'!B51)","v":""},{"$f":"IF('UK-König'!C51=\"\",\"\",'UK-König'!C51)","v":""},null,{"$f":"IF(BP51=\"\",\"\",'Junioren I'!A51)","v":0},{"$f":"IF(BP51=\"\",\"\",'Junioren I'!B51)","v":0},{"$f":"IF(BP51=\"\",\"\",'Junioren I'!C51)","v":0},{"$f":"IF('Junioren I'!D51=\"\",0,'Junioren I'!D51)","v":0},{"$f":"IF('Junioren I'!E51=\"\",0,'Junioren I'!E51)","v":0},null,{"$f":"IF(BV51=\"\",\"\",'Junioren I'!G51)","v":0},{"$f":"IF(BV51=\"\",\"\",'Junioren I'!H51)","v":0},{"$f":"IF(BV51=\"\",\"\",'Junioren I'!I51)","v":0},{"$f":"IF('Junioren I'!J51=\"\",0,'Junioren I'!J51)","v":0},{"$f":"IF('Junioren I'!K51=\"\",0,'Junioren I'!K51)","v":0},null,{"$f":"IF(BZ51=\"\",\"\",'Junioren I'!M51)","v":0},{"$f":"IF('Junioren I'!N51=\"\",0,'Junioren I'!N51)","v":0},{"$f":"IF('Junioren I'!O51=\"\",0,'Junioren I'!O51)","v":0},null,{"$f":"IF(CD51=\"\",\"\",'Junioren I'!Q51)","v":0},{"$f":"IF('Junioren I'!R51=\"\",0,'Junioren I'!R51)","v":0},{"$f":"IF('Junioren I'!S51=\"\",0,'Junioren I'!S51)","v":0},null,{"$f":"IF(CJ51=\"\",\"\",Lichtpunkt!A51)","v":0},{"$f":"IF(CJ51=\"\",\"\",Lichtpunkt!B51)","v":0},{"$f":"IF(CJ51=\"\",\"\",Lichtpunkt!C51)","v":0},{"$f":"IF(Lichtpunkt!D51=\"\",0,Lichtpunkt!D51)","v":0},{"$f":"IF(Lichtpunkt!E51=\"\",0,Lichtpunkt!E51)","v":0},null,{"$f":"IF(CP51=\"\",\"\",Lichtpunkt!G51)","v":0},{"$f":"IF(CP51=\"\",\"\",Lichtpunkt!H51)","v":0},{"$f":"IF(CP51=\"\",\"\",Lichtpunkt!I51)","v":0},{"$f":"IF(Lichtpunkt!J51=\"\",0,Lichtpunkt!J51)","v":0},{"$f":"IF(Lichtpunkt!K51=\"\",0,Lichtpunkt!K51)","v":0},null,{"$f":"IF(CT51=\"\",\"\",Lichtpunkt!M51)","v":0},{"$f":"IF(Lichtpunkt!N51=\"\",0,Lichtpunkt!N51)","v":0},{"$f":"IF(Lichtpunkt!O51=\"\",0,Lichtpunkt!O51)","v":0},null,{"$f":"IF(CX51=\"\",\"\",Lichtpunkt!Q51)","v":0},{"$f":"IF(Lichtpunkt!R51=\"\",0,Lichtpunkt!R51)","v":0},{"$f":"IF(Lichtpunkt!S51=\"\",0,Lichtpunkt!S51)","v":0},null,{"$f":"IF('LP-König'!A51=\"\",\"\",'LP-König'!A51)","v":""},{"$f":"IF('LP-König'!B51=\"\",\"\",'LP-König'!B51)","v":""},{"$f":"IF('LP-König'!C51=\"\",\"\",'LP-König'!C51)","v":""}]
[{"$f":"IF(D52=\"\",\"\",Schüler!A52)","v":0},{"$f":"IF(D52=\"\",\"\",Schüler!B52)","v":0},{"$f":"IF(D52=\"\",\"\",Schüler!C52)","v":0},{"$f":"IF(Schüler!D52=\"\",0,Schüler!D52)","v":0},{"$f":"IF(Schüler!E52=\"\",0,Schüler!E52)","v":0},null,{"$f":"IF(J52=\"\",\"\",Schüler!G52)","v":0},{"$f":"IF(J52=\"\",\"\",Schüler!H52)","v":0},{"$f":"IF(J52=\"\",\"\",Schüler!I52)","v":0},{"$f":"IF(Schüler!J52=\"\",0,Schüler!J52)","v":0},{"$f":"IF(Schüler!K52=\"\",0,Schüler!K52)","v":0},null,{"$f":"IF(N52=\"\",\"\",Schüler!M52)","v":0},{"$f":"IF(Schüler!N52=\"\",0,Schüler!N52)","v":0},{"$f":"IF(Schüler!O52=\"\",0,Schüler!O52)","v":0},null,{"$f":"IF(R52=\"\",\"\",Schüler!Q52)","v":0},{"$f":"IF(Schüler!R52=\"\",0,Schüler!R52)","v":0},{"$f":"IF(Schüler!S52=\"\",0,Schüler!S52)","v":0},null,{"$f":"IF(X52=\"\",\"\",Jugend!A52)","v":0},{"$f":"IF(X52=\"\",\"\",Jugend!B52)","v":0},{"$f":"IF(X52=\"\",\"\",Jugend!C52)","v":0},{"$f":"IF(Jugend!D52=\"\",0,Jugend!D52)","v":0},{"$f":"IF(Jugend!E52=\"\",0,Jugend!E52)","v":0},null,{"$f":"IF(AD52=\"\",\"\",Jugend!G52)","v":0},{"$f":"IF(AD52=\"\",\"\",Jugend!H52)","v":0},{"$f":"IF(AD52=\"\",\"\",Jugend!I52)","v":0},{"$f":"IF(Jugend!J52=\"\",0,Jugend!J52)","v":0},{"$f":"IF(Jugend!K52=\"\",0,Jugend!K52)","v":0},null,{"$f":"IF(AH52=\"\",\"\",Jugend!M52)","v":0},{"$f":"IF(Jugend!N52=\"\",0,Jugend!N52)","v":0},{"$f":"IF(Jugend!O52=\"\",0,Jugend!O52)","v":0},null,{"$f":"IF(AL52=\"\",\"\",Jugend!Q52)","v":0},{"$f":"IF(Jugend!R52=\"\",0,Jugend!R52)","v":0},{"$f":"IF(Jugend!S52=\"\",0,Jugend!S52)","v":0},null,{"$f":"IF(AR52=\"\",\"\",'Junioren II'!A52)","v":0},{"$f":"IF(AR52=\"\",\"\",'Junioren II'!B52)","v":0},{"$f":"IF(AR52=\"\",\"\",'Junioren II'!C52)","v":0},{"$f":"IF('Junioren II'!D52=\"\",0,'Junioren II'!D52)","v":0},{"$f":"IF('Junioren II'!E52=\"\",0,'Junioren II'!E52)","v":0},null,{"$f":"IF(AX52=\"\",\"\",'Junioren II'!G52)","v":0},{"$f":"IF(AX52=\"\",\"\",'Junioren II'!H52)","v":0},{"$f":"IF(AX52=\"\",\"\",'Junioren II'!I52)","v":0},{"$f":"IF('Junioren II'!J52=\"\",0,'Junioren II'!J52)","v":0},{"$f":"IF('Junioren II'!K52=\"\",0,'Junioren II'!K52)","v":0},null,{"$f":"IF(BB52=\"\",\"\",'Junioren II'!M52)","v":0},{"$f":"IF('Junioren II'!N52=\"\",0,'Junioren II'!N52)","v":0},{"$f":"IF('Junioren II'!O52=\"\",0,'Junioren II'!O52)","v":0},null,{"$f":"IF(BF52=\"\",\"\",'Junioren II'!Q52)","v":0},{"$f":"IF('Junioren II'!R52=\"\",0,'Junioren II'!R52)","v":0},{"$f":"IF('Junioren II'!S52=\"\",0,'Junioren II'!S52)","v":0},null,{"$f":"IF('UK-König'!A52=\"\",\"\",'UK-König'!A52)","v":""},{"$f":"IF('UK-König'!B52=\"\",\"\",'UK-König'!B52)","v":""},{"$f":"IF('UK-König'!C52=\"\",\"\",'UK-König'!C52)","v":""},null,{"$f":"IF(BP52=\"\",\"\",'Junioren I'!A52)","v":0},{"$f":"IF(BP52=\"\",\"\",'Junioren I'!B52)","v":0},{"$f":"IF(BP52=\"\",\"\",'Junioren I'!C52)","v":0},{"$f":"IF('Junioren I'!D52=\"\",0,'Junioren I'!D52)","v":0},{"$f":"IF('Junioren I'!E52=\"\",0,'Junioren I'!E52)","v":0},null,{"$f":"IF(BV52=\"\",\"\",'Junioren I'!G52)","v":0},{"$f":"IF(BV52=\"\",\"\",'Junioren I'!H52)","v":0},{"$f":"IF(BV52=\"\",\"\",'Junioren I'!I52)","v":0},{"$f":"IF('Junioren I'!J52=\"\",0,'Junioren I'!J52)","v":0},{"$f":"IF('Junioren I'!K52=\"\",0,'Junioren I'!K52)","v":0},null,{"$f":"IF(BZ52=\"\",\"\",'Junioren I'!M52)","v":0},{"$f":"IF('Junioren I'!N52=\"\",0,'Junioren I'!N52)","v":0},{"$f":"IF('Junioren I'!O52=\"\",0,'Junioren I'!O52)","v":0},null,{"$f":"IF(CD52=\"\",\"\",'Junioren I'!Q52)","v":0},{"$f":"IF('Junioren I'!R52=\"\",0,'Junioren I'!R52)","v":0},{"$f":"IF('Junioren I'!S52=\"\",0,'Junioren I'!S52)","v":0},null,{"$f":"IF(CJ52=\"\",\"\",Lichtpunkt!A52)","v":0},{"$f":"IF(CJ52=\"\",\"\",Lichtpunkt!B52)","v":0},{"$f":"IF(CJ52=\"\",\"\",Lichtpunkt!C52)","v":0},{"$f":"IF(Lichtpunkt!D52=\"\",0,Lichtpunkt!D52)","v":0},{"$f":"IF(Lichtpunkt!E52=\"\",0,Lichtpunkt!E52)","v":0},null,{"$f":"IF(CP52=\"\",\"\",Lichtpunkt!G52)","v":0},{"$f":"IF(CP52=\"\",\"\",Lichtpunkt!H52)","v":0},{"$f":"IF(CP52=\"\",\"\",Lichtpunkt!I52)","v":0},{"$f":"IF(Lichtpunkt!J52=\"\",0,Lichtpunkt!J52)","v":0},{"$f":"IF(Lichtpunkt!K52=\"\",0,Lichtpunkt!K52)","v":0},null,{"$f":"IF(CT52=\"\",\"\",Lichtpunkt!M52)","v":0},{"$f":"IF(Lichtpunkt!N52=\"\",0,Lichtpunkt!N52)","v":0},{"$f":"IF(Lichtpunkt!O52=\"\",0,Lichtpunkt!O52)","v":0},null,{"$f":"IF(CX52=\"\",\"\",Lichtpunkt!Q52)","v":0},{"$f":"IF(Lichtpunkt!R52=\"\",0,Lichtpunkt!R52)","v":0},{"$f":"IF(Lichtpunkt!S52=\"\",0,Lichtpunkt!S52)","v":0},null,{"$f":"IF('LP-König'!A52=\"\",\"\",'LP-König'!A52)","v":""},{"$f":"IF('LP-König'!B52=\"\",\"\",'LP-König'!B52)","v":""},{"$f":"IF('LP-König'!C52=\"\",\"\",'LP-König'!C52)","v":""}]

{"sheet":"Daten","index":9,"n_rows":52,"n_cols":107,"rows_kept":52,"cut":false,"hidden":false,"merged":[[0,104,0,106],[0,96,0,98],[0,100,0,102],[0,70,0,74],[0,76,0,78],[0,80,0,82],[0,84,0,88],[0,90,0,94],[0,0,0,4],[0,6,0,10],[0,12,0,14],[0,16,0,18],[0,20,0,24],[0,64,0,68],[0,52,0,54],[0,56,0,58],[0,60,0,62],[0,26,0,30],[0,32,0,34],[0,36,0,38],[0,40,0,44],[0,46,0,50]]}
["Schüler LG Auflage (12 - 14 Jahre)\n10 Schuss",null,null,null,null,null,"Schüler LG Freihand (12 - 14 Jahre)\n10 Schuss",null,null,null,null,null,"Mannschaft Schüler\nLG Auflage (12 - 14 Jahre)",null,null,null,"Mannschaft Schüler\nLG Freihand (12 - 14 Jahre)",null,null,null,"Jugend LG Freihand (15 - 16 Jahre)\n20 Schuss",null,null,null,null,null,"Jugend KK Auflage (15 - 16 Jahre)\n10 Schuss",null,null,null,null,null,"Mannschaft Jugend\nKK Auflage (15 - 16 Jahre)",null,null,null,"Mannschaft Jugend\nLG Freihand (15 - 16 Jahre)",null,null,null,"Junioren II\nLG Freihand (17 - 18 Jahre)\n20 Schuss",null,null,null,null,null,"Junioren II\nKK Auflage (17 - 18 Jahre)\n10 Schuss",null,null,null,null,null,"Mannschaft Junioren II\nKK Auflage (17 - 18 Jahre)",null,null,null,"Mannschaft Junioren II\nLG Freihand (17 - 18 Jahre)",null,null,null,"UK-III König-/in",null,null,null,"Junioren I\nLG Freihand (19 - 20 Jahre)\n20 Schuss",null,null,null,null,null,"Junioren I\nKK Auflage (19 - 20 Jahre)\n10 Schuss",null,null,null,null,null,"Mannschaft Junioren I\nKK Auflage (19 - 20 Jahre)",null,null,null,"Mannschaft Junioren I\nLG Freihand (19 - 20 Jahre)",null,null,null,"Schüler Lichtpunkt\n Auflage (8 - 11 Jahre)\n10 Schuss",null,null,null,null,null,"Schüler Lichtpunkt\nFreihand (8 - 11 Jahre)\n10 Schuss",null,null,null,null,null,"Mannschaft Schüler\nLichtpunkt Auflage (8 - 11 Jahre)",null,null,null,"Mannschaft Schüler\nLichtpunkt Freihand (8 - 11 Jahre)",null,null,null,"Lichtpunkt König-/in"]
["Klasse:","Name:","Verein:","Ringe:","Teiler:",null,"Klasse:","Name:","Verein:","Ringe:","Teiler:",null,"Verein:","Ringe:","Teiler:",null,"Verein:","Ringe:","Teiler:",null,"Klasse:","Name:","Verein:","Ringe:","Teiler:",null,"Klasse:","Name:","Verein:","Ringe:","Teiler:",null,"Verein:","Ringe:","Teiler:",null,"Verein:","Ringe:","Teiler:",null,"Klasse:","Name:","Verein:","Ringe:","Teiler:",null,"Klasse:","Name:","Verein:","Ringe:","Teiler:",null,"Verein:","Ringe:","Teiler:",null,"Verein:","Ringe:","Teiler:",null,"Name:","Verein:","Teiler:",null,"Klasse:","Name:","Verein:","Ringe:","Teiler:",null,"Klasse:","Name:","Verein:","Ringe:","Teiler:",null,"Verein:","Ringe:","Teiler:",null,"Verein:","Ringe:","Teiler:",null,"Klasse:","Name:","Verein:","Ringe:","Teiler:",null,"Klasse:","Name:","Verein:","Ringe:","Teiler:",null,"Verein:","Ringe:","Teiler:",null,"Verein:","Ringe:","Teiler:",null,"Name:","Verein:","Teiler:"]
[0,0,0,0,0,null,0,0,0,0,0,null,0,0,0,null,0,0,0,null,0,0,0,0,0,null,0,0,0,0,0,null,0,0,0,null,0,0,0,null,0,0,0,0,0,null,0,0,0,0,0,null,0,0,0,null,0,0,0,null,"","","",null,0,0,0,0,0,null,0,0,0,0,0,null,0,0,0,null,0,0,0,null,0,0,0,0,0,null,0,0,0,0,0,null,0,0,0,null,0,0,0,null,"","",""]
[0,0,0,0,0,null,0,0,0,0,0,null,0,0,0,null,0,0,0,null,0,0,0,0,0,null,0,0,0,0,0,null,0,0,0,null,0,0,0,null,0,0,0,0,0,null,0,0,0,0,0,null,0,0,0,null,0,0,0,null,"","","",null,0,0,0,0,0,null,0,0,0,0,0,null,0,0,0,null,0,0,0,null,0,0,0,0,0,null,0,0,0,0,0,null,0,0,0,null,0,0,0,null,"","",""]
[0,0,0,0,0,null,0,0,0,0,0,null,0,0,0,null,0,0,0,null,0,0,0,0,0,null,0,0,0,0,0,null,0,0,0,null,0,0,0,null,0,0,0,0,0,null,0,0,0,0,0,null,0,0,0,null,0,0,0,null,"","","",null,0,0,0,0,0,null,0,0,0,0,0,null,0,0,0,null,0,0,0,null,0,0,0,0,0,null,0,0,0,0,0,null,0,0,0,null,0,0,0,null,"","",""]
[0,0,0,0,0,null,0,0,0,0,0,null,0,0,0,null,0,0,0,null,0,0,0,0,0,null,0,0,0,0,0,null,0,0,0,null,0,0,0,null,0,0,0,0,0,null,0,0,0,0,0,null,0,0,0,null,0,0,0,null,"","","",null,0,0,0,0,0,null,0,0,0,0,0,null,0,0,0,null,0,0,0,null,0,0,0,0,0,null,0,0,0,0,0,null,0,0,0,null,0,0,0,null,"","",""]
[0,0,0,0,0,null,0,0,0,0,0,null,0,0,0,null,0,0,0,null,0,0,0,0,0,null,0,0,0,0,0,null,0,0,0,null,0,0,0,null,0,0,0,0,0,null,0,0,0,0,0,null,0,0,0,null,0,0,0,null,"","","",null,0,0,0,0,0,null,0,0,0,0,0,null,0,0,0,null,0,0,0,null,0,0,0,0,0,null,0,0,0,0,0,null,0,0,0,null,0,0,0,null,"","",""]
[0,0,0,0,0,null,0,0,0,0,0,null,0,0,0,null,0,0,0,null,0,0,0,0,0,null,0,0,0,0,0,null,0,0,0,null,0,0,0,null,0,0,0,0,0,null,0,0,0,0,0,null,0,0,0,null,0,0,0,null,"","","",null,0,0,0,0,0,null,0,0,0,0,0,null,0,0,0,null,0,0,0,null,0,0,0,0,0,null,0,0,0,0,0,null,0,0,0,null,0,0,0,null,"","",""]
[0,0,0,0,0,null,0,0,0,0,0,null,0,0,0,null,0,0,0,null,0,0,0,0,0,null,0,0,0,0,0,null,0,0,0,null,0,0,0,null,0,0,0,0,0,null,0,0,0,0,0,null,0,0,0,null,0,0,0,null,"","","",null,0,0,0,0,0,null,0,0,0,0,0,null,0,0,0,null,0,0,0,null,0,0,0,0,0,null,0,0,0,0,0,null,0,0,0,null,0,0,0,null,"","",""]
[0,0,0,0,0,null,0,0,0,0,0,null,0,0,0,null,0,0,0,null,0,0,0,0,0,null,0,0,0,0,0,null,0,0,0,null,0,0,0,null,0,0,0,0,0,null,0,0,0,0,0,null,0,0,0,null,0,0,0,null,"","","",null,0,0,0,0,0,null,0,0,0,0,0,null,0,0,0,null,0,0,0,null,0,0,0,0,0,null,0,0,0,0,0,null,0,0,0,null,0,0,0,null,"","",""]
[0,0,0,0,0,null,0,0,0,0,0,null,0,0,0,null,0,0,0,null,0,0,0,0,0,null,0,0,0,0,0,null,0,0,0,null,0,0,0,null,0,0,0,0,0,null,0,0,0,0,0,null,0,0,0,null,0,0,0,null,"","","",null,0,0,0,0,0,null,0,0,0,0,0,null,0,0,0,null,0,0,0,null,0,0,0,0,0,null,0,0,0,0,0,null,0,0,0,null,0,0,0,null,"","",""]
[0,0,0,0,0,null,0,0,0,0,0,null,0,0,0,null,0,0,0,null,0,0,0,0,0,null,0,0,0,0,0,null,0,0,0,null,0,0,0,null,0,0,0,0,0,null,0,0,0,0,0,null,0,0,0,null,0,0,0,null,"","","",null,0,0,0,0,0,null,0,0,0,0,0,null,0,0,0,null,0,0,0,null,0,0,0,0,0,null,0,0,0,0,0,null,0,0,0,null,0,0,0,null,"","",""]
[0,0,0,0,0,null,0,0,0,0,0,null,0,0,0,null,0,0,0,null,0,0,0,0,0,null,0,0,0,0,0,null,0,0,0,null,0,0,0,null,0,0,0,0,0,null,0,0,0,0,0,null,0,0,0,null,0,0,0,null,"","","",null,0,0,0,0,0,null,0,0,0,0,0,null,0,0,0,null,0,0,0,null,0,0,0,0,0,null,0,0,0,0,0,null,0,0,0,null,0,0,0,null,"","",""]
[0,0,0,0,0,null,0,0,0,0,0,null,0,0,0,null,0,0,0,null,0,0,0,0,0,null,0,0,0,0,0,null,0,0,0,null,0,0,0,null,0,0,0,0,0,null,0,0,0,0,0,null,0,0,0,null,0,0,0,null,"","","",null,0,0,0,0,0,null,0,0,0,0,0,null,0,0,0,null,0,0,0,null,0,0,0,0,0,null,0,0,0,0,0,null,0,0,0,null,0,0,0,null,"","",""]
[0,0,0,0,0,null,0,0,0,0,0,null,0,0,0,null,0,0,0,null,0,0,0,0,0,null,0,0,0,0,0,null,0,0,0,null,0,0,0,null,0,0,0,0,0,null,0,0,0,0,0,null,0,0,0,null,0,0,0,null,"","","",null,0,0,0,0,0,null,0,0,0,0,0,null,0,0,0,null,0,0,0,null,0,0,0,0,0,null,0,0,0,0,0,null,0,0,0,null,0,0,0,null,"","",""]
[0,0,0,0,0,null,0,0,0,0,0,null,0,0,0,null,0,0,0,null,0,0,0,0,0,null,0,0,0,0,0,null,0,0,0,null,0,0,0,null,0,0,0,0,0,null,0,0,0,0,0,null,0,0,0,null,0,0,0,null,"","","",null,0,0,0,0,0,null,0,0,0,0,0,null,0,0,0,null,0,0,0,null,0,0,0,0,0,null,0,0,0,0,0,null,0,0,0,null,0,0,0,null,"","",""]
[0,0,0,0,0,null,0,0,0,0,0,null,0,0,0,null,0,0,0,null,0,0,0,0,0,null,0,0,0,0,0,null,0,0,0,null,0,0,0,null,0,0,0,0,0,null,0,0,0,0,0,null,0,0,0,null,0,0,0,null,"","","",null,0,0,0,0,0,null,0,0,0,0,0,null,0,0,0,null,0,0,0,null,0,0,0,0,0,null,0,0,0,0,0,null,0,0,0,null,0,0,0,null,"","",""]
[0,0,0,0,0,null,0,0,0,0,0,null,0,0,0,null,0,0,0,null,0,0,0,0,0,null,0,0,0,0,0,null,0,0,0,null,0,0,0,null,0,0,0,0,0,null,0,0,0,0,0,null,0,0,0,null,0,0,0,null,"","","",null,0,0,0,0,0,null,0,0,0,0,0,null,0,0,0,null,0,0,0,null,0,0,0,0,0,null,0,0,0,0,0,null,0,0,0,null,0,0,0,null,"","",""]
[0,0,0,0,0,null,0,0,0,0,0,null,0,0,0,null,0,0,0,null,0,0,0,0,0,null,0,0,0,0,0,null,0,0,0,null,0,0,0,null,0,0,0,0,0,null,0,0,0,0,0,null,0,0,0,null,0,0,0,null,"","","",null,0,0,0,0,0,null,0,0,0,0,0,null,0,0,0,null,0,0,0,null,0,0,0,0,0,null,0,0,0,0,0,null,0,0,0,null,0,0,0,null,"","",""]
[0,0,0,0,0,null,0,0,0,0,0,null,0,0,0,null,0,0,0,null,0,0,0,0,0,null,0,0,0,0,0,null,0,0,0,null,0,0,0,null,0,0,0,0,0,null,0,0,0,0,0,null,0,0,0,null,0,0,0,null,"","","",null,0,0,0,0,0,null,0,0,0,0,0,null,0,0,0,null,0,0,0,null,0,0,0,0,0,null,0,0,0,0,0,null,0,0,0,null,0,0,0,null,"","",""]
[0,0,0,0,0,null,0,0,0,0,0,null,0,0,0,null,0,0,0,null,0,0,0,0,0,null,0,0,0,0,0,null,0,0,0,null,0,0,0,null,0,0,0,0,0,null,0,0,0,0,0,null,0,0,0,null,0,0,0,null,"","","",null,0,0,0,0,0,null,0,0,0,0,0,null,0,0,0,null,0,0,0,null,0,0,0,0,0,null,0,0,0,0,0,null,0,0,0,null,0,0,0,null,"","",""]
[0,0,0,0,0,null,0,0,0,0,0,null,0,0,0,null,0,0,0,null,0,0,0,0,0,null,0,0,0,0,0,null,0,0,0,null,0,0,0,null,0,0,0,0,0,null,0,0,0,0,0,null,0,0,0,null,0,0,0,null,"","","",null,0,0,0,0,0,null,0,0,0,0,0,null,0,0,0,null,0,0,0,null,0,0,0,0,0,null,0,0,0,0,0,null,0,0,0,null,0,0,0,null,"","",""]
[0,0,0,0,0,null,0,0,0,0,0,null,0,0,0,null,0,0,0,null,0,0,0,0,0,null,0,0,0,0,0,null,0,0,0,null,0,0,0,null,0,0,0,0,0,null,0,0,0,0,0,null,0,0,0,null,0,0,0,null,"","","",null,0,0,0,0,0,null,0,0,0,0,0,null,0,0,0,null,0,0,0,null,0,0,0,0,0,null,0,0,0,0,0,null,0,0,0,null,0,0,0,null,"","",""]
[0,0,0,0,0,null,0,0,0,0,0,null,0,0,0,null,0,0,0,null,0,0,0,0,0,null,0,0,0,0,0,null,0,0,0,null,0,0,0,null,0,0,0,0,0,null,0,0,0,0,0,null,0,0,0,null,0,0,0,null,"","","",null,0,0,0,0,0,null,0,0,0,0,0,null,0,0,0,null,0,0,0,null,0,0,0,0,0,null,0,0,0,0,0,null,0,0,0,null,0,0,0,null,"","",""]
[0,0,0,0,0,null,0,0,0,0,0,null,0,0,0,null,0,0,0,null,0,0,0,0,0,null,0,0,0,0,0,null,0,0,0,null,0,0,0,null,0,0,0,0,0,null,0,0,0,0,0,null,0,0,0,null,0,0,0,null,"","","",null,0,0,0,0,0,null,0,0,0,0,0,null,0,0,0,null,0,0,0,null,0,0,0,0,0,null,0,0,0,0,0,null,0,0,0,null,0,0,0,null,"","",""]
[0,0,0,0,0,null,0,0,0,0,0,null,0,0,0,null,0,0,0,null,0,0,0,0,0,null,0,0,0,0,0,null,0,0,0,null,0,0,0,null,0,0,0,0,0,null,0,0,0,0,0,null,0,0,0,null,0,0,0,null,"","","",null,0,0,0,0,0,null,0,0,0,0,0,null,0,0,0,null,0,0,0,null,0,0,0,0,0,null,0,0,0,0,0,null,0,0,0,null,0,0,0,null,"","",""]
[0,0,0,0,0,null,0,0,0,0,0,null,0,0,0,null,0,0,0,null,0,0,0,0,0,null,0,0,0,0,0,null,0,0,0,null,0,0,0,null,0,0,0,0,0,null,0,0,0,0,0,null,0,0,0,null,0,0,0,null,"","","",null,0,0,0,0,0,null,0,0,0,0,0,null,0,0,0,null,0,0,0,null,0,0,0,0,0,null,0,0,0,0,0,null,0,0,0,null,0,0,0,null,"","",""]
[0,0,0,0,0,null,0,0,0,0,0,null,0,0,0,null,0,0,0,null,0,0,0,0,0,null,0,0,0,0,0,null,0,0,0,null,0,0,0,null,0,0,0,0,0,null,0,0,0,0,0,null,0,0,0,null,0,0,0,null,"","","",null,0,0,0,0,0,null,0,0,0,0,0,null,0,0,0,null,0,0,0,null,0,0,0,0,0,null,0,0,0,0,0,null,0,0,0,null,0,0,0,null,"","",""]
[0,0,0,0,0,null,0,0,0,0,0,null,0,0,0,null,0,0,0,null,0,0,0,0,0,null,0,0,0,0,0,null,0,0,0,null,0,0,0,null,0,0,0,0,0,null,0,0,0,0,0,null,0,0,0,null,0,0,0,null,"","","",null,0,0,0,0,0,null,0,0,0,0,0,null,0,0,0,null,0,0,0,null,0,0,0,0,0,null,0,0,0,0,0,null,0,0,0,null,0,0,0,null,"","",""]
[0,0,0,0,0,null,0,0,0,0,0,null,0,0,0,null,0,0,0,null,0,0,0,0,0,null,0,0,0,0,0,null,0,0,0,null,0,0,0,null,0,0,0,0,0,null,0,0,0,0,0,null,0,0,0,null,0,0,0,null,"","","",null,0,0,0,0,0,null,0,0,0,0,0,null,0,0,0,null,0,0,0,null,0,0,0,0,0,null,0,0,0,0,0,null,0,0,0,null,0,0,0,null,"","",""]
[0,0,0,0,0,null,0,0,0,0,0,null,0,0,0,null,0,0,0,null,0,0,0,0,0,null,0,0,0,0,0,null,0,0,0,null,0,0,0,null,0,0,0,0,0,null,0,0,0,0,0,null,0,0,0,null,0,0,0,null,"","","",null,0,0,0,0,0,null,0,0,0,0,0,null,0,0,0,null,0,0,0,null,0,0,0,0,0,null,0,0,0,0,0,null,0,0,0,null,0,0,0,null,"","",""]
[0,0,0,0,0,null,0,0,0,0,0,null,0,0,0,null,0,0,0,null,0,0,0,0,0,null,0,0,0,0,0,null,0,0,0,null,0,0,0,null,0,0,0,0,0,null,0,0,0,0,0,null,0,0,0,null,0,0,0,null,"","","",null,0,0,0,0,0,null,0,0,0,0,0,null,0,0,0,null,0,0,0,null,0,0,0,0,0,null,0,0,0,0,0,null,0,0,0,null,0,0,0,null,"","",""]
[0,0,0,0,0,null,0,0,0,0,0,null,0,0,0,null,0,0,0,null,0,0,0,0,0,null,0,0,0,0,0,null,0,0,0,null,0,0,0,null,0,0,0,0,0,null,0,0,0,0,0,null,0,0,0,null,0,0,0,null,"","","",null,0,0,0,0,0,null,0,0,0,0,0,null,0,0,0,null,0,0,0,null,0,0,0,0,0,null,0,0,0,0,0,null,0,0,0,null,0,0,0,null,"","",""]
[0,0,0,0,0,null,0,0,0,0,0,null,0,0,0,null,0,0,0,null,0,0,0,0,0,null,0,0,0,0,0,null,0,0,0,null,0,0,0,null,0,0,0,0,0,null,0,0,0,0,0,null,0,0,0,null,0,0,0,null,"","","",null,0,0,0,0,0,null,0,0,0,0,0,null,0,0,0,null,0,0,0,null,0,0,0,0,0,null,0,0,0,0,0,null,0,0,0,null,0,0,0,null,"","",""]
[0,0,0,0,0,null,0,0,0,0,0,null,0,0,0,null,0,0,0,null,0,0,0,0,0,null,0,0,0,0,0,null,0,0,0,null,0,0,0,null,0,0,0,0,0,null,0,0,0,0,0,null,0,0,0,null,0,0,0,null,"","","",null,0,0,0,0,0,null,0,0,0,0,0,null,0,0,0,null,0,0,0,null,0,0,0,0,0,null,0,0,0,0,0,null,0,0,0,null,0,0,0,null,"","",""]
[0,0,0,0,0,null,0,0,0,0,0,null,0,0,0,null,0,0,0,null,0,0,0,0,0,null,0,0,0,0,0,null,0,0,0,null,0,0,0,null,0,0,0,0,0,null,0,0,0,0,0,null,0,0,0,null,0,0,0,null,"","","",null,0,0,0,0,0,null,0,0,0,0,0,null,0,0,0,null,0,0,0,null,0,0,0,0,0,null,0,0,0,0,0,null,0,0,0,null,0,0,0,null,"","",""]
[0,0,0,0,0,null,0,0,0,0,0,null,0,0,0,null,0,0,0,null,0,0,0,0,0,null,0,0,0,0,0,null,0,0,0,null,0,0,0,null,0,0,0,0,0,null,0,0,0,0,0,null,0,0,0,null,0,0,0,null,"","","",null,0,0,0,0,0,null,0,0,0,0,0,null,0,0,0,null,0,0,0,null,0,0,0,0,0,null,0,0,0,0,0,null,0,0,0,null,0,0,0,null,"","",""]
[0,0,0,0,0,null,0,0,0,0,0,null,0,0,0,null,0,0,0,null,0,0,0,0,0,null,0,0,0,0,0,null,0,0,0,null,0,0,0,null,0,0,0,0,0,null,0,0,0,0,0,null,0,0,0,null,0,0,0,null,"","","",null,0,0,0,0,0,null,0,0,0,0,0,null,0,0,0,null,0,0,0,null,0,0,0,0,0,null,0,0,0,0,0,null,0,0,0,null,0,0,0,null,"","",""]
[0,0,0,0,0,null,0,0,0,0,0,null,0,0,0,null,0,0,0,null,0,0,0,0,0,null,0,0,0,0,0,null,0,0,0,null,0,0,0,null,0,0,0,0,0,null,0,0,0,0,0,null,0,0,0,null,0,0,0,null,"","","",null,0,0,0,0,0,null,0,0,0,0,0,null,0,0,0,null,0,0,0,null,0,0,0,0,0,null,0,0,0,0,0,null,0,0,0,null,0,0,0,null,"","",""]
[0,0,0,0,0,null,0,0,0,0,0,null,0,0,0,null,0,0,0,null,0,0,0,0,0,null,0,0,0,0,0,null,0,0,0,null,0,0,0,null,0,0,0,0,0,null,0,0,0,0,0,null,0,0,0,null,0,0,0,null,"","","",null,0,0,0,0,0,null,0,0,0,0,0,null,0,0,0,null,0,0,0,null,0,0,0,0,0,null,0,0,0,0,0,null,0,0,0,null,0,0,0,null,"","",""]
[0,0,0,0,0,null,0,0,0,0,0,null,0,0,0,null,0,0,0,null,0,0,0,0,0,null,0,0,0,0,0,null,0,0,0,null,0,0,0,null,0,0,0,0,0,null,0,0,0,0,0,null,0,0,0,null,0,0,0,null,"","","",null,0,0,0,0,0,null,0,0,0,0,0,null,0,0,0,null,0,0,0,null,0,0,0,0,0,null,0,0,0,0,0,null,0,0,0,null,0,0,0,null,"","",""]
[0,0,0,0,0,null,0,0,0,0,0,null,0,0,0,null,0,0,0,null,0,0,0,0,0,null,0,0,0,0,0,null,0,0,0,null,0,0,0,null,0,0,0,0,0,null,0,0,0,0,0,null,0,0,0,null,0,0,0,null,"","","",null,0,0,0,0,0,null,0,0,0,0,0,null,0,0,0,null,0,0,0,null,0,0,0,0,0,null,0,0,0,0,0,null,0,0,0,null,0,0,0,null,"","",""]
[0,0,0,0,0,null,0,0,0,0,0,null,0,0,0,null,0,0,0,null,0,0,0,0,0,null,0,0,0,0,0,null,0,0,0,null,0,0,0,null,0,0,0,0,0,null,0,0,0,0,0,null,0,0,0,null,0,0,0,null,"","","",null,0,0,0,0,0,null,0,0,0,0,0,null,0,0,0,null,0,0,0,null,0,0,0,0,0,null,0,0,0,0,0,null,0,0,0,null,0,0,0,null,"","",""]
[0,0,0,0,0,null,0,0,0,0,0,null,0,0,0,null,0,0,0,null,0,0,0,0,0,null,0,0,0,0,0,null,0,0,0,null,0,0,0,null,0,0,0,0,0,null,0,0,0,0,0,null,0,0,0,null,0,0,0,null,"","","",null,0,0,0,0,0,null,0,0,0,0,0,null,0,0,0,null,0,0,0,null,0,0,0,0,0,null,0,0,0,0,0,null,0,0,0,null,0,0,0,null,"","",""]
[0,0,0,0,0,null,0,0,0,0,0,null,0,0,0,null,0,0,0,null,0,0,0,0,0,null,0,0,0,0,0,null,0,0,0,null,0,0,0,null,0,0,0,0,0,null,0,0,0,0,0,null,0,0,0,null,0,0,0,null,"","","",null,0,0,0,0,0,null,0,0,0,0,0,null,0,0,0,null,0,0,0,null,0,0,0,0,0,null,0,0,0,0,0,null,0,0,0,null,0,0,0,null,"","",""]
[0,0,0,0,0,null,0,0,0,0,0,null,0,0,0,null,0,0,0,null,0,0,0,0,0,null,0,0,0,0,0,null,0,0,0,null,0,0,0,null,0,0,0,0,0,null,0,0,0,0,0,null,0,0,0,null,0,0,0,null,"","","",null,0,0,0,0,0,null,0,0,0,0,0,null,0,0,0,null,0,0,0,null,0,0,0,0,0,null,0,0,0,0,0,null,0,0,0,null,0,0,0,null,"","",""]
[0,0,0,0,0,null,0,0,0,0,0,null,0,0,0,null,0,0,0,null,0,0,0,0,0,null,0,0,0,0,0,null,0,0,0,null,0,0,0,null,0,0,0,0,0,null,0,0,0,0,0,null,0,0,0,null,0,0,0,null,"","","",null,0,0,0,0,0,null,0,0,0,0,0,null,0,0,0,null,0,0,0,null,0,0,0,0,0,null,0,0,0,0,0,null,0,0,0,null,0,0,0,null,"","",""]
[0,0,0,0,0,null,0,0,0,0,0,null,0,0,0,null,0,0,0,null,0,0,0,0,0,null,0,0,0,0,0,null,0,0,0,null,0,0,0,null,0,0,0,0,0,null,0,0,0,0,0,null,0,0,0,null,0,0,0,null,"","","",null,0,0,0,0,0,null,0,0,0,0,0,null,0,0,0,null,0,0,0,null,0,0,0,0,0,null,0,0,0,0,0,null,0,0,0,null,0,0,0,null,"","",""]
[0,0,0,0,0,null,0,0,0,0,0,null,0,0,0,null,0,0,0,null,0,0,0,0,0,null,0,0,0,0,0,null,0,0,0,null,0,0,0,null,0,0,0,0,0,null,0,0,0,0,0,null,0,0,0,null,0,0,0,null,"","","",null,0,0,0,0,0,null,0,0,0,0,0,null,0,0,0,null,0,0,0,null,0,0,0,0,0,null,0,0,0,0,0,null,0,0,0,null,0,0,0,null,"","",""]
[0,0,0,0,0,null,0,0,0,0,0,null,0,0,0,null,0,0,0,null,0,0,0,0,0,null,0,0,0,0,0,null,0,0,0,null,0,0,0,null,0,0,0,0,0,null,0,0,0,0,0,null,0,0,0,null,0,0,0,null,"","","",null,0,0,0,0,0,null,0,0,0,0,0,null,0,0,0,null,0,0,0,null,0,0,0,0,0,null,0,0,0,0,0,null,0,0,0,null,0,0,0,null,"","",""]
[0,0,0,0,0,null,0,0,0,0,0,null,0,0,0,null,0,0,0,null,0,0,0,0,0,null,0,0,0,0,0,null,0,0,0,null,0,0,0,null,0,0,0,0,0,null,0,0,0,0,0,null,0,0,0,null,0,0,0,null,"","","",null,0,0,0,0,0,null,0,0,0,0,0,null,0,0,0,null,0,0,0,null,0,0,0,0,0,null,0,0,0,0,0,null,0,0,0,null,0,0,0,null,"","",""]
[0,0,0,0,0,null,0,0,0,0,0,null,0,0,0,null,0,0,0,null,0,0,0,0,0,null,0,0,0,0,0,null,0,0,0,null,0,0,0,null,0,0,0,0,0,null,0,0,0,0,0,null,0,0,0,null,0,0,0,null,"","","",null,0,0,0,0,0,null,0,0,0,0,0,null,0,0,0,null,0,0,0,null,0,0,0,0,0,null,0,0,0,0,0,null,0,0,0,null,0,0,0,null,"","",""]

{"sheet":"Ergebnis 1","index":10,"n_rows":40,"n_cols":14,"rows_kept":40,"cut":false,"hidden":false,"merged":[[19,5,19,8],[35,0,35,3],[0,0,0,13],[5,1,5,2],[6,1,6,2],[7,1,7,2],[4,1,4,2],[4,6,4,7],[4,11,4,12],[5,6,5,7],[6,6,6,7],[7,6,7,7],[3,10,3,13],[10,10,10,13],[3,5,3,8],[10,5,10,8],[26,10,26,13],[20,11,20,12],[5,11,5,12],[6,11,6,12],[7,11,7,12],[21,11,21,12],[22,11,22,12],[23,11,23,12],[19,10,19,13],[3,0,3,3],[10,0,10,3],[19,0,19,3],[26,0,26,3],[21,1,21,2],[22,1,22,2],[23,1,23,2],[20,1,20,2],[26,5,26,8],[20,6,20,7],[21,6,21,7],[22,6,22,7],[23,6,23,7]]}
[{"$f":"CONCATENATE(\"Unterkreisschießen der Jugend\",CHAR(10),\"am \", HM!H7,\" in \",HM!C7)","v":"Unterkreisschießen der Jugend\nam 28.09.2019 in Garstedt"}]
[]
[]
["Mannschaft Schüler LG Auflage  - 12 bis 14 Jahre",null,null,null,null,"Mannschaft Jugend LG Freihand  - 15 bis 16 Jahre",null,null,null,null,"Mannschaft Junioren II LG Freihand  - 17 bis 18 Jahre"]
["Platz","Verein:",null,"Ringe:",null,"Platz","Verein:",null,"Ringe:",null,"Platz","Verein:",null,"Ringe:"]
[1,{"$f":"IF(Daten!N3=0,\"keine Teilnahme\",Daten!M3)","v":"keine Teilnahme"},null,{"$f":"IF(Daten!N3=0,\"\",Daten!N3)","v":""},null,1,{"$f":"IF(Daten!AL3=0,\"keine Teilnahme\",Daten!AK3)","v":"keine Teilnahme"},null,{"$f":"IF(Daten!AL3=0,\"\",Daten!AL3)","v":""},null,1,{"$f":"IF(Daten!BF3=0,\"keine Teilnahme\",Daten!BE3)","v":"keine Teilnahme"},null,{"$f":"IF(Daten!BF3=0,\"\",Daten!BF3)","v":""}]
[2,{"$f":"IF(Daten!N4=0,\"\",Daten!M4)","v":""},null,{"$f":"IF(Daten!N4=0,\"\",Daten!N4)","v":""},null,2,{"$f":"IF(Daten!AL4=0,\"\",Daten!AK4)","v":""},null,{"$f":"IF(Daten!AL4=0,\"\",Daten!AL4)","v":""},null,2,{"$f":"IF(Daten!BF4=0,\"\",Daten!BE4)","v":""},null,{"$f":"IF(Daten!BF4=0,\"\",Daten!BF4)","v":""}]
[3,{"$f":"IF(Daten!N5=0,\"\",Daten!M5)","v":""},null,{"$f":"IF(Daten!N5=0,\"\",Daten!N5)","v":""},null,3,{"$f":"IF(Daten!AL5=0,\"\",Daten!AK5)","v":""},null,{"$f":"IF(Daten!AL5=0,\"\",Daten!AL5)","v":""},null,3,{"$f":"IF(Daten!BF5=0,\"\",Daten!BE5)","v":""},null,{"$f":"IF(Daten!BF5=0,\"\",Daten!BF5)","v":""}]
[]
[]
["Bester Einzelschütze-/in Schüler LG Auflage ",null,null,null,null,"Bester Einzelschütze-/in Jugend LG Freihand",null,null,null,null,"Bester Einzelschütze-/in Junioren II LG Freihand"]
[null,"Verein:","Name:","Ringe:",null,null,"Verein:","Name:","Ringe:",null,null,"Verein:","Name:","Ringe:"]
["Gold",{"$f":"IF(C13=\"\",\"\",(VLOOKUP(C13,Daten!$B$3:$C$52,2,)))","v":""},{"$f":"IFERROR(INDEX(Daten!$B$2:$B$52,LARGE((Daten!$A$2:$A$52=20)*(ROW(Daten!$A$2:$A$52)-1),COUNTIF(Daten!$A$2:$A$52,20)+1-ROW($A$1))),\"\")","v":""},{"$f":"IF(C13=\"\",\"\",(VLOOKUP(C13,Daten!$B$3:$D$52,3,)))","v":""},null,"Gold",{"$f":"IF(H13=\"\",\"\",(VLOOKUP(H13,Daten!$V$3:$W$52,2,)))","v":""},{"$f":"IFERROR(INDEX(Daten!$V$2:$V$52,LARGE((Daten!$U$2:$U$52=30)*(ROW(Daten!$U$2:$U$52)-1),COUNTIF(Daten!$U$2:$U$52,30)+1-ROW($U$1))),\"\")","v":""},{"$f":"IF(H13=\"\",\"\",(VLOOKUP(H13,Daten!$V$3:$X$52,3,)))","v":""},null,"Gold",{"$f":"IF(M13=\"\",\"\",(VLOOKUP(M13,Daten!$AP$3:$AQ$52,2,)))","v":""},{"$f":"IFERROR(INDEX(Daten!$AP$2:$AP$52,LARGE((Daten!$AO$2:$AO$52=42)*(ROW(Daten!$AO$2:$AO$52)-1),COUNTIF(Daten!$AO$2:$AO$52,42)+1-ROW($AO$1))),\"\")","v":""},{"$f":"IF(M13=\"\",\"\",(VLOOKUP(M13,Daten!$AP$3:$AR$52,3,)))","v":""}]
["Silber",{"$f":"IF(C14=\"\",\"\",(VLOOKUP(C14,Daten!$B$3:$C$52,2,)))","v":""},{"$f":"IFERROR(INDEX(Daten!$B$2:$B$52,LARGE((Daten!$A$2:$A$52=20)*(ROW(Daten!$A$2:$A$52)-1),COUNTIF(Daten!$A$2:$A$52,20)+1-ROW($A$2))),\"\")","v":""},{"$f":"IF(C14=\"\",\"\",(VLOOKUP(C14,Daten!$B$3:$D$52,3,)))","v":""},null,"Silber",{"$f":"IF(H14=\"\",\"\",(VLOOKUP(H14,Daten!$V$3:$W$52,2,)))","v":""},{"$f":"IFERROR(INDEX(Daten!$V$2:$V$52,LARGE((Daten!$U$2:$U$52=30)*(ROW(Daten!$U$2:$U$52)-1),COUNTIF(Daten!$U$2:$U$52,30)+1-ROW($U$2))),\"\")","v":""},{"$f":"IF(H14=\"\",\"\",(VLOOKUP(H14,Daten!$V$3:$X$52,3,)))","v":""},null,"Silber",{"$f":"IF(M14=\"\",\"\",(VLOOKUP(M14,Daten!$AP$3:$AQ$52,2,)))","v":""},{"$f":"IFERROR(INDEX(Daten!$AP$2:$AP$52,LARGE((Daten!$AO$2:$AO$52=42)*(ROW(Daten!$AO$2:$AO$52)-1),COUNTIF(Daten!$AO$2:$AO$52,42)+1-ROW($AO$2))),\"\")","v":""},{"$f":"IF(M14=\"\",\"\",(VLOOKUP(M14,Daten!$AP$3:$AR$52,3,)))","v":""}]
["Bronze",{"$f":"IF(C15=\"\",\"\",(VLOOKUP(C15,Daten!$B$3:$C$52,2,)))","v":""},{"$f":"IFERROR(INDEX(Daten!$B$2:$B$52,LARGE((Daten!$A$2:$A$52=20)*(ROW(Daten!$A$2:$A$52)-1),COUNTIF(Daten!$A$2:$A$52,20)+1-ROW($A$3))),\"\")","v":""},{"$f":"IF(C15=\"\",\"\",(VLOOKUP(C15,Daten!$B$3:$D$52,3,)))","v":""},null,"Bronze",{"$f":"IF(H15=\"\",\"\",(VLOOKUP(H15,Daten!$V$3:$W$52,2,)))","v":""},{"$f":"IFERROR(INDEX(Daten!$V$2:$V$52,LARGE((Daten!$U$2:$U$52=30)*(ROW(Daten!$U$2:$U$52)-1),COUNTIF(Daten!$U$2:$U$52,30)+1-ROW($U$3))),\"\")","v":""},{"$f":"IF(H15=\"\",\"\",(VLOOKUP(H15,Daten!$V$3:$X$52,3,)))","v":""},null,"Bronze",{"$f":"IF(M15=\"\",\"\",(VLOOKUP(M15,Daten!$AP$3:$AQ$52,2,)))","v":""},{"$f":"IFERROR(INDEX(Daten!$AP$2:$AP$52,LARGE((Daten!$AO$2:$AO$52=42)*(ROW(Daten!$AO$2:$AO$52)-1),COUNTIF(Daten!$AO$2:$AO$52,42)+1-ROW($AO$3))),\"\")","v":""},{"$f":"IF(M15=\"\",\"\",(VLOOKUP(M15,Daten!$AP$3:$AR$52,3,)))","v":""}]
["Gold",{"$f":"IF(C16=\"\",\"\",(VLOOKUP(C16,Daten!$B$3:$C$52,2,)))","v":""},{"$f":"IFERROR(INDEX(Daten!$B$2:$B$52,LARGE((Daten!$A$2:$A$52=21)*(ROW(Daten!$A$2:$A$52)-1),COUNTIF(Daten!$A$2:$A$52,21)+1-ROW($A$1))),\"\")","v":""},{"$f":"IF(C16=\"\",\"\",(VLOOKUP(C16,Daten!$B$3:$D$52,3,)))","v":""},null,"Gold",{"$f":"IF(H16=\"\",\"\",(VLOOKUP(H16,Daten!$V$3:$W$52,2,)))","v":""},{"$f":"IFERROR(INDEX(Daten!$V$2:$V$52,LARGE((Daten!$U$2:$U$52=31)*(ROW(Daten!$U$2:$U$52)-1),COUNTIF(Daten!$U$2:$U$52,31)+1-ROW($U$1))),\"\")","v":""},{"$f":"IF(H16=\"\",\"\",(VLOOKUP(H16,Daten!$V$3:$X$52,3,)))","v":""},null,"Gold",{"$f":"IF(M16=\"\",\"\",(VLOOKUP(M16,Daten!$AP$3:$AQ$52,2,)))","v":""},{"$f":"IFERROR(INDEX(Daten!$AP$2:$AP$52,LARGE((Daten!$AO$2:$AO$52=43)*(ROW(Daten!$AO$2:$AO$52)-1),COUNTIF(Daten!$AO$2:$AO$52,43)+1-ROW($AO$1))),\"\")","v":""},{"$f":"IF(M16=\"\",\"\",(VLOOKUP(M16,Daten!$AP$3:$AR$52,3,)))","v":""}]
["Silber",{"$f":"IF(C17=\"\",\"\",(VLOOKUP(C17,Daten!$B$3:$C$52,2,)))","v":""},{"$f":"IFERROR(INDEX(Daten!$B$2:$B$52,LARGE((Daten!$A$2:$A$52=21)*(ROW(Daten!$A$2:$A$52)-1),COUNTIF(Daten!$A$2:$A$52,21)+1-ROW($A$2))),\"\")","v":""},{"$f":"IF(C17=\"\",\"\",(VLOOKUP(C17,Daten!$B$3:$D$52,3,)))","v":""},null,"Silber",{"$f":"IF(H17=\"\",\"\",(VLOOKUP(H17,Daten!$V$3:$W$52,2,)))","v":""},{"$f":"IFERROR(INDEX(Daten!$V$2:$V$52,LARGE((Daten!$U$2:$U$52=31)*(ROW(Daten!$U$2:$U$52)-1),COUNTIF(Daten!$U$2:$U$52,31)+1-ROW($U$2))),\"\")","v":""},{"$f":"IF(H17=\"\",\"\",(VLOOKUP(H17,Daten!$V$3:$X$52,3,)))","v":""},null,"Silber",{"$f":"IF(M17=\"\",\"\",(VLOOKUP(M17,Daten!$AP$3:$AQ$52,2,)))","v":""},{"$f":"IFERROR(INDEX(Daten!$AP$2:$AP$52,LARGE((Daten!$AO$2:$AO$52=43)*(ROW(Daten!$AO$2:$AO$52)-1),COUNTIF(Daten!$AO$2:$AO$52,43)+1-ROW($AO$2))),\"\")","v":""},{"$f":"IF(M17=\"\",\"\",(VLOOKUP(M17,Daten!$AP$3:$AR$52,3,)))","v":""}]
["Bronze",{"$f":"IF(C18=\"\",\"\",(VLOOKUP(C18,Daten!$B$3:$C$52,2,)))","v":""},{"$f":"IFERROR(INDEX(Daten!$B$2:$B$52,LARGE((Daten!$A$2:$A$52=21)*(ROW(Daten!$A$2:$A$52)-1),COUNTIF(Daten!$A$2:$A$52,21)+1-ROW($A$3))),\"\")","v":""},{"$f":"IF(C18=\"\",\"\",(VLOOKUP(C18,Daten!$B$3:$D$52,3,)))","v":""},null,"Bronze",{"$f":"IF(H18=\"\",\"\",(VLOOKUP(H18,Daten!$V$3:$W$52,2,)))","v":""},{"$f":"IFERROR(INDEX(Daten!$V$2:$V$52,LARGE((Daten!$U$2:$U$52=31)*(ROW(Daten!$U$2:$U$52)-1),COUNTIF(Daten!$U$2:$U$52,31)+1-ROW($U$3))),\"\")","v":""},{"$f":"IF(H18=\"\",\"\",(VLOOKUP(H18,Daten!$V$3:$X$52,3,)))","v":""},null,"Bronze",{"$f":"IF(M18=\"\",\"\",(VLOOKUP(M18,Daten!$AP$3:$AQ$52,2,)))","v":""},{"$f":"IFERROR(INDEX(Daten!$AP$2:$AP$52,LARGE((Daten!$AO$2:$AO$52=43)*(ROW(Daten!$AO$2:$AO$52)-1),COUNTIF(Daten!$AO$2:$AO$52,43)+1-ROW($AO$3))),\"\")","v":""},{"$f":"IF(M18=\"\",\"\",(VLOOKUP(M18,Daten!$AP$3:$AR$52,3,)))","v":""}]
[]
["Mannschaft Schüler LG Freihand",null,null,null,null,"Mannschaft Jugend KK",null,null,null,null,"Mannschaft Junioren II KK"]
["Platz","Verein:",null,"Ringe:",null,"Platz","Verein:",null,"Ringe:",null,"Platz","Verein:",null,"Ringe:"]
[1,{"$f":"IF(Daten!R3=0,\"keine Teilnahme\",Daten!Q3)","v":"keine Teilnahme"},null,{"$f":"IF(Daten!R3=0,\"\",Daten!R3)","v":""},null,1,{"$f":"IF(Daten!AH3=0,\"keine Teilnahme\",Daten!AG3)","v":"keine Teilnahme"},null,{"$f":"IF(Daten!AH3=0,\"\",Daten!AH3)","v":""},null,1,{"$f":"IF(Daten!BB3=0,\"keine Teilnahme\",Daten!BA3)","v":"keine Teilnahme"},null,{"$f":"IF(Daten!BB3=0,\"\",Daten!BB3)","v":""}]
[2,{"$f":"IF(Daten!R4=0,\"\",Daten!Q4)","v":""},null,{"$f":"IF(Daten!R4=0,\"\",Daten!R4)","v":""},null,2,{"$f":"IF(Daten!AH4=0,\"\",Daten!AG4)","v":""},null,{"$f":"IF(Daten!AH4=0,\"\",Daten!AH4)","v":""},null,2,{"$f":"IF(Daten!BB4=0,\"\",Daten!BA4)","v":""},null,{"$f":"IF(Daten!BB4=0,\"\",Daten!BB4)","v":""}]
[3,{"$f":"IF(Daten!R5=0,\"\",Daten!Q5)","v":""},null,{"$f":"IF(Daten!R5=0,\"\",Daten!R5)","v":""},null,3,{"$f":"IF(Daten!AH5=0,\"\",Daten!AG5)","v":""},null,{"$f":"IF(Daten!AH5=0,\"\",Daten!AH5)","v":""},null,3,{"$f":"IF(Daten!BB5=0,\"\",Daten!BA5)","v":""},null,{"$f":"IF(Daten!BB5=0,\"\",Daten!BB5)","v":""}]
[]
[]
["Bester Einzelschütze-/in Schüler Freihand",null,null,null,null,"Bester Einzelschütze-/in Jugend KK",null,null,null,null,"Bester Einzelschütze-/in Junioren II KK"]
[null,"Verein:","Name:","Ringe:",null,null,"Verein:","Name:","Ringe:",null,null,"Verein:","Name:","Ringe:"]
["Gold",{"$f":"IF(C29=\"\",\"\",(VLOOKUP(C29,Daten!$H$3:$I$52,2,)))","v":""},{"$f":"IFERROR(INDEX(Daten!$H$2:$H$52,LARGE((Daten!$G$2:$G$52=20)*(ROW(Daten!$G$2:$G$52)-1),COUNTIF(Daten!$G$2:$G$52,20)+1-ROW($G$1))),\"\")","v":""},{"$f":"IF(C29=\"\",\"\",(VLOOKUP(C29,Daten!$H$3:$J$52,3,)))","v":""},null,"Gold",{"$f":"IF(H29=\"\",\"\",(VLOOKUP(H29,Daten!$AB$3:$AC$52,2,)))","v":""},{"$f":"IFERROR(INDEX(Daten!$AB$2:$AB$52,LARGE((Daten!$AA$2:$AA$52=30)*(ROW(Daten!$AA$2:$AA$52)-1),COUNTIF(Daten!$AA$2:$AA$52,30)+1-ROW($AA$1))),\"\")","v":""},{"$f":"IF(H29=\"\",\"\",(VLOOKUP(H29,Daten!$AB$3:$AD$52,3,)))","v":""},null,"Gold",{"$f":"IF(M29=\"\",\"\",(VLOOKUP(M29,Daten!$AV$3:$AW$52,2,)))","v":""},{"$f":"IFERROR(INDEX(Daten!$AV$2:$AV$52,LARGE((Daten!$AU$2:$AU$52=42)*(ROW(Daten!$AU$2:$AU$52)-1),COUNTIF(Daten!$AU$2:$AU$52,42)+1-ROW($AU$1))),\"\")","v":""},{"$f":"IF(M29=\"\",\"\",(VLOOKUP(M29,Daten!$AV$3:$AX$52,3,)))","v":""}]
["Silber",{"$f":"IF(C30=\"\",\"\",(VLOOKUP(C30,Daten!$H$3:$I$52,2,)))","v":""},{"$f":"IFERROR(INDEX(Daten!$H$2:$H$52,LARGE((Daten!$G$2:$G$52=20)*(ROW(Daten!$G$2:$G$52)-1),COUNTIF(Daten!$G$2:$G$52,20)+1-ROW($G$2))),\"\")","v":""},{"$f":"IF(C30=\"\",\"\",(VLOOKUP(C30,Daten!$H$3:$J$52,3,)))","v":""},null,"Silber",{"$f":"IF(H30=\"\",\"\",(VLOOKUP(H30,Daten!$AB$3:$AC$52,2,)))","v":""},{"$f":"IFERROR(INDEX(Daten!$AB$2:$AB$52,LARGE((Daten!$AA$2:$AA$52=30)*(ROW(Daten!$AA$2:$AA$52)-1),COUNTIF(Daten!$AA$2:$AA$52,30)+1-ROW($AA$2))),\"\")","v":""},{"$f":"IF(H30=\"\",\"\",(VLOOKUP(H30,Daten!$AB$3:$AD$52,3,)))","v":""},null,"Silber",{"$f":"IF(M30=\"\",\"\",(VLOOKUP(M30,Daten!$AV$3:$AW$52,2,)))","v":""},{"$f":"IFERROR(INDEX(Daten!$AV$2:$AV$52,LARGE((Daten!$AU$2:$AU$52=42)*(ROW(Daten!$AU$2:$AU$52)-1),COUNTIF(Daten!$AU$2:$AU$52,42)+1-ROW($AU$2))),\"\")","v":""},{"$f":"IF(M30=\"\",\"\",(VLOOKUP(M30,Daten!$AV$3:$AX$52,3,)))","v":""}]
["Bronze",{"$f":"IF(C31=\"\",\"\",(VLOOKUP(C31,Daten!$H$3:$I$52,2,)))","v":""},{"$f":"IFERROR(INDEX(Daten!$H$2:$H$52,LARGE((Daten!$G$2:$G$52=20)*(ROW(Daten!$G$2:$G$52)-1),COUNTIF(Daten!$G$2:$G$52,20)+1-ROW($G$3))),\"\")","v":""},{"$f":"IF(C31=\"\",\"\",(VLOOKUP(C31,Daten!$H$3:$J$52,3,)))","v":""},null,"Bronze",{"$f":"IF(H31=\"\",\"\",(VLOOKUP(H31,Daten!$AB$3:$AC$52,2,)))","v":""},{"$f":"IFERROR(INDEX(Daten!$AB$2:$AB$52,LARGE((Daten!$AA$2:$AA$52=30)*(ROW(Daten!$AA$2:$AA$52)-1),COUNTIF(Daten!$AA$2:$AA$52,30)+1-ROW($AA$3))),\"\")","v":""},{"$f":"IF(H31=\"\",\"\",(VLOOKUP(H31,Daten!$AB$3:$AD$52,3,)))","v":""},null,"Bronze",{"$f":"IF(M31=\"\",\"\",(VLOOKUP(M31,Daten!$AV$3:$AW$52,2,)))","v":""},{"$f":"IFERROR(INDEX(Daten!$AV$2:$AV$52,LARGE((Daten!$AU$2:$AU$52=42)*(ROW(Daten!$AU$2:$AU$52)-1),COUNTIF(Daten!$AU$2:$AU$52,42)+1-ROW($AU$3))),\"\")","v":""},{"$f":"IF(M31=\"\",\"\",(VLOOKUP(M31,Daten!$AV$3:$AX$52,3,)))","v":""}]
["Gold",{"$f":"IF(C32=\"\",\"\",(VLOOKUP(C32,Daten!$H$3:$I$52,2,)))","v":""},{"$f":"IFERROR(INDEX(Daten!$H$2:$H$52,LARGE((Daten!$G$2:$G$52=21)*(ROW(Daten!$G$2:$G$52)-1),COUNTIF(Daten!$G$2:$G$52,21)+1-ROW($G$1))),\"\")","v":""},{"$f":"IF(C32=\"\",\"\",(VLOOKUP(C32,Daten!$H$3:$J$52,3,)))","v":""},null,"Gold",{"$f":"IF(H32=\"\",\"\",(VLOOKUP(H32,Daten!$AB$3:$AC$52,2,)))","v":""},{"$f":"IFERROR(INDEX(Daten!$AB$2:$AB$52,LARGE((Daten!$AA$2:$AA$52=31)*(ROW(Daten!$AA$2:$AA$52)-1),COUNTIF(Daten!$AA$2:$AA$52,31)+1-ROW($AA$1))),\"\")","v":""},{"$f":"IF(H32=\"\",\"\",(VLOOKUP(H32,Daten!$AB$3:$AD$52,3,)))","v":""},null,"Gold",{"$f":"IF(M32=\"\",\"\",(VLOOKUP(M32,Daten!$AV$3:$AW$52,2,)))","v":""},{"$f":"IFERROR(INDEX(Daten!$AV$2:$AV$52,LARGE((Daten!$AU$2:$AU$52=43)*(ROW(Daten!$AU$2:$AU$52)-1),COUNTIF(Daten!$AU$2:$AU$52,43)+1-ROW($AU$1))),\"\")","v":""},{"$f":"IF(M32=\"\",\"\",(VLOOKUP(M32,Daten!$AV$3:$AX$52,3,)))","v":""}]
["Silber",{"$f":"IF(C33=\"\",\"\",(VLOOKUP(C33,Daten!$H$3:$I$52,2,)))","v":""},{"$f":"IFERROR(INDEX(Daten!$H$2:$H$52,LARGE((Daten!$G$2:$G$52=21)*(ROW(Daten!$G$2:$G$52)-1),COUNTIF(Daten!$G$2:$G$52,21)+1-ROW($G$2))),\"\")","v":""},{"$f":"IF(C33=\"\",\"\",(VLOOKUP(C33,Daten!$H$3:$J$52,3,)))","v":""},null,"Silber",{"$f":"IF(H33=\"\",\"\",(VLOOKUP(H33,Daten!$AB$3:$AC$52,2,)))","v":""},{"$f":"IFERROR(INDEX(Daten!$AB$2:$AB$52,LARGE((Daten!$AA$2:$AA$52=31)*(ROW(Daten!$AA$2:$AA$52)-1),COUNTIF(Daten!$AA$2:$AA$52,31)+1-ROW($AA$2))),\"\")","v":""},{"$f":"IF(H33=\"\",\"\",(VLOOKUP(H33,Daten!$AB$3:$AD$52,3,)))","v":""},null,"Silber",{"$f":"IF(M33=\"\",\"\",(VLOOKUP(M33,Daten!$AV$3:$AW$52,2,)))","v":""},{"$f":"IFERROR(INDEX(Daten!$AV$2:$AV$52,LARGE((Daten!$AU$2:$AU$52=43)*(ROW(Daten!$AU$2:$AU$52)-1),COUNTIF(Daten!$AU$2:$AU$52,43)+1-ROW($AU$2))),\"\")","v":""},{"$f":"IF(M33=\"\",\"\",(VLOOKUP(M33,Daten!$AV$3:$AX$52,3,)))","v":""}]
["Bronze",{"$f":"IF(C34=\"\",\"\",(VLOOKUP(C34,Daten!$H$3:$I$52,2,)))","v":""},{"$f":"IFERROR(INDEX(Daten!$H$2:$H$52,LARGE((Daten!$G$2:$G$52=21)*(ROW(Daten!$G$2:$G$52)-1),COUNTIF(Daten!$G$2:$G$52,21)+1-ROW($G$3))),\"\")","v":""},{"$f":"IF(C34=\"\",\"\",(VLOOKUP(C34,Daten!$H$3:$J$52,3,)))","v":""},null,"Bronze",{"$f":"IF(H34=\"\",\"\",(VLOOKUP(H34,Daten!$AB$3:$AC$52,2,)))","v":""},{"$f":"IFERROR(INDEX(Daten!$AB$2:$AB$52,LARGE((Daten!$AA$2:$AA$52=31)*(ROW(Daten!$AA$2:$AA$52)-1),COUNTIF(Daten!$AA$2:$AA$52,31)+1-ROW($AA$3))),\"\")","v":""},{"$f":"IF(H34=\"\",\"\",(VLOOKUP(H34,Daten!$AB$3:$AD$52,3,)))","v":""},null,"Bronze",{"$f":"IF(M34=\"\",\"\",(VLOOKUP(M34,Daten!$AV$3:$AW$52,2,)))","v":""},{"$f":"IFERROR(INDEX(Daten!$AV$2:$AV$52,LARGE((Daten!$AU$2:$AU$52=43)*(ROW(Daten!$AU$2:$AU$52)-1),COUNTIF(Daten!$AU$2:$AU$52,43)+1-ROW($AU$3))),\"\")","v":""},{"$f":"IF(M34=\"\",\"\",(VLOOKUP(M34,Daten!$AV$3:$AX$52,3,)))","v":""}]
[]
["Unterkreiskönig-/in"]
["Platz","Verein:","Name:","Teiler:"]
[1,{"$f":"IF(Daten!BK3=\"\",\"\",Daten!BJ3)","v":""},{"$f":"IF(Daten!BK3=\"\",\"kein Teilnehmer\",Daten!BI3)","v":"kein Teilnehmer"},{"$f":"IF(Daten!BK3=\"\",\"\",Daten!BK3)","v":""}]
[2,{"$f":"IF(Daten!BK4=\"\",\"\",Daten!BJ4)","v":""},{"$f":"IF(Daten!BK4=\"\",\"\",Daten!BI4)","v":""},{"$f":"IF(Daten!BK4=\"\",\"\",Daten!BK4)","v":""}]
[3,{"$f":"IF(Daten!BK5=\"\",\"\",Daten!BJ5)","v":""},{"$f":"IF(Daten!BK5=\"\",\"\",Daten!BI5)","v":""},{"$f":"IF(Daten!BK5=\"\",\"\",Daten!BK5)","v":""}]

{"sheet":"Ergebnis 2","index":11,"n_rows":38,"n_cols":9,"rows_kept":38,"cut":false,"hidden":false,"merged":[[33,5,33,8],[0,0,1,8],[2,7,2,8],[8,7,8,8],[17,7,17,8],[23,7,23,8],[22,1,22,2],[22,6,22,7],[18,0,18,3],[18,5,18,8],[19,1,19,2],[19,6,19,7],[7,1,7,2],[7,6,7,7],[9,0,9,3],[9,5,9,8],[5,1,5,2],[24,0,24,3],[24,5,24,8],[20,1,20,2],[20,6,20,7],[21,1,21,2],[21,6,21,7],[5,6,5,7],[6,1,6,2],[6,6,6,7],[3,0,3,3],[3,5,3,8],[4,1,4,2],[4,6,4,7]]}
[{"$f":"CONCATENATE(\"Unterkreisschießen der Jugend\",CHAR(10),\"am \", HM!H7,\" in \",HM!C7)","v":"Unterkreisschießen der Jugend\nam 28.09.2019 in Garstedt"}]
[]
[null,null,null,null,null,null,null,"*LP = Lichtpunkt"]
["Mannschaft Junioren I  LG Freihand  - 19 bis 20 Jahre",null,null,null,null,"Mannschaft Schüler LP* Auflage  - 8 bis 11 Jahre"]
["Platz","Verein:",null,"Ringe:",null,"Platz","Verein:",null,"Ringe:"]
[1,{"$f":"IF(Daten!CD3=0,\"keine Teilnahme\",Daten!CC3)","v":"keine Teilnahme"},null,{"$f":"IF(Daten!CD3=0,\"\",Daten!CD3)","v":""},null,1,{"$f":"IF(Daten!CT3=0,\"keine Teilnahme\",Daten!CS3)","v":"keine Teilnahme"},null,{"$f":"IF(Daten!CT3=0,\"\",Daten!CT3)","v":""}]
[2,{"$f":"IF(Daten!CD4=0,\"\",Daten!CC4)","v":""},null,{"$f":"IF(Daten!CD4=0,\"\",Daten!CD4)","v":""},null,2,{"$f":"IF(Daten!CT4=0,\"\",Daten!CS4)","v":""},null,{"$f":"IF(Daten!CT4=0,\"\",Daten!CT4)","v":""}]
[3,{"$f":"IF(Daten!CD5=0,\"\",Daten!CC5)","v":""},null,{"$f":"IF(Daten!CD5=0,\"\",Daten!CD5)","v":""},null,3,{"$f":"IF(Daten!CT5=0,\"\",Daten!CS5)","v":""},null,{"$f":"IF(Daten!CT5=0,\"\",Daten!CT5)","v":""}]
[null,null,null,null,null,null,null,"*LP = Lichtpunkt"]
["Bester Einzelschütze-/in Junioren I LG Freihand",null,null,null,null,"Bester Einzelschütze-/in Schüler LP* Auflage "]
[null,"Verein:","Name:","Ringe:",null,null,"Verein:","Name:","Ringe:"]
["Gold",{"$f":"IF(C12=\"\",\"\",(VLOOKUP(C12,Daten!$BN$3:$BO$52,2,)))","v":""},{"$f":"IFERROR(INDEX(Daten!$BN$2:$BN$52,LARGE((Daten!$BM$2:$BM$52=40)*(ROW(Daten!$BM$2:$BM$52)-1),COUNTIF(Daten!$BM$2:$BM$52,40)+1-ROW($BM$1))),\"\")","v":""},{"$f":"IF(C12=\"\",\"\",(VLOOKUP(C12,Daten!$BN$3:$BP$52,3,)))","v":""},null,"Gold",{"$f":"IF(H12=\"\",\"\",(VLOOKUP(H12,Daten!$CH$3:$CI$52,2,)))","v":""},{"$f":"IFERROR(INDEX(Daten!$CH$2:$CH$52,LARGE((Daten!$CG$2:$CG$52=24)*(ROW(Daten!$CG$2:$CG$52)-1),COUNTIF(Daten!$CG$2:$CG$52,24)+1-ROW($CG$1))),\"\")","v":""},{"$f":"IF(H12=\"\",\"\",(VLOOKUP(H12,Daten!$CH$3:$CJ$52,3,)))","v":""}]
["Silber",{"$f":"IF(C13=\"\",\"\",(VLOOKUP(C13,Daten!$BN$3:$BO$52,2,)))","v":""},{"$f":"IFERROR(INDEX(Daten!$BN$2:$BN$52,LARGE((Daten!$BM$2:$BM$52=40)*(ROW(Daten!$BM$2:$BM$52)-1),COUNTIF(Daten!$BM$2:$BM$52,40)+1-ROW($BM$2))),\"\")","v":""},{"$f":"IF(C13=\"\",\"\",(VLOOKUP(C13,Daten!$BN$3:$BP$52,3,)))","v":""},null,"Silber",{"$f":"IF(H13=\"\",\"\",(VLOOKUP(H13,Daten!$CH$3:$CI$52,2,)))","v":""},{"$f":"IFERROR(INDEX(Daten!$CH$2:$CH$52,LARGE((Daten!$CG$2:$CG$52=24)*(ROW(Daten!$CG$2:$CG$52)-1),COUNTIF(Daten!$CG$2:$CG$52,24)+1-ROW($CG$2))),\"\")","v":""},{"$f":"IF(H13=\"\",\"\",(VLOOKUP(H13,Daten!$CH$3:$CJ$52,3,)))","v":""}]
["Bronze",{"$f":"IF(C14=\"\",\"\",(VLOOKUP(C14,Daten!$BN$3:$BO$52,2,)))","v":""},{"$f":"IFERROR(INDEX(Daten!$BN$2:$BN$52,LARGE((Daten!$BM$2:$BM$52=40)*(ROW(Daten!$BM$2:$BM$52)-1),COUNTIF(Daten!$BM$2:$BM$52,40)+1-ROW($BM$3))),\"\")","v":""},{"$f":"IF(C14=\"\",\"\",(VLOOKUP(C14,Daten!$BN$3:$BP$52,3,)))","v":""},null,"Bronze",{"$f":"IF(H14=\"\",\"\",(VLOOKUP(H14,Daten!$CH$3:$CI$52,2,)))","v":""},{"$f":"IFERROR(INDEX(Daten!$CH$2:$CH$52,LARGE((Daten!$CG$2:$CG$52=24)*(ROW(Daten!$CG$2:$CG$52)-1),COUNTIF(Daten!$CG$2:$CG$52,24)+1-ROW($CG$3))),\"\")","v":""},{"$f":"IF(H14=\"\",\"\",(VLOOKUP(H14,Daten!$CH$3:$CJ$52,3,)))","v":""}]
["Gold",{"$f":"IF(C15=\"\",\"\",(VLOOKUP(C15,Daten!$BN$3:$BO$52,2,)))","v":""},{"$f":"IFERROR(INDEX(Daten!$BN$2:$BN$52,LARGE((Daten!$BM$2:$BM$52=41)*(ROW(Daten!$BM$2:$BM$52)-1),COUNTIF(Daten!$BM$2:$BM$52,41)+1-ROW($BM$1))),\"\")","v":""},{"$f":"IF(C15=\"\",\"\",(VLOOKUP(C15,Daten!$BN$3:$BP$52,3,)))","v":""},null,"Gold",{"$f":"IF(H15=\"\",\"\",(VLOOKUP(H15,Daten!$CH$3:$CI$52,2,)))","v":""},{"$f":"IFERROR(INDEX(Daten!$CH$2:$CH$52,LARGE((Daten!$CG$2:$CG$52=25)*(ROW(Daten!$CG$2:$CG$52)-1),COUNTIF(Daten!$CG$2:$CG$52,25)+1-ROW($CG$1))),\"\")","v":""},{"$f":"IF(H15=\"\",\"\",(VLOOKUP(H15,Daten!$CH$3:$CJ$52,3,)))","v":""}]
["Silber",{"$f":"IF(C16=\"\",\"\",(VLOOKUP(C16,Daten!$BN$3:$BO$52,2,)))","v":""},{"$f":"IFERROR(INDEX(Daten!$BN$2:$BN$52,LARGE((Daten!$BM$2:$BM$52=41)*(ROW(Daten!$BM$2:$BM$52)-1),COUNTIF(Daten!$BM$2:$BM$52,41)+1-ROW($BM$2))),\"\")","v":""},{"$f":"IF(C16=\"\",\"\",(VLOOKUP(C16,Daten!$BN$3:$BP$52,3,)))","v":""},null,"Silber",{"$f":"IF(H16=\"\",\"\",(VLOOKUP(H16,Daten!$CH$3:$CI$52,2,)))","v":""},{"$f":"IFERROR(INDEX(Daten!$CH$2:$CH$52,LARGE((Daten!$CG$2:$CG$52=25)*(ROW(Daten!$CG$2:$CG$52)-1),COUNTIF(Daten!$CG$2:$CG$52,25)+1-ROW($CG$2))),\"\")","v":""},{"$f":"IF(H16=\"\",\"\",(VLOOKUP(H16,Daten!$CH$3:$CJ$52,3,)))","v":""}]
["Bronze",{"$f":"IF(C17=\"\",\"\",(VLOOKUP(C17,Daten!$BN$3:$BO$52,2,)))","v":""},{"$f":"IFERROR(INDEX(Daten!$BN$2:$BN$52,LARGE((Daten!$BM$2:$BM$52=41)*(ROW(Daten!$BM$2:$BM$52)-1),COUNTIF(Daten!$BM$2:$BM$52,41)+1-ROW($BM$3))),\"\")","v":""},{"$f":"IF(C17=\"\",\"\",(VLOOKUP(C17,Daten!$BN$3:$BP$52,3,)))","v":""},null,"Bronze",{"$f":"IF(H17=\"\",\"\",(VLOOKUP(H17,Daten!$CH$3:$CI$52,2,)))","v":""},{"$f":"IFERROR(INDEX(Daten!$CH$2:$CH$52,LARGE((Daten!$CG$2:$CG$52=25)*(ROW(Daten!$CG$2:$CG$52)-1),COUNTIF(Daten!$CG$2:$CG$52,25)+1-ROW($CG$3))),\"\")","v":""},{"$f":"IF(H17=\"\",\"\",(VLOOKUP(H17,Daten!$CH$3:$CJ$52,3,)))","v":""}]
[null,null,null,null,null,null,null,"*LP = Lichtpunkt"]
["Mannschaft Junioren I KK",null,null,null,null,"Mannschaft Schüler LP* Freihand"]
["Platz","Verein:",null,"Ringe:",null,"Platz","Verein:",null,"Ringe:"]
[1,{"$f":"IF(Daten!BZ3=0,\"keine Teilnahme\",Daten!BY3)","v":"keine Teilnahme"},null,{"$f":"IF(Daten!BZ3=0,\"\",Daten!BZ3)","v":""},null,1,{"$f":"IF(Daten!CX3=0,\"keine Teilnahme\",Daten!CW3)","v":"keine Teilnahme"},null,{"$f":"IF(Daten!CX3=0,\"\",Daten!CX3)","v":""}]
[2,{"$f":"IF(Daten!BZ4=0,\"\",Daten!BY4)","v":""},null,{"$f":"IF(Daten!BZ4=0,\"\",Daten!BZ4)","v":""},null,2,{"$f":"IF(Daten!CX4=0,\"\",Daten!CW4)","v":""},null,{"$f":"IF(Daten!CX4=0,\"\",Daten!CX4)","v":""}]
[3,{"$f":"IF(Daten!BZ5=0,\"\",Daten!BY5)","v":""},null,{"$f":"IF(Daten!BZ5=0,\"\",Daten!BZ5)","v":""},null,3,{"$f":"IF(Daten!CX5=0,\"\",Daten!CW5)","v":""},null,{"$f":"IF(Daten!CX5=0,\"\",Daten!CX5)","v":""}]
[null,null,null,null,null,null,null,"*LP = Lichtpunkt"]
["Bester Einzelschütze-/in Junioren I KK",null,null,null,null,"Bester Einzelschütze-/in Schüler Freihand"]
[null,"Verein:","Name:","Ringe:",null,null,"Verein:","Name:","Ringe:"]
["Gold",{"$f":"IF(C27=\"\",\"\",(VLOOKUP(C27,Daten!$BT$3:$BU$52,2,)))","v":""},{"$f":"IFERROR(INDEX(Daten!$BT$2:$BT$52,LARGE((Daten!$BS$2:$BS$52=40)*(ROW(Daten!$BS$2:$BS$52)-1),COUNTIF(Daten!$BS$2:$BS$52,40)+1-ROW($BS$1))),\"\")","v":""},{"$f":"IF(C27=\"\",\"\",(VLOOKUP(C27,Daten!$BT$3:$BV$52,3,)))","v":""},null,"Gold",{"$f":"IF(H27=\"\",\"\",(VLOOKUP(H27,Daten!$CN$3:$CO$52,2,)))","v":""},{"$f":"IFERROR(INDEX(Daten!$CN$2:$CN$52,LARGE((Daten!$CM$2:$CM$52=24)*(ROW(Daten!$CM$2:$CM$52)-1),COUNTIF(Daten!$CM$2:$CM$52,24)+1-ROW($CM$1))),\"\")","v":""},{"$f":"IF(H27=\"\",\"\",(VLOOKUP(H27,Daten!$CN$3:$CP$52,3,)))","v":""}]
["Silber",{"$f":"IF(C28=\"\",\"\",(VLOOKUP(C28,Daten!$BT$3:$BU$52,2,)))","v":""},{"$f":"IFERROR(INDEX(Daten!$BT$2:$BT$52,LARGE((Daten!$BS$2:$BS$52=40)*(ROW(Daten!$BS$2:$BS$52)-1),COUNTIF(Daten!$BS$2:$BS$52,40)+1-ROW($BS$2))),\"\")","v":""},{"$f":"IF(C28=\"\",\"\",(VLOOKUP(C28,Daten!$BT$3:$BV$52,3,)))","v":""},null,"Silber",{"$f":"IF(H28=\"\",\"\",(VLOOKUP(H28,Daten!$CN$3:$CO$52,2,)))","v":""},{"$f":"IFERROR(INDEX(Daten!$CN$2:$CN$52,LARGE((Daten!$CM$2:$CM$52=24)*(ROW(Daten!$CM$2:$CM$52)-1),COUNTIF(Daten!$CM$2:$CM$52,24)+1-ROW($CM$2))),\"\")","v":""},{"$f":"IF(H28=\"\",\"\",(VLOOKUP(H28,Daten!$CN$3:$CP$52,3,)))","v":""}]
["Bronze",{"$f":"IF(C29=\"\",\"\",(VLOOKUP(C29,Daten!$BT$3:$BU$52,2,)))","v":""},{"$f":"IFERROR(INDEX(Daten!$BT$2:$BT$52,LARGE((Daten!$BS$2:$BS$52=40)*(ROW(Daten!$BS$2:$BS$52)-1),COUNTIF(Daten!$BS$2:$BS$52,40)+1-ROW($BS$3))),\"\")","v":""},{"$f":"IF(C29=\"\",\"\",(VLOOKUP(C29,Daten!$BT$3:$BV$52,3,)))","v":""},null,"Bronze",{"$f":"IF(H29=\"\",\"\",(VLOOKUP(H29,Daten!$CN$3:$CO$52,2,)))","v":""},{"$f":"IFERROR(INDEX(Daten!$CN$2:$CN$52,LARGE((Daten!$CM$2:$CM$52=24)*(ROW(Daten!$CM$2:$CM$52)-1),COUNTIF(Daten!$CM$2:$CM$52,24)+1-ROW($CM$3))),\"\")","v":""},{"$f":"IF(H29=\"\",\"\",(VLOOKUP(H29,Daten!$CN$3:$CP$52,3,)))","v":""}]
["Gold",{"$f":"IF(C30=\"\",\"\",(VLOOKUP(C30,Daten!$BT$3:$BU$52,2,)))","v":""},{"$f":"IFERROR(INDEX(Daten!$BT$2:$BT$52,LARGE((Daten!$BS$2:$BS$52=41)*(ROW(Daten!$BS$2:$BS$52)-1),COUNTIF(Daten!$BS$2:$BS$52,41)+1-ROW($BS$1))),\"\")","v":""},{"$f":"IF(C30=\"\",\"\",(VLOOKUP(C30,Daten!$BT$3:$BV$52,3,)))","v":""},null,"Gold",{"$f":"IF(H30=\"\",\"\",(VLOOKUP(H30,Daten!$CN$3:$CO$52,2,)))","v":""},{"$f":"IFERROR(INDEX(Daten!$CN$2:$CN$52,LARGE((Daten!$CM$2:$CM$52=25)*(ROW(Daten!$CM$2:$CM$52)-1),COUNTIF(Daten!$CM$2:$CM$52,25)+1-ROW($CM$1))),\"\")","v":""},{"$f":"IF(H30=\"\",\"\",(VLOOKUP(H30,Daten!$CN$3:$CP$52,3,)))","v":""}]
["Silber",{"$f":"IF(C31=\"\",\"\",(VLOOKUP(C31,Daten!$BT$3:$BU$52,2,)))","v":""},{"$f":"IFERROR(INDEX(Daten!$BT$2:$BT$52,LARGE((Daten!$BS$2:$BS$52=41)*(ROW(Daten!$BS$2:$BS$52)-1),COUNTIF(Daten!$BS$2:$BS$52,41)+1-ROW($BS$2))),\"\")","v":""},{"$f":"IF(C31=\"\",\"\",(VLOOKUP(C31,Daten!$BT$3:$BV$52,3,)))","v":""},null,"Silber",{"$f":"IF(H31=\"\",\"\",(VLOOKUP(H31,Daten!$CN$3:$CO$52,2,)))","v":""},{"$f":"IFERROR(INDEX(Daten!$CN$2:$CN$52,LARGE((Daten!$CM$2:$CM$52=25)*(ROW(Daten!$CM$2:$CM$52)-1),COUNTIF(Daten!$CM$2:$CM$52,25)+1-ROW($CM$2))),\"\")","v":""},{"$f":"IF(H31=\"\",\"\",(VLOOKUP(H31,Daten!$CN$3:$CP$52,3,)))","v":""}]
["Bronze",{"$f":"IF(C32=\"\",\"\",(VLOOKUP(C32,Daten!$BT$3:$BU$52,2,)))","v":""},{"$f":"IFERROR(INDEX(Daten!$BT$2:$BT$52,LARGE((Daten!$BS$2:$BS$52=41)*(ROW(Daten!$BS$2:$BS$52)-1),COUNTIF(Daten!$BS$2:$BS$52,41)+1-ROW($BS$3))),\"\")","v":""},{"$f":"IF(C32=\"\",\"\",(VLOOKUP(C32,Daten!$BT$3:$BV$52,3,)))","v":""},null,"Bronze",{"$f":"IF(H32=\"\",\"\",(VLOOKUP(H32,Daten!$CN$3:$CO$52,2,)))","v":""},{"$f":"IFERROR(INDEX(Daten!$CN$2:$CN$52,LARGE((Daten!$CM$2:$CM$52=25)*(ROW(Daten!$CM$2:$CM$52)-1),COUNTIF(Daten!$CM$2:$CM$52,25)+1-ROW($CM$3))),\"\")","v":""},{"$f":"IF(H32=\"\",\"\",(VLOOKUP(H32,Daten!$CN$3:$CP$52,3,)))","v":""}]
[]
[null,null,null,null,null,"Lichtpunktkönig-/in"]
[null,null,null,null,null,"Platz","Verein:","Name:","Teiler:"]
[null,null,null,null,null,1,{"$f":"IF(Daten!DC3=\"\",\"\",Daten!DB3)","v":""},{"$f":"IF(Daten!DC3=\"\",\"kein Teilnehmer\",Daten!DA3)","v":"kein Teilnehmer"},{"$f":"IF(Daten!DC3=\"\",\"\",Daten!DC3)","v":""}]
[null,null,null,null,null,2,{"$f":"IF(Daten!DC4=\"\",\"\",Daten!DB4)","v":""},{"$f":"IF(Daten!DC4=\"\",\"\",Daten!DA4)","v":""},{"$f":"IF(Daten!DC4=\"\",\"\",Daten!DC4)","v":""}]
[null,null,null,null,null,3,{"$f":"IF(Daten!DC5=\"\",\"\",Daten!DB5)","v":""},{"$f":"IF(Daten!DC5=\"\",\"\",Daten!DA5)","v":""},{"$f":"IF(Daten!DC5=\"\",\"\",Daten!DC5)","v":""}]