{"text_format":"1","workbook":"xlsx","n_sheets":16,"sheets":["HM","PK-Luhe-Komm","PK-Damen","PK-Jugend-Schüler","PS","Seite-1","Seite-2","Preisteiler gesamt","Ergebnisse Aushang","D","Sammler","Quittung","Preisaufteilung","Etikettenvorlage","EMAIL","Mannschaft Übersicht"],"not_rendered":{"charts":0,"images":42,"macros":1,"external_links":0,"defined_names":8,"comments":1,"pivot_tables":0},"unopened":[],"bounds":{"document_bytes":16777216,"sheet_cells":100000,"rows_first":2000,"rows_last":500,"rows_between":2000,"halvings":0,"cell_chars":16384,"cell_head_chars":4096},"cells_cut":0,"cells_raw":0,"read":"whole","date_system":"1900"}

{"sheet":"HM","index":0,"n_rows":265,"n_cols":14,"rows_kept":265,"cut":false,"hidden":false,"merged":[[256,1,264,1],[1,9,1,10],[1,3,1,5],[2,0,2,1]]}
[null,"Anzahl Vereine"]
[null,{"$f":"SUM(IF(FREQUENCY(IF(LEN(B5:B254)>0,MATCH(B5:B254,B5:B254,0),\"\"), IF(LEN(B5:B254)>0,MATCH(B5:B254,B5:B254,0),\"\"))>0,1))","v":0},"60% vom Preisgeld",{"$f":"COUNTA(D5:D204)*$D$257+COUNTA(E5:E204)*$D$258+COUNTA(F5:F204)*$D$259","v":0},null,null,{"$f":"G3*$D$260","v":0},{"$f":"H3*$D$262","v":0},{"$f":"I3*$D$261","v":0},{"$f":"J3*$D$263+K3*$D$264","v":0},null,{"$f":"L3*$D$265","v":0},2018]
[{"$f":"TODAY()","v":"2018-08-13"},null,{"$f":"J2*60/100","v":0},{"$f":"COUNTA(D5:D204)+COUNTA(F5:F204)","v":0},{"$f":"COUNTA(E5:E204)+COUNTA(F5:F204)","v":0},null,{"$f":"COUNTA(G5:G204)","v":0},{"$f":"COUNTA(H5:H204)","v":0},{"$f":"COUNTA(I5:I204)","v":0},{"$f":"COUNTA(J5:J204)","v":0},{"$f":"SUM(K5:K204)","v":0},{"$f":"SUM(L5:L204)","v":0},{"$f":"SUM(M5:M204)","v":0}]
["Lfd.\nNr.:","Verein:","Vor- und Nachname:","Luhe\nPokal","Komm.\nPokal","Beide \nPokale","Damen\nPokal","Jugend\nPokal","Schüler\nPokal","Preis","Preis\n(nachgelöst)","Munition\nRWS","Summe","Datum der\nErfassung\n(automatisch)"]
[1,null,null,null,null,null,null,null,null,null,null,null,{"$f":"IF(B5=\"\",\"\",D5*$D$257+E5*$D$258+F5*$D$259+G5*$D$260+H5*$D$262+I5*$D$261+J5*$D$263+K5*$D$264+L5*$D$265)","v":""}]
[2,null,null,null,null,null,null,null,null,null,null,null,{"$f":"IF(B6=\"\",\"\",D6*$D$257+E6*$D$258+F6*$D$259+G6*$D$260+H6*$D$262+I6*$D$261+J6*$D$263+K6*$D$264+L6*$D$265)","v":""}]
{"$rows_left_out":260}
{"sheet":"PK-Luhe-Komm","index":1,"n_rows":280,"n_cols":12,"rows_kept":280,"cut":false,"hidden":false,"merged":[[0,1,0,4],[0,7,0,10]]}
[null,"Luhepokal",null,null,null,null,null,"Kommandeurspokal"]
[null,"Verein:","Name:","Ringe:","Teiler:","Nr:",null,"Verein:","Name:","Ringe:","Teiler:","Nr:"]
[null,{"$f":"IF(F3=\"\",\"\",VLOOKUP(F3,HM!$A$5:$C$254,2))","v":""},{"$f":"IF(F3=\"\",\"\",VLOOKUP(F3,HM!$A$5:$C$254,3))","v":""},null,null,null,null,{"$f":"IF(L3=\"\",\"\",VLOOKUP(L3,HM!$A$5:$C$254,2))","v":""},{"$f":"IF(L3=\"\",\"\",VLOOKUP(L3,HM!$A$5:$C$254,3))","v":""}]
[null,null,{"$f":"IF(F4=\"\",\"\",VLOOKUP(F4,HM!$A$5:$C$254,3))","v":""},null,null,null,null,null,{"$f":"IF(L4=\"\",\"\",VLOOKUP(L4,HM!$A$5:$C$254,3))","v":""}]
[null,"1.",{"$f":"IF(F5=\"\",\"\",VLOOKUP(F5,HM!$A$5:$C$254,3))","v":""},null,null,null,null,"1.",{"$f":"IF(L5=\"\",\"\",VLOOKUP(L5,HM!$A$5:$C$254,3))","v":""}]
[null,null,{"$f":"IF(F6=\"\",\"\",VLOOKUP(F6,HM!$A$5:$C$254,3))","v":""},null,null,null,null,null,{"$f":"IF(L6=\"\",\"\",VLOOKUP(L6,HM!$A$5:$C$254,3))","v":""}]
{"$rows_left_out":275}
{"sheet":"PK-Damen","index":2,"n_rows":180,"n_cols":6,"rows_kept":180,"cut":false,"hidden":false,"merged":[[0,1,0,4]]}
[null,"Damenpokal"]
[null,"Verein:","Name:","Ringe:","Teiler:","Nr."]
[null,{"$f":"IF(F3=\"\",\"\",VLOOKUP(F3,HM!$A$5:$C$254,2))","v":""},{"$f":"IF(F3=\"\",\"\",VLOOKUP(F3,HM!$A$5:$C$254,3))","v":""}]
[null,null,{"$f":"IF(F4=\"\",\"\",VLOOKUP(F4,HM!$A$5:$C$254,3))","v":""}]
[null,"1.",{"$f":"IF(F5=\"\",\"\",VLOOKUP(F5,HM!$A$5:$C$254,3))","v":""}]
[null,null,"gesamt:",{"$f":"SUM(D3:D5)","v":0},{"$f":"MIN(E3:E5)","v":0}]
{"$rows_left_out":175}
{"sheet":"PK-Jugend-Schüler","index":3,"n_rows":90,"n_cols":10,"rows_kept":90,"cut":false,"hidden":false,"merged":[[0,1,0,3],[0,6,0,8]]}
[null,"Jugendpokal",null,null,null,null,"Schülerpokal"]
[null,"Verein:","Name:","Ringe:","Nr.",null,"Verein:","Name:","Ringe:","Nr."]
[null,{"$f":"IF(E3=\"\",\"\",VLOOKUP(E3,HM!$A$5:$C$254,2))","v":""},{"$f":"IF(E3=\"\",\"\",VLOOKUP(E3,HM!$A$5:$C$254,3))","v":""},null,null,null,{"$f":"IF(J3=\"\",\"\",VLOOKUP(J3,HM!$A$5:$C$254,2))","v":""},{"$f":"IF(J3=\"\",\"\",VLOOKUP(J3,HM!$A$5:$C$254,3))","v":""}]
[null,null,{"$f":"IF(E4=\"\",\"\",VLOOKUP(E4,HM!$A$5:$C$254,3))","v":""},null,null,null,null,{"$f":"IF(J4=\"\",\"\",VLOOKUP(J4,HM!$A$5:$C$254,3))","v":""}]
[null,"1.",{"$f":"IF(E5=\"\",\"\",VLOOKUP(E5,HM!$A$5:$C$254,3))","v":""},null,null,null,"1.",{"$f":"IF(J5=\"\",\"\",VLOOKUP(J5,HM!$A$5:$C$254,3))","v":""}]
[null,null,"gesamt:",{"$f":"SUM(D3:D5)","v":0},null,null,null,"gesamt:",{"$f":"SUM(I3:I5)","v":0}]
{"$rows_left_out":85}
{"sheet":"PS","index":4,"n_rows":254,"n_cols":6,"rows_kept":254,"cut":false,"hidden":false,"merged":[[2,1,2,4]]}
[]
[]
[null,"Preisschießen"]
[null,"Lfd. Nr.:","Verein:","Vor- und Nachname:","Teiler:"]
[1,null,{"$f":"IF(B5=\"\",\"\",VLOOKUP(B5,HM!$A$5:$C$254,2))","v":""},{"$f":"IF(B5=\"\",\"\",VLOOKUP(B5,HM!$A$5:$D$254,3))","v":""},null,1]
[2,null,{"$f":"IF(B6=\"\",\"\",VLOOKUP(B6,HM!$A$5:$C$254,2))","v":""},{"$f":"IF(B6=\"\",\"\",VLOOKUP(B6,HM!$A$5:$D$254,3))","v":""},null,2]
{"$rows_left_out":249}
{"sheet":"Seite-1","index":5,"n_rows":43,"n_cols":16,"rows_kept":43,"cut":false,"hidden":false,"merged":[[2,12,2,15],[4,12,4,15],[5,12,5,15],[0,0,0,15],[2,0,2,3],[5,0,5,3],[4,0,4,3],[2,6,2,9],[4,6,4,9],[5,6,5,9]]}
["Schützenverein Soderstorf e.V.\nvon 1922"]
[]
["Luhepokal",null,null,null,null,null,"Kommandeurspokal",null,null,null,null,null,"Damenpokal"]
[]
["Bester Schütze/in:",null,null,null,null,null,"Bester Schütze/in:",null,null,null,null,null,"Beste Schützin:"]
[{"$f":"IF(D!I3=0,\"\",CONCATENATE(D!J3,\", \",D!I3,\", \",D!K3,\" \",\"Ringe\",\", \",\"Teiler\",\" \",D!L3))","v":", , 0 Ringe, Teiler "},null,null,null,null,null,{"$f":"IF(D!N3=0,\"\",CONCATENATE(D!O3,\", \",D!N3,\", \",D!P3,\" \",\"Ringe\",\", \",\"Teiler\",\" \",D!Q3))","v":", , 0 Ringe, Teiler "},null,null,null,null,null,{"$f":"IF(D!AA3=0,\"\",CONCATENATE(D!AB3,\", \",D!AA3,\", \",D!AC3,\" \",\"Ringe\",\", \",\"Teiler\",\" \",D!AD3))","v":", , 0 Ringe, Teiler "}]
{"$rows_left_out":38}
{"sheet":"Seite-2","index":6,"n_rows":26,"n_cols":14,"rows_kept":26,"cut":false,"hidden":false,"merged":[[25,0,31,13],[2,10,2,13],[4,10,4,13],[5,10,5,13],[0,0,0,13],[2,0,2,2],[5,0,5,2],[4,0,4,2],[2,5,2,7],[4,5,4,7],[5,5,5,7]]}
["Schützenverein Soderstorf e.V.\nvon 1922"]
[]
["Jugendpokal",null,null,null,null,"Schülerpokal",null,null,null,null,"Preisschießen"]
[]
["Bester Schütze/in:",null,null,null,null,"Bester Schütze/in:",null,null,null,null,"\"Top Fünfzehn\""]
[{"$f":"IF(D!AL3=0,\"\",CONCATENATE(D!AM3,\", \",D!AL3,\", \",D!AN3,\" \",\"Ringe\"))","v":", , 0 Ringe"},null,null,null,null,{"$f":"IF(D!AP3=0,\"\",CONCATENATE(D!AQ3,\", \",D!AP3,\", \",D!AR3,\" \",\"Ringe\"))","v":", , 0 Ringe"}]
{"$rows_left_out":21}
{"sheet":"Preisteiler gesamt","index":7,"n_rows":202,"n_cols":4,"rows_kept":202,"cut":false,"hidden":false,"merged":[[0,0,0,3]]}
["Preisteilerübersichtsliste gesamt"]
["Platz:","Verein:","Vor- und Nachname:","Teiler:"]
[{"$f":"IF(B3=\"\",\"\",1)","v":""},{"$f":"IF(D!S3=\"\",\"\",D!S3)","v":""},{"$f":"IF(D!T3=\"\",\"\",D!T3)","v":""},{"$f":"IF(D!U3=\"\",\"\",D!U3)","v":""}]
[{"$f":"IF(B4=\"\",\"\",A3+1)","v":""},{"$f":"IF(D!S4=\"\",\"\",D!S4)","v":""},{"$f":"IF(D!T4=\"\",\"\",D!T4)","v":""},{"$f":"IF(D!U4=\"\",\"\",D!U4)","v":""}]
[{"$f":"IF(B5=\"\",\"\",A4+1)","v":""},{"$f":"IF(D!S5=\"\",\"\",D!S5)","v":""},{"$f":"IF(D!T5=\"\",\"\",D!T5)","v":""},{"$f":"IF(D!U5=\"\",\"\",D!U5)","v":""}]
["",{"$f":"IF(D!S6=\"\",\"\",D!S6)","v":""},{"$f":"IF(D!T6=\"\",\"\",D!T6)","v":""},{"$f":"IF(D!U6=\"\",\"\",D!U6)","v":""}]
{"$rows_left_out":197}
{"sheet":"Ergebnisse Aushang","index":8,"n_rows":75,"n_cols":8,"rows_kept":75,"cut":false,"hidden":false,"merged":[[2,0,2,3],[2,4,2,7],[74,0,74,7],[46,0,46,3],[47,0,47,3],[45,0,45,7],[0,0,0,7],[61,4,61,7],[62,4,62,7],[60,4,60,7],[3,0,3,3],[3,4,3,7],[48,0,48,3],[46,4,46,7],[47,4,47,7],[48,4,48,7],[1,0,1,3],[1,4,1,7]]}
[{"$f":"CONCATENATE(\"Ergebnisse Pokalschießen\",\" \",HM!M2)","v":"Ergebnisse Pokalschießen 2018"}]
["Luhepokal",null,null,null,"Kommandeurspokal"]
["Bester Schütze/in:",null,null,null,"Bester Schütze/in:"]
[{"$f":"IF(D!I3=0,\"\",CONCATENATE(D!J3,\", \",D!I3,\", \",D!K3,\" \",\"Ringe\",\", \",\"Teiler\",\" \",D!L3))","v":", , 0 Ringe, Teiler "},null,null,null,{"$f":"IF(D!N3=0,\"\",CONCATENATE(D!O3,\", \",D!N3,\", \",D!P3,\" \",\"Ringe\",\", \",\"Teiler\",\" \",D!Q3))","v":", , 0 Ringe, Teiler "}]
["Platz:","Verein:","Ringe:","Teiler:","Platz:","Verein:","Ringe:","Teiler:"]
[{"$f":"IF(D!A3=\"\",\"\",1)","v":""},{"$f":"IF(D!A3=0,\"\",D!A3)","v":""},{"$f":"IF(D!B3=0,\"\",D!B3)","v":""},{"$f":"IF(D!C3=0,\"\",D!C3)","v":""},{"$f":"IF(D!E3=\"\",\"\",1)","v":""},{"$f":"IF(D!E3=0,\"\",D!E3)","v":""},{"$f":"IF(D!F3=0,\"\",D!F3)","v":""},{"$f":"IF(D!G3=0,\"\",D!G3)","v":""}]
{"$rows_left_out":70}
{"sheet":"D","index":9,"n_rows":252,"n_cols":44,"rows_kept":252,"cut":false,"hidden":false,"merged":[[0,0,0,2],[0,4,0,6],[0,8,0,11],[0,13,0,16],[0,34,0,35],[0,41,0,43],[0,18,0,20],[0,22,0,24],[0,26,0,29],[0,31,0,32],[0,37,0,39]]}
["Luhepokal",null,null,null,"Kommandeurspokal",null,null,null,"Luhe - Einzelwertung",null,null,null,null,"Komm - Einzelwertung",null,null,null,null,"Preisschiessen",null,null,null,"Damenpokal",null,null,null,"Damenpokal - Einzelwertung",null,null,null,null,"Jugendpokal",null,null,"Schülerpokal",null,null,"Jugendpokal - Einzelwertung",null,null,null,"Schülerpokal - Einzelwertung"]
["Verein","gesamt","Teiler",null,"Verein","gesamt","Teiler",null,"Verein","Name","Ringe","Teiler",null,"Verein","Name","Ringe","Teiler",null,"Verein:","Vor- und Nachname:","Teiler:",null,"Verein","Ringe","Teiler",null,"Verein","Name","Ringe","Teiler",null,"Verein","Ringe",null,"Verein","Ringe",null,"Verein","Name","Ringe",null,"Verein","Name","Ringe"]
["",0,0,1,"",0,0,1,"","",0,"",1,"","",0,"",1,"","","",1,"",0,0,1,"","",0,"",1,"",0,null,"",0,null,"","",0,null,"","",0]
["",0,0,2,"",0,0,2,"","",0,"",2,"","",0,"",2,"","","",2,"",0,0,2,"","",0,"",2,"",0,null,"",0,null,"","",0,null,"","",0]
["",0,0,3,"",0,0,3,"","",0,"",3,"","",0,"",3,"","","",3,"",0,0,3,"","",0,"",3,"",0,null,"",0,null,"","",0,null,"","",0]
["",0,0,4,"",0,0,4,"","",0,"",4,"","",0,"",4,"","","",4,"",0,0,4,"","",0,"",4,"",0,null,"",0,null,"","",0,null,"","",0]
{"$rows_left_out":247}
{"sheet":"Sammler","index":10,"n_rows":252,"n_cols":44,"rows_kept":252,"cut":false,"hidden":false,"merged":[[0,41,0,43],[0,31,0,32],[0,34,0,35],[0,22,0,24],[0,37,0,39],[0,26,0,29],[0,18,0,20],[0,4,0,6],[0,0,0,2],[0,8,0,11],[0,13,0,16]]}
["Luhepokal",null,null,null,"Kommandeurspokal",null,null,null,"Luhe - Einzelwertung",null,null,null,null,"Komm - Einzelwertung",null,null,null,null,"Preisschiessen",null,null,null,"Damenpokal",null,null,null,"Damenpokal - Einzelwertung",null,null,null,null,"Jugendpokal",null,null,"Schülerpokal",null,null,"Jugendpokal - Einzelwertung",null,null,null,"Schülerpokal - Einzelwertung"]
["Verein","gesamt","Teiler",null,"Verein","gesamt","Teiler",null,"Verein","Name","Ringe","Teiler",null,"Verein","Name","Ringe","Teiler",null,"Verein:","Vor- und Nachname:","Teiler:",null,"Verein","Ringe","Teiler",null,"Verein","Name","Ringe","Teiler",null,"Verein","Ringe",null,"Verein","Ringe",null,"Verein","Name","Ringe",null,"Verein","Name","Ringe"]
[{"$f":"'PK-Luhe-Komm'!B3","v":""},{"$f":"'PK-Luhe-Komm'!D7","v":0},{"$f":"'PK-Luhe-Komm'!E7","v":0},1,{"$f":"'PK-Luhe-Komm'!H3","v":""},{"$f":"'PK-Luhe-Komm'!J7","v":0},{"$f":"'PK-Luhe-Komm'!K7","v":0},1,{"$f":"'PK-Luhe-Komm'!$B$3","v":""},{"$f":"'PK-Luhe-Komm'!C3","v":""},{"$f":"'PK-Luhe-Komm'!D3","v":0},{"$f":"IF('PK-Luhe-Komm'!E3=\"\",\"\",'PK-Luhe-Komm'!E3)","v":""},1,{"$f":"'PK-Luhe-Komm'!$H$3","v":""},{"$f":"'PK-Luhe-Komm'!I3","v":""},{"$f":"'PK-Luhe-Komm'!J3","v":0},{"$f":"IF('PK-Luhe-Komm'!K3=\"\",\"\",'PK-Luhe-Komm'!K3)","v":""},1,{"$f":"PS!C5","v":""},{"$f":"PS!D5","v":""},{"$f":"IF(PS!E5=\"\",\"\",PS!E5)","v":""},1,{"$f":"'PK-Damen'!B3","v":""},{"$f":"'PK-Damen'!D6","v":0},{"$f":"'PK-Damen'!E6","v":0},1,{"$f":"'PK-Damen'!$B$3","v":""},{"$f":"'PK-Damen'!C3","v":""},{"$f":"'PK-Damen'!D3","v":0},{"$f":"IF('PK-Damen'!E3=\"\",\"\",'PK-Damen'!E3)","v":""},1,{"$f":"'PK-Jugend-Schüler'!B3","v":""},{"$f":"'PK-Jugend-Schüler'!D6","v":0},null,{"$f":"'PK-Jugend-Schüler'!G3","v":""},{"$f":"'PK-Jugend-Schüler'!I6","v":0},null,{"$f":"'PK-Jugend-Schüler'!$B$3","v":""},{"$f":"'PK-Jugend-Schüler'!C3","v":""},{"$f":"'PK-Jugend-Schüler'!D3","v":0},null,{"$f":"'PK-Jugend-Schüler'!$G$3","v":""},{"$f":"'PK-Jugend-Schüler'!H3","v":""},{"$f":"'PK-Jugend-Schüler'!I3","v":0}]
[{"$f":"'PK-Luhe-Komm'!B10","v":""},{"$f":"'PK-Luhe-Komm'!D14","v":0},{"$f":"'PK-Luhe-Komm'!E14","v":0},2,{"$f":"'PK-Luhe-Komm'!H10","v":""},{"$f":"'PK-Luhe-Komm'!J14","v":0},{"$f":"'PK-Luhe-Komm'!K14","v":0},2,{"$f":"'PK-Luhe-Komm'!$B$3","v":""},{"$f":"'PK-Luhe-Komm'!C4","v":""},{"$f":"'PK-Luhe-Komm'!D4","v":0},{"$f":"IF('PK-Luhe-Komm'!E4=\"\",\"\",'PK-Luhe-Komm'!E4)","v":""},2,{"$f":"'PK-Luhe-Komm'!$H$3","v":""},{"$f":"'PK-Luhe-Komm'!I4","v":""},{"$f":"'PK-Luhe-Komm'!J4","v":0},{"$f":"IF('PK-Luhe-Komm'!K4=\"\",\"\",'PK-Luhe-Komm'!K4)","v":""},2,{"$f":"PS!C6","v":""},{"$f":"PS!D6","v":""},{"$f":"IF(PS!E6=\"\",\"\",PS!E6)","v":""},2,{"$f":"'PK-Damen'!B9","v":""},{"$f":"'PK-Damen'!D12","v":0},{"$f":"'PK-Damen'!E12","v":0},2,{"$f":"'PK-Damen'!$B$3","v":""},{"$f":"'PK-Damen'!C4","v":""},{"$f":"'PK-Damen'!D4","v":0},{"$f":"IF('PK-Damen'!E4=\"\",\"\",'PK-Damen'!E4)","v":""},2,{"$f":"'PK-Jugend-Schüler'!B9","v":""},{"$f":"'PK-Jugend-Schüler'!D12","v":0},null,{"$f":"'PK-Jugend-Schüler'!G9","v":""},{"$f":"'PK-Jugend-Schüler'!I12","v":0},null,{"$f":"'PK-Jugend-Schüler'!$B$3","v":""},{"$f":"'PK-Jugend-Schüler'!C4","v":""},{"$f":"'PK-Jugend-Schüler'!D4","v":0},null,{"$f":"'PK-Jugend-Schüler'!$G$3","v":""},{"$f":"'PK-Jugend-Schüler'!H4","v":""},{"$f":"'PK-Jugend-Schüler'!I4","v":0}]
[{"$f":"'PK-Luhe-Komm'!B17","v":""},{"$f":"'PK-Luhe-Komm'!D21","v":0},{"$f":"'PK-Luhe-Komm'!E21","v":0},3,{"$f":"'PK-Luhe-Komm'!H17","v":""},{"$f":"'PK-Luhe-Komm'!J21","v":0},{"$f":"'PK-Luhe-Komm'!K21","v":0},3,{"$f":"'PK-Luhe-Komm'!$B$3","v":""},{"$f":"'PK-Luhe-Komm'!C5","v":""},{"$f":"'PK-Luhe-Komm'!D5","v":0},{"$f":"IF('PK-Luhe-Komm'!E5=\"\",\"\",'PK-Luhe-Komm'!E5)","v":""},3,{"$f":"'PK-Luhe-Komm'!$H$3","v":""},{"$f":"'PK-Luhe-Komm'!I5","v":""},{"$f":"'PK-Luhe-Komm'!J5","v":0},{"$f":"IF('PK-Luhe-Komm'!K5=\"\",\"\",'PK-Luhe-Komm'!K5)","v":""},3,{"$f":"PS!C7","v":""},{"$f":"PS!D7","v":""},{"$f":"IF(PS!E7=\"\",\"\",PS!E7)","v":""},3,{"$f":"'PK-Damen'!B15","v":""},{"$f":"'PK-Damen'!D18","v":0},{"$f":"'PK-Damen'!E18","v":0},3,{"$f":"'PK-Damen'!$B$3","v":""},{"$f":"'PK-Damen'!C5","v":""},{"$f":"'PK-Damen'!D5","v":0},{"$f":"IF('PK-Damen'!E5=\"\",\"\",'PK-Damen'!E5)","v":""},3,{"$f":"'PK-Jugend-Schüler'!B15","v":""},{"$f":"'PK-Jugend-Schüler'!D18","v":0},null,{"$f":"'PK-Jugend-Schüler'!G15","v":""},{"$f":"'PK-Jugend-Schüler'!I18","v":0},null,{"$f":"'PK-Jugend-Schüler'!$B$3","v":""},{"$f":"'PK-Jugend-Schüler'!C5","v":""},{"$f":"'PK-Jugend-Schüler'!D5","v":0},null,{"$f":"'PK-Jugend-Schüler'!$G$3","v":""},{"$f":"'PK-Jugend-Schüler'!H5","v":""},{"$f":"'PK-Jugend-Schüler'!I5","v":0}]
[{"$f":"'PK-Luhe-Komm'!B24","v":""},{"$f":"'PK-Luhe-Komm'!D28","v":0},{"$f":"'PK-Luhe-Komm'!E28","v":0},4,{"$f":"'PK-Luhe-Komm'!H24","v":""},{"$f":"'PK-Luhe-Komm'!J28","v":0},{"$f":"'PK-Luhe-Komm'!K28","v":0},4,{"$f":"'PK-Luhe-Komm'!$B$3","v":""},{"$f":"'PK-Luhe-Komm'!C6","v":""},{"$f":"'PK-Luhe-Komm'!D6","v":0},{"$f":"IF('PK-Luhe-Komm'!E6=\"\",\"\",'PK-Luhe-Komm'!E6)","v":""},4,{"$f":"'PK-Luhe-Komm'!$H$3","v":""},{"$f":"'PK-Luhe-Komm'!I6","v":""},{"$f":"'PK-Luhe-Komm'!J6","v":0},{"$f":"IF('PK-Luhe-Komm'!K6=\"\",\"\",'PK-Luhe-Komm'!K6)","v":""},4,{"$f":"PS!C8","v":""},{"$f":"PS!D8","v":""},{"$f":"IF(PS!E8=\"\",\"\",PS!E8)","v":""},4,{"$f":"'PK-Damen'!B21","v":""},{"$f":"'PK-Damen'!D24","v":0},{"$f":"'PK-Damen'!E24","v":0},4,{"$f":"'PK-Damen'!$B$9","v":""},{"$f":"'PK-Damen'!C9","v":""},{"$f":"'PK-Damen'!D9","v":0},{"$f":"IF('PK-Damen'!E9=\"\",\"\",'PK-Damen'!E9)","v":""},4,{"$f":"'PK-Jugend-Schüler'!B21","v":""},{"$f":"'PK-Jugend-Schüler'!D24","v":0},null,{"$f":"'PK-Jugend-Schüler'!G21","v":""},{"$f":"'PK-Jugend-Schüler'!I24","v":0},null,{"$f":"'PK-Jugend-Schüler'!$B$9","v":""},{"$f":"'PK-Jugend-Schüler'!C9","v":""},{"$f":"'PK-Jugend-Schüler'!D9","v":0},null,{"$f":"'PK-Jugend-Schüler'!$G$9","v":""},{"$f":"'PK-Jugend-Schüler'!H9","v":""},{"$f":"'PK-Jugend-Schüler'!I9","v":0}]
{"$rows_left_out":247}
{"sheet":"Quittung","index":11,"n_rows":22,"n_cols":16,"rows_kept":22,"cut":false,"hidden":false,"merged":[[3,11,4,12],[1,2,1,4],[2,0,2,4],[0,4,0,7],[7,10,7,12],[6,10,6,12],[8,10,8,12],[11,8,11,9],[8,13,8,14],[20,0,20,2],[8,0,8,7],[11,0,11,7],[14,0,14,7],[9,6,9,7],[20,4,20,6],[17,3,17,6],[14,8,14,9],[17,8,17,9],[9,10,9,12],[9,13,11,15]]}
[null,null,null,null,"Quittung"]
[null,null,"Schützenverein \nSoderstorf e.V.",null,null,null,null,null,null,null,null," X = Ja"]
["Internet: www.schuetzenverein.soderstorf.de ",null,null,null,null,"Netto:",55,"EUR",null,null,"mit MwSt. ?"]
[null,null,null,null,null,null,null,null,null,null,null,"sonst \"x\" entfernen!"]
[null,null,null,null,null,19,{"$f":"IF(L3=\"x\",G3*19/100,\"\")","v":""},"EUR"]
[]
{"$rows_left_out":17}
{"sheet":"Preisaufteilung","index":12,"n_rows":39,"n_cols":12,"rows_kept":39,"cut":false,"hidden":false,"merged":[[16,3,16,5],[0,0,0,11],[2,0,2,1],[2,2,2,3],[2,4,2,5],[2,6,2,7],[2,8,2,9],[2,10,2,11],[28,2,28,3],[36,2,36,3],[37,2,37,3],[38,2,38,3],[30,2,30,3],[31,2,31,3],[32,2,32,3],[33,2,33,3],[35,2,35,3],[34,2,34,3]]}
["Pokalschießen Preisgeldaufteilung"]
[]
["Preisgeld",null,"Luhepokal",null,"Kommandeurspokal",null,"Damenpokal",null,"Jugendpokal",null,"Schülerpokal"]
[]
[]
["Platz  1",200,"Platz  1",30,"Platz  1",30,"Platz  1",30,"Platz  1",15,"Platz  1",15]
{"$rows_left_out":34}
{"sheet":"Etikettenvorlage","index":13,"n_rows":40,"n_cols":9,"rows_kept":40,"cut":false,"hidden":false,"merged":[]}
["Art des Schießens","Platz","Vor-/ Nachname","Verein","Text","Teiler"]
["Preisschießen KK in Soderstorf","1. Platz",{"$f":"D!T3","v":""},{"$f":"D!S3","v":""},"Teiler",{"$f":"D!U3","v":""}]
["Preisschießen KK in Soderstorf","2. Platz",{"$f":"D!T4","v":""},{"$f":"D!S4","v":""},"Teiler",{"$f":"D!U4","v":""}]
["Preisschießen KK in Soderstorf","3. Platz",{"$f":"D!T5","v":""},{"$f":"D!S5","v":""},"Teiler",{"$f":"D!U5","v":""}]
["Preisschießen KK in Soderstorf","4. Platz",{"$f":"D!T6","v":""},{"$f":"D!S6","v":""},"Teiler",{"$f":"D!U6","v":""}]
["Preisschießen KK in Soderstorf","5. Platz",{"$f":"D!T7","v":""},{"$f":"D!S7","v":""},"Teiler",{"$f":"D!U7","v":""}]
{"$rows_left_out":35}
{"sheet":"EMAIL","index":14,"n_rows":63,"n_cols":3,"rows_kept":63,"cut":false,"hidden":false,"merged":[[0,0,0,2]]}
["E-Mail Adressen der Fremdvereine\n(zusätzlich für Ergebnisbenachrichtigung)"]
[]
["lfd. Nr.:","E-Mail Adresse:","Verein:"]
[1]
[2]
[3]
{"$rows_left_out":58}
{"sheet":"Mannschaft Übersicht","index":15,"n_rows":20,"n_cols":11,"rows_kept":20,"cut":false,"hidden":false,"merged":[[14,1,14,7],[14,9,14,10],[16,7,19,7],[0,1,0,7],[0,9,0,10],[2,7,6,7],[7,1,7,7],[7,9,7,10],[9,7,13,7]]}
[null,"Luhepokal (Mannschaft)",null,null,null,null,null,null,null,"Preisschießen:"]
[null,"Nr:","Verein:","Name:","Ringe:","Teiler:","E. Platz:","Msch. Platz:",null,"Teiler:","jetziger Platz:"]
[null,null,{"$f":"IF(B3=\"\",\"\",IF(VLOOKUP(B3,HM!$A$5:$B$254,2,0)=0,\"\",VLOOKUP(B3,HM!$A$5:$B$254,2,0)))","v":""},{"$f":"IF(B3=\"\",\"\",IF(VLOOKUP(B3,HM!$A$5:$C$254,3,0)=0,\"Nr. nicht gepflegt\",VLOOKUP(B3,HM!$A$5:$C$254,3,0)))","v":""},{"$f":"IF(B3=\"\",\"\",IF(ISERROR(VLOOKUP(D3,D!$J$3:$K$162,2,0)),\"-\",VLOOKUP(D3,D!$J$3:$K$162,2,0)))","v":""},{"$f":"IF(B3=\"\",\"\",IF(ISERROR(VLOOKUP(D3,D!$J$3:$L$162,3,0)),\"-\",VLOOKUP(D3,D!$J$3:$L$162,3,0)))","v":""},{"$f":"IF(B3=\"\",\"\",IF(ISERROR(VLOOKUP(D3,D!$J$3:$M$162,4,0)),\"-\",VLOOKUP(D3,D!$J$3:$M$162,4,0)))","v":""},{"$f":"IF(B3=\"\",\"\",IF(D3=\"Nr. nicht gepflegt\",\"\",IF(E3=\"-\",\"\",VLOOKUP(C3,D!$A$3:$D$42,4,0))))","v":""},null,{"$f":"IF(B3=\"\",\"\",IF(ISNA(VLOOKUP(D3,D!$T$3:$U$252,2,0)),\"-\",VLOOKUP(D3,D!$T$3:$U$252,2,0)))","v":""},{"$f":"IF(B3=\"\",\"\",IF(ISNA(VLOOKUP(D3,D!$T$3:$V$252,3,0)),\"-\",VLOOKUP(D3,D!$T$3:$V$252,3,0)))","v":""}]
[null,null,{"$f":"IF(B4=\"\",\"\",IF(VLOOKUP(B4,HM!$A$5:$B$254,2,0)=0,\"\",VLOOKUP(B4,HM!$A$5:$B$254,2,0)))","v":""},{"$f":"IF(B4=\"\",\"\",IF(VLOOKUP(B4,HM!$A$5:$C$254,3,0)=0,\"Nr. nicht gepflegt\",VLOOKUP(B4,HM!$A$5:$C$254,3,0)))","v":""},{"$f":"IF(B4=\"\",\"\",IF(ISERROR(VLOOKUP(D4,D!$J$3:$K$162,2,0)),\"-\",VLOOKUP(D4,D!$J$3:$K$162,2,0)))","v":""},{"$f":"IF(B4=\"\",\"\",IF(ISERROR(VLOOKUP(D4,D!$J$3:$L$162,3,0)),\"-\",VLOOKUP(D4,D!$J$3:$L$162,3,0)))","v":""},{"$f":"IF(B4=\"\",\"\",IF(ISERROR(VLOOKUP(D4,D!$J$3:$M$162,4,0)),\"-\",VLOOKUP(D4,D!$J$3:$M$162,4,0)))","v":""},null,null,{"$f":"IF(B4=\"\",\"\",IF(ISNA(VLOOKUP(D4,D!$T$3:$U$252,2,0)),\"-\",VLOOKUP(D4,D!$T$3:$U$252,2,0)))","v":""},{"$f":"IF(B4=\"\",\"\",IF(ISNA(VLOOKUP(D4,D!$T$3:$V$252,3,0)),\"-\",VLOOKUP(D4,D!$T$3:$V$252,3,0)))","v":""}]
[null,null,{"$f":"IF(B5=\"\",\"\",IF(VLOOKUP(B5,HM!$A$5:$B$254,2,0)=0,\"\",VLOOKUP(B5,HM!$A$5:$B$254,2,0)))","v":""},{"$f":"IF(B5=\"\",\"\",IF(VLOOKUP(B5,HM!$A$5:$C$254,3,0)=0,\"Nr. nicht gepflegt\",VLOOKUP(B5,HM!$A$5:$C$254,3,0)))","v":""},{"$f":"IF(B5=\"\",\"\",IF(ISERROR(VLOOKUP(D5,D!$J$3:$K$162,2,0)),\"-\",VLOOKUP(D5,D!$J$3:$K$162,2,0)))","v":""},{"$f":"IF(B5=\"\",\"\",IF(ISERROR(VLOOKUP(D5,D!$J$3:$L$162,3,0)),\"-\",VLOOKUP(D5,D!$J$3:$L$162,3,0)))","v":""},{"$f":"IF(B5=\"\",\"\",IF(ISERROR(VLOOKUP(D5,D!$J$3:$M$162,4,0)),\"-\",VLOOKUP(D5,D!$J$3:$M$162,4,0)))","v":""},null,null,{"$f":"IF(B5=\"\",\"\",IF(ISNA(VLOOKUP(D5,D!$T$3:$U$252,2,0)),\"-\",VLOOKUP(D5,D!$T$3:$U$252,2,0)))","v":""},{"$f":"IF(B5=\"\",\"\",IF(ISNA(VLOOKUP(D5,D!$T$3:$V$252,3,0)),\"-\",VLOOKUP(D5,D!$T$3:$V$252,3,0)))","v":""}]
[null,null,{"$f":"IF(B6=\"\",\"\",IF(VLOOKUP(B6,HM!$A$5:$B$254,2,0)=0,\"\",VLOOKUP(B6,HM!$A$5:$B$254,2,0)))","v":""},{"$f":"IF(B6=\"\",\"\",IF(VLOOKUP(B6,HM!$A$5:$C$254,3,0)=0,\"Nr. nicht gepflegt\",VLOOKUP(B6,HM!$A$5:$C$254,3,0)))","v":""},{"$f":"IF(B6=\"\",\"\",IF(ISERROR(VLOOKUP(D6,D!$J$3:$K$162,2,0)),\"-\",VLOOKUP(D6,D!$J$3:$K$162,2,0)))","v":""},{"$f":"IF(B6=\"\",\"\",IF(ISERROR(VLOOKUP(D6,D!$J$3:$L$162,3,0)),\"-\",VLOOKUP(D6,D!$J$3:$L$162,3,0)))","v":""},{"$f":"IF(B6=\"\",\"\",IF(ISERROR(VLOOKUP(D6,D!$J$3:$M$162,4,0)),\"-\",VLOOKUP(D6,D!$J$3:$M$162,4,0)))","v":""},null,null,{"$f":"IF(B6=\"\",\"\",IF(ISNA(VLOOKUP(D6,D!$T$3:$U$252,2,0)),\"-\",VLOOKUP(D6,D!$T$3:$U$252,2,0)))","v":""},{"$f":"IF(B6=\"\",\"\",IF(ISNA(VLOOKUP(D6,D!$T$3:$V$252,3,0)),\"-\",VLOOKUP(D6,D!$T$3:$V$252,3,0)))","v":""}]
{"$rows_left_out":14}