{"text_format":"1","workbook":"xlsx","n_sheets":13,"sheets":["HM","PS","OS","SE","BSP","VS","Ergebnisse","Schnüre","Presse","Sammler","D","Kasse","Info"],"not_rendered":{"charts":0,"images":29,"macros":1,"external_links":0,"defined_names":9,"comments":0,"pivot_tables":0},"unopened":[],"bounds":{"document_bytes":16777216,"sheet_cells":100000,"rows_first":2000,"rows_last":500,"rows_between":2000,"halvings":0,"cell_chars":16384,"cell_head_chars":4096},"cells_cut":0,"cells_raw":0,"read":"whole","date_system":"1900"}

{"sheet":"HM","index":0,"n_rows":249,"n_cols":24,"rows_kept":249,"cut":false,"hidden":false,"merged":[[247,3,247,4],[248,3,248,4],[243,3,243,4],[244,3,244,4],[245,3,245,4],[246,3,246,4],[238,3,238,4],[239,3,239,4],[238,8,238,12],[239,8,239,12],[245,5,245,7],[246,5,246,7],[247,5,247,7],[248,5,248,7],[243,5,243,7],[244,5,244,7],[238,5,238,7],[239,5,239,7],[0,0,0,1],[4,3,6,13],[242,3,242,4],[240,3,240,4],[235,3,235,4],[212,5,212,6],[213,5,213,6],[214,5,214,6],[215,3,215,6],[236,3,236,4],[237,3,237,4],[241,3,241,4],[211,4,211,5],[212,3,212,4],[213,3,213,4],[214,3,214,4],[233,1,233,3],[234,5,234,7],[240,5,240,7],[241,5,241,7],[242,5,242,7],[235,5,235,7],[236,5,236,7],[237,5,237,7],[14,18,14,22],[15,18,15,22],[16,18,16,22],[17,18,17,22],[18,18,18,22],[9,18,9,22],[10,18,10,22],[11,18,11,22],[12,18,12,22],[13,18,13,22],[24,18,24,22],[25,18,25,22],[26,18,26,22],[27,18,27,22],[28,18,28,22],[19,18,19,22],[20,18,20,22],[21,18,21,22],[22,18,22,22],[23,18,23,22],[34,18,34,22],[35,18,35,22],[36,18,36,22],[37,18,37,22],[38,18,38,22],[29,18,29,22],[30,18,30,22],[31,18,31,22],[32,18,32,22],[33,18,33,22],[44,18,44,22],[45,18,45,22],[46,18,46,22],[47,18,47,22],[48,18,48,22],[39,18,39,22],[40,18,40,22],[41,18,41,22],[42,18,42,22],[43,18,43,22],[54,18,54,22],[55,18,55,22],[56,18,56,22],[57,18,57,22],[58,18,58,22],[49,18,49,22],[50,18,50,22],[51,18,51,22],[52,18,52,22],[53,18,53,22],[64,18,64,22],[65,18,65,22],[66,18,66,22],[67,18,67,22],[68,18,68,22],[59,18,59,22],[60,18,60,22],[61,18,61,22],[62,18,62,22],[63,18,63,22],[74,18,74,22],[75,18,75,22],[76,18,76,22],[77,18,77,22],[78,18,78,22],[69,18,69,22],[70,18,70,22],[71,18,71,22],[72,18,72,22],[73,18,73,22],[84,18,84,22],[85,18,85,22],[86,18,86,22],[87,18,87,22],[88,18,88,22],[79,18,79,22],[80,18,80,22],[81,18,81,22],[82,18,82,22],[83,18,83,22],[94,18,94,22],[95,18,95,22],[96,18,96,22],[97,18,97,22],[98,18,98,22],[89,18,89,22],[90,18,90,22],[91,18,91,22],[92,18,92,22],[93,18,93,22],[104,18,104,22],[105,18,105,22],[106,18,106,22],[107,18,107,22],[108,18,108,22],[99,18,99,22],[100,18,100,22],[101,18,101,22],[102,18,102,22],[103,18,103,22],[114,18,114,22],[115,18,115,22],[116,18,116,22],[117,18,117,22],[118,18,118,22],[109,18,109,22],[110,18,110,22],[111,18,111,22],[112,18,112,22],[113,18,113,22],[124,18,124,22],[125,18,125,22],[126,18,126,22],[127,18,127,22],[128,18,128,22],[119,18,119,22],[120,18,120,22],[121,18,121,22],[122,18,122,22],[123,18,123,22],[134,18,134,22],[135,18,135,22],[136,18,136,22],[137,18,137,22],[138,18,138,22],[129,18,129,22],[130,18,130,22],[131,18,131,22],[132,18,132,22],[133,18,133,22],[144,18,144,22],[145,18,145,22],[146,18,146,22],[147,18,147,22],[148,18,148,22],[139,18,139,22],[140,18,140,22],[141,18,141,22],[142,18,142,22],[143,18,143,22],[154,18,154,22],[155,18,155,22],[156,18,156,22],[157,18,157,22],[158,18,158,22],[149,18,149,22],[150,18,150,22],[151,18,151,22],[152,18,152,22],[153,18,153,22],[164,18,164,22],[165,18,165,22],[166,18,166,22],[167,18,167,22],[168,18,168,22],[159,18,159,22],[160,18,160,22],[161,18,161,22],[162,18,162,22],[163,18,163,22],[174,18,174,22],[175,18,175,22],[176,18,176,22],[177,18,177,22],[178,18,178,22],[169,18,169,22],[170,18,170,22],[171,18,171,22],[172,18,172,22],[173,18,173,22],[184,18,184,22],[185,18,185,22],[186,18,186,22],[187,18,187,22],[188,18,188,22],[179,18,179,22],[180,18,180,22],[181,18,181,22],[182,18,182,22],[183,18,183,22],[194,18,194,22],[195,18,195,22],[196,18,196,22],[197,18,197,22],[198,18,198,22],[189,18,189,22],[190,18,190,22],[191,18,191,22],[192,18,192,22],[193,18,193,22],[204,18,204,22],[205,18,205,22],[206,18,206,22],[207,18,207,22],[208,18,208,22],[199,18,199,22],[200,18,200,22],[201,18,201,22],[202,18,202,22],[203,18,203,22]]}
["© 2010 - Rolf Marquardt"]
[]
[]
[]
[null,null,null,{"$f":"CONCATENATE(\"Schützenfest\",\" \",TEXT(TODAY(),\"JJJJ\"))","v":"Schützenfest 2018"}]
[]
[]
[]
{"$rows_left_out":242}
{"sheet":"PS","index":1,"n_rows":204,"n_cols":8,"rows_kept":204,"cut":false,"hidden":false,"merged":[[2,1,2,3],[2,5,2,7]]}
[]
[]
[null,"KK",null,null,null,"LG"]
[null,"Lfd. Nr.:","Vor- und Nachname:","Teiler:",null,"Lfd. Nr.:","Vor- und Nachname:","Teiler:"]
[null,null,{"$f":"IF(B5=\"\",\"\",VLOOKUP(B5,HM!$A$10:$B$209,2))","v":""},null,1,null,{"$f":"IF(F5=\"\",\"\",VLOOKUP(F5,HM!$A$10:$B$209,2))","v":""}]
[null,null,{"$f":"IF(B6=\"\",\"\",VLOOKUP(B6,HM!$A$10:$B$209,2))","v":""},null,2,null,{"$f":"IF(F6=\"\",\"\",VLOOKUP(F6,HM!$A$10:$B$209,2))","v":""}]
[null,null,{"$f":"IF(B7=\"\",\"\",VLOOKUP(B7,HM!$A$10:$B$209,2))","v":""},null,3,null,{"$f":"IF(F7=\"\",\"\",VLOOKUP(F7,HM!$A$10:$B$209,2))","v":""}]
[null,null,{"$f":"IF(B8=\"\",\"\",VLOOKUP(B8,HM!$A$10:$B$209,2))","v":""},null,4,null,{"$f":"IF(F8=\"\",\"\",VLOOKUP(F8,HM!$A$10:$B$209,2))","v":""}]
{"$rows_left_out":197}
{"sheet":"OS","index":2,"n_rows":204,"n_cols":8,"rows_kept":204,"cut":false,"hidden":false,"merged":[[2,1,2,3],[2,5,2,7]]}
[]
[]
[null,"Orden KK",null,null,null,"Orden LG"]
[null,"Lfd. Nr.:","Vor- und Nachname:","Teiler:",null,"Lfd. Nr.:","Vor- und Nachname:","Teiler:"]
[null,null,{"$f":"IF(B5=\"\",\"\",VLOOKUP(B5,HM!$A$10:$B$209,2))","v":""},null,1,null,{"$f":"IF(F5=\"\",\"\",VLOOKUP(F5,HM!$A$10:$B$209,2))","v":""}]
[null,null,{"$f":"IF(B6=\"\",\"\",VLOOKUP(B6,HM!$A$10:$B$209,2))","v":""},null,2,null,{"$f":"IF(F6=\"\",\"\",VLOOKUP(F6,HM!$A$10:$B$209,2))","v":""}]
[null,null,{"$f":"IF(B7=\"\",\"\",VLOOKUP(B7,HM!$A$10:$B$209,2))","v":""},null,3,null,{"$f":"IF(F7=\"\",\"\",VLOOKUP(F7,HM!$A$10:$B$209,2))","v":""}]
[null,null,{"$f":"IF(B8=\"\",\"\",VLOOKUP(B8,HM!$A$10:$B$209,2))","v":""},null,4,null,{"$f":"IF(F8=\"\",\"\",VLOOKUP(F8,HM!$A$10:$B$209,2))","v":""}]
{"$rows_left_out":197}
{"sheet":"SE","index":3,"n_rows":204,"n_cols":10,"rows_kept":204,"cut":false,"hidden":false,"merged":[[2,1,2,4],[2,6,2,9]]}
[]
[]
[null,"KK",null,null,null,null,"LG"]
[null,"Lfd.\nNr.:","Vor- und Nachname:","Ringe:","schlechtester\nEinzelschuss",null,"Lfd.\nNr.:","Vor- und Nachname:","Ringe:","schlechtester\nEinzelschuss"]
[null,null,{"$f":"IF(B5=\"\",\"\",VLOOKUP(B5,HM!$A$10:$B$209,2))","v":""},null,null,1,null,{"$f":"IF(G5=\"\",\"\",VLOOKUP(G5,HM!$A$10:$B$209,2))","v":""}]
[null,null,{"$f":"IF(B6=\"\",\"\",VLOOKUP(B6,HM!$A$10:$B$209,2))","v":""},null,null,2,null,{"$f":"IF(G6=\"\",\"\",VLOOKUP(G6,HM!$A$10:$B$209,2))","v":""}]
[null,null,{"$f":"IF(B7=\"\",\"\",VLOOKUP(B7,HM!$A$10:$B$209,2))","v":""},null,null,3,null,{"$f":"IF(G7=\"\",\"\",VLOOKUP(G7,HM!$A$10:$B$209,2))","v":""}]
[null,null,{"$f":"IF(B8=\"\",\"\",VLOOKUP(B8,HM!$A$10:$B$209,2))","v":""},null,null,4,null,{"$f":"IF(G8=\"\",\"\",VLOOKUP(G8,HM!$A$10:$B$209,2))","v":""}]
{"$rows_left_out":197}
{"sheet":"BSP","index":4,"n_rows":204,"n_cols":8,"rows_kept":204,"cut":false,"hidden":false,"merged":[[2,1,2,3],[2,5,2,7]]}
[]
[]
[null,"Bundesorden",null,null,null,"Sollepokal"]
[null,"Lfd. Nr.:","Vor- und Nachname:","Teiler:",null,"Lfd. Nr.:","Vor- und Nachname:","Teiler"]
[null,null,{"$f":"IF(B5=\"\",\"\",VLOOKUP(B5,HM!$A$10:$B$209,2))","v":""},null,1,null,{"$f":"IF(F5=\"\",\"\",VLOOKUP(F5,HM!$A$10:$B$209,2))","v":""}]
[null,null,{"$f":"IF(B6=\"\",\"\",VLOOKUP(B6,HM!$A$10:$B$209,2))","v":""},null,2,null,{"$f":"IF(F6=\"\",\"\",VLOOKUP(F6,HM!$A$10:$B$209,2))","v":""}]
[null,null,{"$f":"IF(B7=\"\",\"\",VLOOKUP(B7,HM!$A$10:$B$209,2))","v":""},null,3,null,{"$f":"IF(F7=\"\",\"\",VLOOKUP(F7,HM!$A$10:$B$209,2))","v":""}]
[null,null,{"$f":"IF(B8=\"\",\"\",VLOOKUP(B8,HM!$A$10:$B$209,2))","v":""},null,4,null,{"$f":"IF(F8=\"\",\"\",VLOOKUP(F8,HM!$A$10:$B$209,2))","v":""}]
{"$rows_left_out":197}
{"sheet":"VS","index":5,"n_rows":204,"n_cols":8,"rows_kept":204,"cut":false,"hidden":false,"merged":[[2,1,2,3],[2,5,2,7]]}
[]
[]
[null,"Volksbankorden",null,null,null,"Schinkenschießen"]
[null,"Lfd. Nr.:","Vor- und Nachname:","Teiler:",null,"Lfd. Nr.:","Vor- und Nachname:","Teiler"]
[null,null,{"$f":"IF(B5=\"\",\"\",VLOOKUP(B5,HM!$A$10:$B$209,2))","v":""},null,1,null,{"$f":"IF(F5=\"\",\"\",VLOOKUP(F5,HM!$A$10:$B$209,2))","v":""}]
[null,null,{"$f":"IF(B6=\"\",\"\",VLOOKUP(B6,HM!$A$10:$B$209,2))","v":""},null,2,null,{"$f":"IF(F6=\"\",\"\",VLOOKUP(F6,HM!$A$10:$B$209,2))","v":""}]
[null,null,{"$f":"IF(B7=\"\",\"\",VLOOKUP(B7,HM!$A$10:$B$209,2))","v":""},null,3,null,{"$f":"IF(F7=\"\",\"\",VLOOKUP(F7,HM!$A$10:$B$209,2))","v":""}]
[null,null,{"$f":"IF(B8=\"\",\"\",VLOOKUP(B8,HM!$A$10:$B$209,2))","v":""},null,4,null,{"$f":"IF(F8=\"\",\"\",VLOOKUP(F8,HM!$A$10:$B$209,2))","v":""}]
{"$rows_left_out":197}
{"sheet":"Ergebnisse","index":6,"n_rows":36,"n_cols":8,"rows_kept":36,"cut":false,"hidden":false,"merged":[[27,0,28,1],[0,0,0,5],[1,3,1,5],[18,3,19,5],[15,0,18,0],[19,0,22,0]]}
[{"$f":"HM!D5","v":"Schützenfest 2018"}]
[{"$f":"TODAY()","v":"2018-10-23"},null,null,"Preisschießen - KK"]
[null,"Name:",null,"Platz","Name:","Teiler:"]
["König :",null,null,1,{"$f":"IF(D!A3=\"\",\"\",D!A3)","v":""},{"$f":"IF(D!B3=\"\",\"\",D!B3)","v":""},null,"<== Preisbegrenzung mit \"x\" festlegen"]
["Adjudant :",null,null,2,{"$f":"IF(D!A4=\"\",\"\",D!A4)","v":""},{"$f":"IF(D!B4=\"\",\"\",D!B4)","v":""},null,"<== Preisbegrenzung mit \"x\" festlegen"]
["Königin :",null,null,3,{"$f":"IF(D!A5=\"\",\"\",D!A5)","v":""},{"$f":"IF(D!B5=\"\",\"\",D!B5)","v":""},null,"<== Preisbegrenzung mit \"x\" festlegen"]
["Adjudantin :",null,null,4,{"$f":"IF(D!A6=\"\",\"\",D!A6)","v":""},{"$f":"IF(D!B6=\"\",\"\",D!B6)","v":""},null,"<== Preisbegrenzung mit \"x\" festlegen"]
["Jugendkönig :",null,null,5,{"$f":"IF(D!A7=\"\",\"\",D!A7)","v":""},{"$f":"IF(D!B7=\"\",\"\",D!B7)","v":""},null,"<== Preisbegrenzung mit \"x\" festlegen"]
{"$rows_left_out":29}
{"sheet":"Schnüre","index":7,"n_rows":38,"n_cols":9,"rows_kept":38,"cut":false,"hidden":false,"merged":[[1,0,1,3],[1,5,1,8],[0,0,0,8]]}
[{"$f":"HM!D5","v":"Schützenfest 2018"}]
["Schnüre und Eicheln\nKK",null,null,null,null,"Schnüre und Eicheln\nLG"]
["Vor- und Nachname:","Ringe:","schlechtester\nEinzelschuss","Würde bekommen:",null,"Vor- und Nachname:","Ringe:","schlechtester\nEinzelschuss","Würde bekommen:"]
[{"$f":"IF(D!M3=\"\",\"\",D!M3)","v":""},{"$f":"IF(D!N3=0,\"\",D!N3)","v":""},{"$f":"IF(D!O3=\"\",\"\",D!O3)","v":""},{"$f":"IF(AND(B4=\"\",C4=\"\"),\"\",IF(AND(B4>=97,C4>=9),\"Halsbandorden\",IF(AND(B4>=95,C4>=9),\"Plakette\",IF(AND(B4>=93,C4>=8),\"2. Goldene Eichel\",IF(AND(B4>=91,C4>=8),\"1. Goldene Eichel\",IF(AND(B4>=89,C4>=8),\"Goldene Schnur\",IF(AND(B4>=87,C4>=7),\"2. Silberne Eichel\",IF(AND(B4>=84,C4>=7),\"1. Silberne Eichel\",IF(AND(B4>=81,C4>=7),\"Silberne Schnur\",IF(AND(B4>=78,C4>=6),\"2. Grüne Eichel\",IF(AND(B4>=75,C4>=6),\"1. Grüne Eichel\",IF(AND(B4>=72,C4>=6),\"Grüne Schnur\",\"gibt NIX :-(\"))))))))))))","v":""},null,{"$f":"IF(D!Q3=\"\",\"\",D!Q3)","v":""},{"$f":"IF(D!R3=0,\"\",D!R3)","v":""},{"$f":"IF(D!S3=\"\",\"\",D!S3)","v":""},{"$f":"IF(G4=\"\",\"\",IF(G4>=88,\"Halsbandorden\",IF(G4>=85,\"Plakette\",IF(G4>=82,\"2. Goldene Eichel\",IF(G4>=81,\"1. Goldene Eichel\",IF(G4>=80,\"Goldene Schnur\",IF(G4>=75,\"2. Silberne Eichel\",IF(G4>=73,\"1. Silberne Eichel\",IF(G4>=71,\"Silberne Schnur\",IF(G4>=68,\"2. Grüne Eichel\",IF(G4>=65,\"1. Grüne Eichel\",IF(G4>=63,\"Grüne Schnur\",\"gibt NIX :-(\"))))))))))))","v":""}]
[{"$f":"IF(D!M4=\"\",\"\",D!M4)","v":""},{"$f":"IF(D!N4=0,\"\",D!N4)","v":""},{"$f":"IF(D!O4=\"\",\"\",D!O4)","v":""},{"$f":"IF(AND(B5=\"\",C5=\"\"),\"\",IF(AND(B5>=97,C5>=9),\"Halsbandorden\",IF(AND(B5>=95,C5>=9),\"Plakette\",IF(AND(B5>=93,C5>=8),\"2. Goldene Eichel\",IF(AND(B5>=91,C5>=8),\"1. Goldene Eichel\",IF(AND(B5>=89,C5>=8),\"Goldene Schnur\",IF(AND(B5>=87,C5>=7),\"2. Silberne Eichel\",IF(AND(B5>=84,C5>=7),\"1. Silberne Eichel\",IF(AND(B5>=81,C5>=7),\"Silberne Schnur\",IF(AND(B5>=78,C5>=6),\"2. Grüne Eichel\",IF(AND(B5>=75,C5>=6),\"1. Grüne Eichel\",IF(AND(B5>=72,C5>=6),\"Grüne Schnur\",\"gibt NIX :-(\"))))))))))))","v":""},null,{"$f":"IF(D!Q4=\"\",\"\",D!Q4)","v":""},{"$f":"IF(D!R4=0,\"\",D!R4)","v":""},{"$f":"IF(D!S4=\"\",\"\",D!S4)","v":""},{"$f":"IF(G5=\"\",\"\",IF(G5>=88,\"Halsbandorden\",IF(G5>=85,\"Plakette\",IF(G5>=82,\"2. Goldene Eichel\",IF(G5>=81,\"1. Goldene Eichel\",IF(G5>=80,\"Goldene Schnur\",IF(G5>=75,\"2. Silberne Eichel\",IF(G5>=73,\"1. Silberne Eichel\",IF(G5>=71,\"Silberne Schnur\",IF(G5>=68,\"2. Grüne Eichel\",IF(G5>=65,\"1. Grüne Eichel\",IF(G5>=63,\"Grüne Schnur\",\"gibt NIX :-(\"))))))))))))","v":""}]
[{"$f":"IF(D!M5=\"\",\"\",D!M5)","v":""},{"$f":"IF(D!N5=0,\"\",D!N5)","v":""},{"$f":"IF(D!O5=\"\",\"\",D!O5)","v":""},"",null,{"$f":"IF(D!Q5=\"\",\"\",D!Q5)","v":""},{"$f":"IF(D!R5=0,\"\",D!R5)","v":""},{"$f":"IF(D!S5=\"\",\"\",D!S5)","v":""},""]
[{"$f":"IF(D!M6=\"\",\"\",D!M6)","v":""},{"$f":"IF(D!N6=0,\"\",D!N6)","v":""},{"$f":"IF(D!O6=\"\",\"\",D!O6)","v":""},"",null,{"$f":"IF(D!Q6=\"\",\"\",D!Q6)","v":""},{"$f":"IF(D!R6=0,\"\",D!R6)","v":""},{"$f":"IF(D!S6=\"\",\"\",D!S6)","v":""},""]
[{"$f":"IF(D!M7=\"\",\"\",D!M7)","v":""},{"$f":"IF(D!N7=0,\"\",D!N7)","v":""},{"$f":"IF(D!O7=\"\",\"\",D!O7)","v":""},"",null,{"$f":"IF(D!Q7=\"\",\"\",D!Q7)","v":""},{"$f":"IF(D!R7=0,\"\",D!R7)","v":""},{"$f":"IF(D!S7=\"\",\"\",D!S7)","v":""},""]
{"$rows_left_out":31}
{"sheet":"Presse","index":8,"n_rows":16,"n_cols":2,"rows_kept":16,"cut":false,"hidden":false,"merged":[[0,0,0,2]]}
[{"$f":"HM!D5","v":"Schützenfest 2018"}]
[]
[null,"Name:"]
["König :",{"$f":"IF(Ergebnisse!B4=0,\"\",Ergebnisse!B4)","v":""}]
["Adjudant :",{"$f":"IF(Ergebnisse!B5=0,\"\",Ergebnisse!B5)","v":""}]
["Königin :",{"$f":"IF(Ergebnisse!B6=0,\"\",Ergebnisse!B6)","v":""}]
["Adjudantin :",{"$f":"IF(Ergebnisse!B7=0,\"\",Ergebnisse!B7)","v":""}]
["Jugendkönig :",{"$f":"IF(Ergebnisse!B8=0,\"\",Ergebnisse!B8)","v":""}]
{"$rows_left_out":9}
{"sheet":"Sammler","index":9,"n_rows":202,"n_cols":31,"rows_kept":202,"cut":false,"hidden":false,"merged":[[0,0,0,1],[0,3,0,4],[0,6,0,7],[0,9,0,10],[0,20,0,21],[0,23,0,24],[0,26,0,27],[0,29,0,30],[0,12,0,14],[0,16,0,18]]}
["Preisschießen KK",null,null,"Preisschießen LG",null,null,"Ordenschießen KK",null,null,"Ordenschießen LG",null,null,"Schnüre + Eichel schießen KK",null,null,null,"Schnüre + Eichel schießen LG",null,null,null,"Bundesorden",null,null,"Sollepokal",null,null,"Volksbankorden",null,null,"Schinkenschießen"]
["Name:","Teiler:",null,"Name:","Teiler:",null,"Name:","Teiler:",null,"Name:","Teiler:",null,"Name:","Ringe:","schl. Schuss",null,"Name:","Ringe:","schl. Schuss",null,"Name:","Teiler:",null,"Name:","Teiler:",null,"Name:","Teiler:",null,"Name:","Teiler:"]
[{"$f":"PS!C5","v":""},{"$f":"IF(PS!D5=\"\",\"\",PS!D5)","v":""},null,{"$f":"PS!G5","v":""},{"$f":"IF(PS!H5=\"\",\"\",PS!H5)","v":""},null,{"$f":"OS!C5","v":""},{"$f":"IF(OS!D5=\"\",\"\",OS!D5)","v":""},null,{"$f":"OS!G5","v":""},{"$f":"IF(OS!H5=\"\",\"\",OS!H5)","v":""},null,{"$f":"SE!C6","v":""},{"$f":"IF(SE!D6=\"\",0,SE!D6)","v":0},{"$f":"IF(SE!E6=\"\",\"\",SE!E6)","v":""},null,{"$f":"SE!H5","v":""},{"$f":"IF(SE!I5=\"\",0,SE!I5)","v":0},{"$f":"IF(SE!J5=\"\",\"\",SE!J5)","v":""},null,{"$f":"BSP!C5","v":""},{"$f":"IF(BSP!D5=\"\",\"\",BSP!D5)","v":""},null,{"$f":"BSP!G5","v":""},{"$f":"IF(BSP!H5=\"\",\"\",BSP!H5)","v":""},null,{"$f":"VS!C5","v":""},{"$f":"IF(VS!D5=\"\",\"\",VS!D5)","v":""},null,{"$f":"VS!G5","v":""},{"$f":"IF(VS!H5=\"\",\"\",VS!H5)","v":""}]
[{"$f":"PS!C6","v":""},{"$f":"IF(PS!D6=\"\",\"\",PS!D6)","v":""},null,{"$f":"PS!G6","v":""},{"$f":"IF(PS!H6=\"\",\"\",PS!H6)","v":""},null,{"$f":"OS!C6","v":""},{"$f":"IF(OS!D6=\"\",\"\",OS!D6)","v":""},null,{"$f":"OS!G6","v":""},{"$f":"IF(OS!H6=\"\",\"\",OS!H6)","v":""},null,{"$f":"SE!C5","v":""},{"$f":"IF(SE!D5=\"\",0,SE!D5)","v":0},{"$f":"IF(SE!E5=\"\",\"\",SE!E5)","v":""},null,{"$f":"SE!H6","v":""},{"$f":"IF(SE!I6=\"\",0,SE!I6)","v":0},{"$f":"IF(SE!J6=\"\",\"\",SE!J6)","v":""},null,{"$f":"BSP!C6","v":""},{"$f":"IF(BSP!D6=\"\",\"\",BSP!D6)","v":""},null,{"$f":"BSP!G6","v":""},{"$f":"IF(BSP!H6=\"\",\"\",BSP!H6)","v":""},null,{"$f":"VS!C6","v":""},{"$f":"IF(VS!D6=\"\",\"\",VS!D6)","v":""},null,{"$f":"VS!G6","v":""},{"$f":"IF(VS!H6=\"\",\"\",VS!H6)","v":""}]
[{"$f":"PS!C7","v":""},{"$f":"IF(PS!D7=\"\",\"\",PS!D7)","v":""},null,{"$f":"PS!G7","v":""},{"$f":"IF(PS!H7=\"\",\"\",PS!H7)","v":""},null,{"$f":"OS!C7","v":""},{"$f":"IF(OS!D7=\"\",\"\",OS!D7)","v":""},null,{"$f":"OS!G7","v":""},{"$f":"IF(OS!H7=\"\",\"\",OS!H7)","v":""},null,{"$f":"SE!C7","v":""},{"$f":"IF(SE!D7=\"\",0,SE!D7)","v":0},{"$f":"IF(SE!E7=\"\",\"\",SE!E7)","v":""},null,{"$f":"SE!H7","v":""},{"$f":"IF(SE!I7=\"\",0,SE!I7)","v":0},{"$f":"IF(SE!J7=\"\",\"\",SE!J7)","v":""},null,{"$f":"BSP!C7","v":""},{"$f":"IF(BSP!D7=\"\",\"\",BSP!D7)","v":""},null,{"$f":"BSP!G7","v":""},{"$f":"IF(BSP!H7=\"\",\"\",BSP!H7)","v":""},null,{"$f":"VS!C7","v":""},{"$f":"IF(VS!D7=\"\",\"\",VS!D7)","v":""},null,{"$f":"VS!G7","v":""},{"$f":"IF(VS!H7=\"\",\"\",VS!H7)","v":""}]
[{"$f":"PS!C8","v":""},{"$f":"IF(PS!D8=\"\",\"\",PS!D8)","v":""},null,{"$f":"PS!G8","v":""},{"$f":"IF(PS!H8=\"\",\"\",PS!H8)","v":""},null,{"$f":"OS!C8","v":""},{"$f":"IF(OS!D8=\"\",\"\",OS!D8)","v":""},null,{"$f":"OS!G8","v":""},{"$f":"IF(OS!H8=\"\",\"\",OS!H8)","v":""},null,{"$f":"SE!C8","v":""},{"$f":"IF(SE!D8=\"\",0,SE!D8)","v":0},{"$f":"IF(SE!E8=\"\",\"\",SE!E8)","v":""},null,{"$f":"SE!H8","v":""},{"$f":"IF(SE!I8=\"\",0,SE!I8)","v":0},{"$f":"IF(SE!J8=\"\",\"\",SE!J8)","v":""},null,{"$f":"BSP!C8","v":""},{"$f":"IF(BSP!D8=\"\",\"\",BSP!D8)","v":""},null,{"$f":"BSP!G8","v":""},{"$f":"IF(BSP!H8=\"\",\"\",BSP!H8)","v":""},null,{"$f":"VS!C8","v":""},{"$f":"IF(VS!D8=\"\",\"\",VS!D8)","v":""},null,{"$f":"VS!G8","v":""},{"$f":"IF(VS!H8=\"\",\"\",VS!H8)","v":""}]
[{"$f":"PS!C9","v":""},{"$f":"IF(PS!D9=\"\",\"\",PS!D9)","v":""},null,{"$f":"PS!G9","v":""},{"$f":"IF(PS!H9=\"\",\"\",PS!H9)","v":""},null,{"$f":"OS!C9","v":""},{"$f":"IF(OS!D9=\"\",\"\",OS!D9)","v":""},null,{"$f":"OS!G9","v":""},{"$f":"IF(OS!H9=\"\",\"\",OS!H9)","v":""},null,{"$f":"SE!C9","v":""},{"$f":"IF(SE!D9=\"\",0,SE!D9)","v":0},{"$f":"IF(SE!E9=\"\",\"\",SE!E9)","v":""},null,{"$f":"SE!H9","v":""},{"$f":"IF(SE!I9=\"\",0,SE!I9)","v":0},{"$f":"IF(SE!J9=\"\",\"\",SE!J9)","v":""},null,{"$f":"BSP!C9","v":""},{"$f":"IF(BSP!D9=\"\",\"\",BSP!D9)","v":""},null,{"$f":"BSP!G9","v":""},{"$f":"IF(BSP!H9=\"\",\"\",BSP!H9)","v":""},null,{"$f":"VS!C9","v":""},{"$f":"IF(VS!D9=\"\",\"\",VS!D9)","v":""},null,{"$f":"VS!G9","v":""},{"$f":"IF(VS!H9=\"\",\"\",VS!H9)","v":""}]
[{"$f":"PS!C10","v":""},{"$f":"IF(PS!D10=\"\",\"\",PS!D10)","v":""},null,{"$f":"PS!G10","v":""},{"$f":"IF(PS!H10=\"\",\"\",PS!H10)","v":""},null,{"$f":"OS!C10","v":""},{"$f":"IF(OS!D10=\"\",\"\",OS!D10)","v":""},null,{"$f":"OS!G10","v":""},{"$f":"IF(OS!H10=\"\",\"\",OS!H10)","v":""},null,{"$f":"SE!C10","v":""},{"$f":"IF(SE!D10=\"\",0,SE!D10)","v":0},{"$f":"IF(SE!E10=\"\",\"\",SE!E10)","v":""},null,{"$f":"SE!H10","v":""},{"$f":"IF(SE!I10=\"\",0,SE!I10)","v":0},{"$f":"IF(SE!J10=\"\",\"\",SE!J10)","v":""},null,{"$f":"BSP!C10","v":""},{"$f":"IF(BSP!D10=\"\",\"\",BSP!D10)","v":""},null,{"$f":"BSP!G10","v":""},{"$f":"IF(BSP!H10=\"\",\"\",BSP!H10)","v":""},null,{"$f":"VS!C10","v":""},{"$f":"IF(VS!D10=\"\",\"\",VS!D10)","v":""},null,{"$f":"VS!G10","v":""},{"$f":"IF(VS!H10=\"\",\"\",VS!H10)","v":""}]
{"$rows_left_out":195}
{"sheet":"D","index":10,"n_rows":202,"n_cols":31,"rows_kept":202,"cut":false,"hidden":false,"merged":[[0,23,0,24],[0,26,0,27],[0,29,0,30],[0,12,0,14],[0,16,0,18],[0,0,0,1],[0,3,0,4],[0,6,0,7],[0,9,0,10],[0,20,0,21]]}
["Preisschießen KK",null,null,"Preisschießen LG",null,null,"Ordenschießen KK",null,null,"Ordenschießen LG",null,null,"Schnüre + Eichel schießen KK",null,null,null,"Schnüre + Eichel schießen LG",null,null,null,"Bundesorden",null,null,"Sollepokal",null,null,"Volksbankorden",null,null,"Schinkenschießen"]
["Name:","Teiler:",null,"Name:","Teiler:",null,"Name:","Teiler:",null,"Name:","Teiler:",null,"Name:","Ringe:","schl. Schuss",null,"Name:","Ringe:","schl. Schuss",null,"Name:","Teiler:",null,"Name:","Teiler:",null,"Name:","Teiler:",null,"Name:","Teiler:"]
["","",null,"","",null,"","",null,"","",null,"",0,"",null,"",0,"",null,"","",null,"","",null,"","",null,"",""]
["","",null,"","",null,"","",null,"","",null,"",0,"",null,"",0,"",null,"","",null,"","",null,"","",null,"",""]
["","",null,"","",null,"","",null,"","",null,"",0,"",null,"",0,"",null,"","",null,"","",null,"","",null,"",""]
["","",null,"","",null,"","",null,"","",null,"",0,"",null,"",0,"",null,"","",null,"","",null,"","",null,"",""]
["","",null,"","",null,"","",null,"","",null,"",0,"",null,"",0,"",null,"","",null,"","",null,"","",null,"",""]
["","",null,"","",null,"","",null,"","",null,"",0,"",null,"",0,"",null,"","",null,"","",null,"","",null,"",""]
{"$rows_left_out":195}
{"sheet":"Kasse","index":11,"n_rows":25,"n_cols":4,"rows_kept":25,"cut":false,"hidden":false,"merged":[[0,0,0,3]]}
["Kassen-/ und Verkaufsübersicht"]
[]
[null,"gesamt Einnahmen Schützenfest:",{"$f":"HM!D216","v":0},"Anzahl Schützen"]
[null,"Einnahmen Preisschießen KK:",{"$f":"HM!D214","v":0},{"$f":"COUNTA(HM!B10:B209)-D6","v":0}]
[null,"Einnahmen Preisschießen LG:",{"$f":"HM!D215","v":0},"Anzahl Gäste"]
[null,"Einnahmen Munition:",{"$f":"HM!D213","v":0},{"$f":"COUNTIF(HM!X10:X209,1)","v":0}]
[null,"Einnahmen Orden KK:",{"$f":"HM!J211*HM!D242","v":0}]
[null,"Einnahmen Orden LG:",{"$f":"HM!K211*HM!D243","v":0}]
{"$rows_left_out":18}
{"sheet":"Info","index":12,"n_rows":1,"n_cols":1,"rows_kept":1,"cut":false,"hidden":false,"merged":[[0,0,3,8]]}
["Informationen zum \nSchießbetrieb beim Schützenfest"]