{"text_format":"1","workbook":"xlsx","n_sheets":9,"sheets":["Maske","Teilnehmer","Preisschießen KK","Preisschießen LG","Eingabe-Ergebnisse VM","Vereinsmeisterergebnisse","Preisschießen Ergebnisse","Mitgliederliste","Wettkampfklassen ab 01.01.2018"],"not_rendered":{"charts":0,"images":76,"macros":1,"external_links":0,"defined_names":9,"comments":1,"pivot_tables":0},"unopened":[],"bounds":{"document_bytes":16777216,"sheet_cells":100000,"rows_first":2000,"rows_last":500,"rows_between":2000,"halvings":0,"cell_chars":16384,"cell_head_chars":4096},"cells_cut":0,"cells_raw":0,"read":"whole","date_system":"1900"}

{"sheet":"Maske","index":0,"n_rows":33,"n_cols":10,"rows_kept":33,"cut":false,"hidden":false,"merged":[[10,8,11,10],[8,8,9,10],[29,7,29,9],[36,8,36,10],[16,8,16,10],[13,8,13,10]]}
[]
[]
[]
[]
[]
[]
[]
[]
[null,null,null,null,null,null,null,null,"Vereinsmeister Datum:"]
[]
[null,null,null,null,null,null,null,null,"07.09.2018"]
[]
[]
[null,null,null,null,null,null,null,null,"© R. Marquardt, 2018, Version 1.6"]
[]
[]
[]
[]
[]
[]
[]
[]
[]
[]
[]
[]
[]
[]
[]
[]
[]
[]
[null,null,null,null,null,null,null,null,null,"WK = Wettkampfklassen"]

{"sheet":"Teilnehmer","index":1,"n_rows":122,"n_cols":28,"rows_kept":122,"cut":false,"hidden":false,"merged":[[0,0,0,25],[103,21,103,24],[104,19,104,20],[105,19,105,20],[106,21,106,24],[104,0,104,1],[105,21,105,24],[104,21,104,24],[104,14,104,17],[104,12,104,13],[105,12,105,18],[1,4,1,5],[102,0,102,6],[107,12,107,13],[108,12,108,18],[111,12,111,18],[106,12,106,14],[106,16,106,17],[111,19,111,20],[109,25,112,26],[107,21,107,24],[108,21,108,24],[107,14,107,17],[107,19,107,20],[108,19,108,20]]}
[{"$f":"CONCATENATE(\"Vereinsmeisterschaftsschießen vom\",\" \",Maske!I11)","v":"Vereinsmeisterschaftsschießen vom 07.09.2018"}]
["Nr.:","Name:\n(Vor.- Nachname)",null,"Geb. Datum:\nTT.MM.JJJJ","WK-Klasse\nAufl.   Freih.\nM/W   -   M/W",null,"Alter:\nJJ","Munition RWS","Munition CCI","Preis KK","Preis KK\n(nachgelöst)","Preis LG ( 1 Streifen )\n - bis 18 Jahre -","LG - Auflage","LG - Auflage\n- Ermäßigt (15-16 Jahre) -","LG - Auflage\n- Schüler -","LG - Freihand\n- Schüler -","LG - Freihand","LG - Freihand\n- Ermäßigt (15-16 Jahre) -","Luftpistole\n- Schüler -","Luftpistole","Luftpistole\n- Ermäßigt (15-16 Jahre) -","KK - Auflage","KK - Auflage\n- Ermäßigt (15-17 Jahre) -","KK - Freihand","KK - Freihand\n- Ermäßigt (15-17 Jahre) -","Summe:"]
[1,null,{"$f":"IF(B3=\"\",\"Keine Teilnahme\",B3)","v":"Keine Teilnahme"},{"$f":"IF(B3=\"\",\"\",VLOOKUP(B3,Mitgliederliste!A:B,2,0))","v":""},{"$f":"IF(G3<=11,\"X\",IF(G3<=14,\"20/21\",IF(G3<=16,\"30/31\",IF(G3<=18,\"42/43\",IF(G3<=20,\"40/41\",IF(G3<=40,\"10/11\",IF(G3<=50,\"12/13\",IF(G3<=60,\"70/71\",IF(G3<=65,\"72/73\",IF(G3<=70,\"74/75\",IF(G3<=75,\"76/77\",IF(G3<=100,\"78/79\",\"\"))))))))))))","v":""},{"$f":"IF(G3<=11,\"X\",IF(G3<=14,\"20/21\",IF(G3<=16,\"30/31\",IF(G3<=18,\"42/43\",IF(G3<=20,\"40/41\",IF(G3<=40,\"10/11\",IF(G3<=50,\"12/13\",IF(G3<=60,\"14/15\",IF(G3<=100,\"16/17\",\"\")))))))))","v":""},{"$f":"IF(D3=\"\",\"\",DATEDIF(D3,TODAY(),\"Y\"))","v":""},null,null,null,null,null,null,null,null,null,null,null,null,null,null,null,null,null,null,{"$f":"IF(B3=\"\",\"\",(H3*$A$122)+(J3*$A$106)+(K3*$A$107)+(L3*$A$108)+(M3*$A$111)+(N3*$A$112)+(O3*$A$109)+(P3*$A$110)+(Q3*$A$113)+(R3*$A$114)+(S3*$A$116)+(T3*$A$115)+(U3*$A$117)+(V3*$A$118)+(W3*$A$119)+(X3*$A$120)+(Y3*$A$121))","v":""},{"$f":"IF(D3=\"\",\"\",\"Alter: \"&DATEDIF(D3,TODAY(),\"y\")&\" Jahre \"&DATEDIF(D3,TODAY(),\"ym\")&\" Monate \"&DAY(TODAY())-DAY(D3)+(DAY(D3)>DAY(TODAY()))*DAY(DATE(YEAR(D3),MONTH(D3)+1,))&\" Tage\")","v":""},{"$f":"G3","v":""}]
[2,null,"Keine Teilnahme",{"$f":"IF(B4=\"\",\"\",VLOOKUP(B4,Mitgliederliste!A:B,2,0))","v":""},{"$f":"IF(G4<=11,\"X\",IF(G4<=14,\"20/21\",IF(G4<=16,\"30/31\",IF(G4<=18,\"42/43\",IF(G4<=20,\"40/41\",IF(G4<=40,\"10/11\",IF(G4<=50,\"12/13\",IF(G4<=60,\"70/71\",IF(G4<=65,\"72/73\",IF(G4<=70,\"74/75\",IF(G4<=75,\"76/77\",IF(G4<=100,\"78/79\",\"\"))))))))))))","v":""},{"$f":"IF(G4<=11,\"X\",IF(G4<=14,\"20/21\",IF(G4<=16,\"30/31\",IF(G4<=18,\"42/43\",IF(G4<=20,\"40/41\",IF(G4<=40,\"10/11\",IF(G4<=50,\"12/13\",IF(G4<=60,\"14/15\",IF(G4<=100,\"16/17\",\"\")))))))))","v":""},"",null,null,null,null,null,null,null,null,null,null,null,null,null,null,null,null,null,null,{"$f":"IF(B4=\"\",\"\",(H4*$A$122)+(J4*$A$106)+(K4*$A$107)+(L4*$A$108)+(M4*$A$111)+(N4*$A$112)+(O4*$A$109)+(P4*$A$110)+(Q4*$A$113)+(R4*$A$114)+(S4*$A$116)+(T4*$A$115)+(U4*$A$117)+(V4*$A$118)+(W4*$A$119)+(X4*$A$120)+(Y4*$A$121))","v":""},{"$f":"IF(D4=\"\",\"\",\"Alter: \"&DATEDIF(D4,TODAY(),\"y\")&\" Jahre \"&DATEDIF(D4,TODAY(),\"ym\")&\" Monate \"&DAY(TODAY())-DAY(D4)+(DAY(D4)>DAY(TODAY()))*DAY(DATE(YEAR(D4),MONTH(D4)+1,))&\" Tage\")","v":""}]
[3,null,"Keine Teilnahme",{"$f":"IF(B5=\"\",\"\",VLOOKUP(B5,Mitgliederliste!A:B,2,0))","v":""},"","","",null,null,null,null,null,null,null,null,null,null,null,null,null,null,null,null,null,null,"",""]
[4,null,"Keine Teilnahme",{"$f":"IF(B6=\"\",\"\",VLOOKUP(B6,Mitgliederliste!A:B,2,0))","v":""},"","","",null,null,null,null,null,null,null,null,null,null,null,null,null,null,null,null,null,null,"",""]
[5,null,"Keine Teilnahme",{"$f":"IF(B7=\"\",\"\",VLOOKUP(B7,Mitgliederliste!A:B,2,0))","v":""},"","","",null,null,null,null,null,null,null,null,null,null,null,null,null,null,null,null,null,null,"",""]
[6,null,"Keine Teilnahme",{"$f":"IF(B8=\"\",\"\",VLOOKUP(B8,Mitgliederliste!A:B,2,0))","v":""},"","","",null,null,null,null,null,null,null,null,null,null,null,null,null,null,null,null,null,null,"",""]
[7,null,{"$f":"IF(B9=\"\",\"Keine Teilnahme\",B9)","v":"Keine Teilnahme"},{"$f":"IF(B9=\"\",\"\",VLOOKUP(B9,Mitgliederliste!A:B,2,0))","v":""},"","","",null,null,null,null,null,null,null,null,null,null,null,null,null,null,null,null,null,null,"",""]
[8,null,"Keine Teilnahme",{"$f":"IF(B10=\"\",\"\",VLOOKUP(B10,Mitgliederliste!A:B,2,0))","v":""},"","","",null,null,null,null,null,null,null,null,null,null,null,null,null,null,null,null,null,null,"",""]
[9,null,"Keine Teilnahme",{"$f":"IF(B11=\"\",\"\",VLOOKUP(B11,Mitgliederliste!A:B,2,0))","v":""},"","","",null,null,null,null,null,null,null,null,null,null,null,null,null,null,null,null,null,null,"",""]
[10,null,"Keine Teilnahme",{"$f":"IF(B12=\"\",\"\",VLOOKUP(B12,Mitgliederliste!A:B,2,0))","v":""},"","","",null,null,null,null,null,null,null,null,null,null,null,null,null,null,null,null,null,null,"",""]
[11,null,"Keine Teilnahme",{"$f":"IF(B13=\"\",\"\",VLOOKUP(B13,Mitgliederliste!A:B,2,0))","v":""},"","","",null,null,null,null,null,null,null,null,null,null,null,null,null,null,null,null,null,null,"",""]
[12,null,"Keine Teilnahme",{"$f":"IF(B14=\"\",\"\",VLOOKUP(B14,Mitgliederliste!A:B,2,0))","v":""},"","","",null,null,null,null,null,null,null,null,null,null,null,null,null,null,null,null,null,null,"",""]
[13,null,"Keine Teilnahme",{"$f":"IF(B15=\"\",\"\",VLOOKUP(B15,Mitgliederliste!A:B,2,0))","v":""},"","","",null,null,null,null,null,null,null,null,null,null,null,null,null,null,null,null,null,null,"",""]
[14,null,"Keine Teilnahme",{"$f":"IF(B16=\"\",\"\",VLOOKUP(B16,Mitgliederliste!A:B,2,0))","v":""},"","","",null,null,null,null,null,null,null,null,null,null,null,null,null,null,null,null,null,null,"",""]
[15,null,"Keine Teilnahme",{"$f":"IF(B17=\"\",\"\",VLOOKUP(B17,Mitgliederliste!A:B,2,0))","v":""},"","","",null,null,null,null,null,null,null,null,null,null,null,null,null,null,null,null,null,null,"",""]
[16,null,"Keine Teilnahme",{"$f":"IF(B18=\"\",\"\",VLOOKUP(B18,Mitgliederliste!A:B,2,0))","v":""},"","","",null,null,null,null,null,null,null,null,null,null,null,null,null,null,null,null,null,null,"",""]
[17,null,"Keine Teilnahme",{"$f":"IF(B19=\"\",\"\",VLOOKUP(B19,Mitgliederliste!A:B,2,0))","v":""},"","","",null,null,null,null,null,null,null,null,null,null,null,null,null,null,null,null,null,null,"",""]
[18,null,"Keine Teilnahme",{"$f":"IF(B20=\"\",\"\",VLOOKUP(B20,Mitgliederliste!A:B,2,0))","v":""},"","","",null,null,null,null,null,null,null,null,null,null,null,null,null,null,null,null,null,null,"",""]
[19,null,"Keine Teilnahme",{"$f":"IF(B21=\"\",\"\",VLOOKUP(B21,Mitgliederliste!A:B,2,0))","v":""},"","","",null,null,null,null,null,null,null,null,null,null,null,null,null,null,null,null,null,null,"",""]
[20,null,"Keine Teilnahme",{"$f":"IF(B22=\"\",\"\",VLOOKUP(B22,Mitgliederliste!A:B,2,0))","v":""},"","","",null,null,null,null,null,null,null,null,null,null,null,null,null,null,null,null,null,null,"",""]
[21,null,"Keine Teilnahme",{"$f":"IF(B23=\"\",\"\",VLOOKUP(B23,Mitgliederliste!A:B,2,0))","v":""},"","","",null,null,null,null,null,null,null,null,null,null,null,null,null,null,null,null,null,null,"",""]
[22,null,"Keine Teilnahme",{"$f":"IF(B24=\"\",\"\",VLOOKUP(B24,Mitgliederliste!A:B,2,0))","v":""},"","","",null,null,null,null,null,null,null,null,null,null,null,null,null,null,null,null,null,null,"",""]
[23,null,"Keine Teilnahme",{"$f":"IF(B25=\"\",\"\",VLOOKUP(B25,Mitgliederliste!A:B,2,0))","v":""},"","","",null,null,null,null,null,null,null,null,null,null,null,null,null,null,null,null,null,null,"",""]
[24,null,"Keine Teilnahme",{"$f":"IF(B26=\"\",\"\",VLOOKUP(B26,Mitgliederliste!A:B,2,0))","v":""},"","","",null,null,null,null,null,null,null,null,null,null,null,null,null,null,null,null,null,null,"",""]
[25,null,"Keine Teilnahme",{"$f":"IF(B27=\"\",\"\",VLOOKUP(B27,Mitgliederliste!A:B,2,0))","v":""},"","","",null,null,null,null,null,null,null,null,null,null,null,null,null,null,null,null,null,null,"",""]
[26,null,"Keine Teilnahme",{"$f":"IF(B28=\"\",\"\",VLOOKUP(B28,Mitgliederliste!A:B,2,0))","v":""},"","","",null,null,null,null,null,null,null,null,null,null,null,null,null,null,null,null,null,null,"",""]
[27,null,"Keine Teilnahme",{"$f":"IF(B29=\"\",\"\",VLOOKUP(B29,Mitgliederliste!A:B,2,0))","v":""},"","","",null,null,null,null,null,null,null,null,null,null,null,null,null,null,null,null,null,null,"",""]
[28,null,"Keine Teilnahme",{"$f":"IF(B30=\"\",\"\",VLOOKUP(B30,Mitgliederliste!A:B,2,0))","v":""},"","","",null,null,null,null,null,null,null,null,null,null,null,null,null,null,null,null,null,null,"",""]
[29,null,"Keine Teilnahme",{"$f":"IF(B31=\"\",\"\",VLOOKUP(B31,Mitgliederliste!A:B,2,0))","v":""},"","","",null,null,null,null,null,null,null,null,null,null,null,null,null,null,null,null,null,null,"",""]
[30,null,"Keine Teilnahme",{"$f":"IF(B32=\"\",\"\",VLOOKUP(B32,Mitgliederliste!A:B,2,0))","v":""},"","","",null,null,null,null,null,null,null,null,null,null,null,null,null,null,null,null,null,null,"",""]
[31,null,"Keine Teilnahme",{"$f":"IF(B33=\"\",\"\",VLOOKUP(B33,Mitgliederliste!A:B,2,0))","v":""},"","","",null,null,null,null,null,null,null,null,null,null,null,null,null,null,null,null,null,null,"",""]
[32,null,"Keine Teilnahme",{"$f":"IF(B34=\"\",\"\",VLOOKUP(B34,Mitgliederliste!A:B,2,0))","v":""},"","","",null,null,null,null,null,null,null,null,null,null,null,null,null,null,null,null,null,null,"",""]
[33,null,"Keine Teilnahme",{"$f":"IF(B35=\"\",\"\",VLOOKUP(B35,Mitgliederliste!A:B,2,0))","v":""},"","","",null,null,null,null,null,null,null,null,null,null,null,null,null,null,null,null,null,null,"",""]
[34,null,"Keine Teilnahme",{"$f":"IF(B36=\"\",\"\",VLOOKUP(B36,Mitgliederliste!A:B,2,0))","v":""},"","","",null,null,null,null,null,null,null,null,null,null,null,null,null,null,null,null,null,null,"",""]
[35,null,"Keine Teilnahme",{"$f":"IF(B37=\"\",\"\",VLOOKUP(B37,Mitgliederliste!A:B,2,0))","v":""},"","","",null,null,null,null,null,null,null,null,null,null,null,null,null,null,null,null,null,null,"",""]
[36,null,"Keine Teilnahme",{"$f":"IF(B38=\"\",\"\",VLOOKUP(B38,Mitgliederliste!A:B,2,0))","v":""},"","","",null,null,null,null,null,null,null,null,null,null,null,null,null,null,null,null,null,null,"",""]
[37,null,"Keine Teilnahme",{"$f":"IF(B39=\"\",\"\",VLOOKUP(B39,Mitgliederliste!A:B,2,0))","v":""},"","","",null,null,null,null,null,null,null,null,null,null,null,null,null,null,null,null,null,null,"",""]
[38,null,"Keine Teilnahme",{"$f":"IF(B40=\"\",\"\",VLOOKUP(B40,Mitgliederliste!A:B,2,0))","v":""},"","","",null,null,null,null,null,null,null,null,null,null,null,null,null,null,null,null,null,null,"",""]
[39,null,"Keine Teilnahme",{"$f":"IF(B41=\"\",\"\",VLOOKUP(B41,Mitgliederliste!A:B,2,0))","v":""},"","","",null,null,null,null,null,null,null,null,null,null,null,null,null,null,null,null,null,null,"",""]
[40,null,"Keine Teilnahme",{"$f":"IF(B42=\"\",\"\",VLOOKUP(B42,Mitgliederliste!A:B,2,0))","v":""},"","","",null,null,null,null,null,null,null,null,null,null,null,null,null,null,null,null,null,null,"",""]
[41,null,"Keine Teilnahme",{"$f":"IF(B43=\"\",\"\",VLOOKUP(B43,Mitgliederliste!A:B,2,0))","v":""},"","","",null,null,null,null,null,null,null,null,null,null,null,null,null,null,null,null,null,null,"",""]
[42,null,"Keine Teilnahme",{"$f":"IF(B44=\"\",\"\",VLOOKUP(B44,Mitgliederliste!A:B,2,0))","v":""},"","","",null,null,null,null,null,null,null,null,null,null,null,null,null,null,null,null,null,null,"",""]
[43,null,"Keine Teilnahme",{"$f":"IF(B45=\"\",\"\",VLOOKUP(B45,Mitgliederliste!A:B,2,0))","v":""},"","","",null,null,null,null,null,null,null,null,null,null,null,null,null,null,null,null,null,null,"",""]
[44,null,"Keine Teilnahme",{"$f":"IF(B46=\"\",\"\",VLOOKUP(B46,Mitgliederliste!A:B,2,0))","v":""},"","","",null,null,null,null,null,null,null,null,null,null,null,null,null,null,null,null,null,null,"",""]
[45,null,"Keine Teilnahme",{"$f":"IF(B47=\"\",\"\",VLOOKUP(B47,Mitgliederliste!A:B,2,0))","v":""},"","","",null,null,null,null,null,null,null,null,null,null,null,null,null,null,null,null,null,null,"",""]
[46,null,"Keine Teilnahme",{"$f":"IF(B48=\"\",\"\",VLOOKUP(B48,Mitgliederliste!A:B,2,0))","v":""},"","","",null,null,null,null,null,null,null,null,null,null,null,null,null,null,null,null,null,null,"",""]
[47,null,"Keine Teilnahme",{"$f":"IF(B49=\"\",\"\",VLOOKUP(B49,Mitgliederliste!A:B,2,0))","v":""},"","","",null,null,null,null,null,null,null,null,null,null,null,null,null,null,null,null,null,null,"",""]
[48,null,"Keine Teilnahme",{"$f":"IF(B50=\"\",\"\",VLOOKUP(B50,Mitgliederliste!A:B,2,0))","v":""},"","","",null,null,null,null,null,null,null,null,null,null,null,null,null,null,null,null,null,null,"",""]
[49,null,"Keine Teilnahme",{"$f":"IF(B51=\"\",\"\",VLOOKUP(B51,Mitgliederliste!A:B,2,0))","v":""},"","","",null,null,null,null,null,null,null,null,null,null,null,null,null,null,null,null,null,null,"",""]
[50,null,"Keine Teilnahme",{"$f":"IF(B52=\"\",\"\",VLOOKUP(B52,Mitgliederliste!A:B,2,0))","v":""},"","","",null,null,null,null,null,null,null,null,null,null,null,null,null,null,null,null,null,null,"",""]
[51,null,"Keine Teilnahme",{"$f":"IF(B53=\"\",\"\",VLOOKUP(B53,Mitgliederliste!A:B,2,0))","v":""},"","","",null,null,null,null,null,null,null,null,null,null,null,null,null,null,null,null,null,null,"",""]
[52,null,"Keine Teilnahme",{"$f":"IF(B54=\"\",\"\",VLOOKUP(B54,Mitgliederliste!A:B,2,0))","v":""},"","","",null,null,null,null,null,null,null,null,null,null,null,null,null,null,null,null,null,null,"",""]
[53,null,"Keine Teilnahme",{"$f":"IF(B55=\"\",\"\",VLOOKUP(B55,Mitgliederliste!A:B,2,0))","v":""},"","","",null,null,null,null,null,null,null,null,null,null,null,null,null,null,null,null,null,null,"",""]
[54,null,"Keine Teilnahme",{"$f":"IF(B56=\"\",\"\",VLOOKUP(B56,Mitgliederliste!A:B,2,0))","v":""},"","","",null,null,null,null,null,null,null,null,null,null,null,null,null,null,null,null,null,null,"",""]
[55,null,"Keine Teilnahme",{"$f":"IF(B57=\"\",\"\",VLOOKUP(B57,Mitgliederliste!A:B,2,0))","v":""},"","","",null,null,null,null,null,null,null,null,null,null,null,null,null,null,null,null,null,null,"",""]
[56,null,"Keine Teilnahme",{"$f":"IF(B58=\"\",\"\",VLOOKUP(B58,Mitgliederliste!A:B,2,0))","v":""},"","","",null,null,null,null,null,null,null,null,null,null,null,null,null,null,null,null,null,null,"",""]
[57,null,"Keine Teilnahme",{"$f":"IF(B59=\"\",\"\",VLOOKUP(B59,Mitgliederliste!A:B,2,0))","v":""},"","","",null,null,null,null,null,null,null,null,null,null,null,null,null,null,null,null,null,null,"",""]
[58,null,"Keine Teilnahme",{"$f":"IF(B60=\"\",\"\",VLOOKUP(B60,Mitgliederliste!A:B,2,0))","v":""},"","","",null,null,null,null,null,null,null,null,null,null,null,null,null,null,null,null,null,null,"",""]
[59,null,"Keine Teilnahme",{"$f":"IF(B61=\"\",\"\",VLOOKUP(B61,Mitgliederliste!A:B,2,0))","v":""},"","","",null,null,null,null,null,null,null,null,null,null,null,null,null,null,null,null,null,null,"",""]
[60,null,"Keine Teilnahme",{"$f":"IF(B62=\"\",\"\",VLOOKUP(B62,Mitgliederliste!A:B,2,0))","v":""},"","","",null,null,null,null,null,null,null,null,null,null,null,null,null,null,null,null,null,null,"",""]
[61,null,"Keine Teilnahme",{"$f":"IF(B63=\"\",\"\",VLOOKUP(B63,Mitgliederliste!A:B,2,0))","v":""},"","","",null,null,null,null,null,null,null,null,null,null,null,null,null,null,null,null,null,null,"",""]
[62,null,"Keine Teilnahme",{"$f":"IF(B64=\"\",\"\",VLOOKUP(B64,Mitgliederliste!A:B,2,0))","v":""},"","","",null,null,null,null,null,null,null,null,null,null,null,null,null,null,null,null,null,null,"",""]
[63,null,"Keine Teilnahme",{"$f":"IF(B65=\"\",\"\",VLOOKUP(B65,Mitgliederliste!A:B,2,0))","v":""},"","","",null,null,null,null,null,null,null,null,null,null,null,null,null,null,null,null,null,null,"",""]
[64,null,"Keine Teilnahme",{"$f":"IF(B66=\"\",\"\",VLOOKUP(B66,Mitgliederliste!A:B,2,0))","v":""},"","","",null,null,null,null,null,null,null,null,null,null,null,null,null,null,null,null,null,null,"",""]
[65,null,"Keine Teilnahme",{"$f":"IF(B67=\"\",\"\",VLOOKUP(B67,Mitgliederliste!A:B,2,0))","v":""},"","","",null,null,null,null,null,null,null,null,null,null,null,null,null,null,null,null,null,null,"",""]
[66,null,{"$f":"IF(B68=\"\",\"Keine Teilnahme\",B68)","v":"Keine Teilnahme"},{"$f":"IF(B68=\"\",\"\",VLOOKUP(B68,Mitgliederliste!A:B,2,0))","v":""},{"$f":"IF(G68<=11,\"X\",IF(G68<=14,\"20/21\",IF(G68<=16,\"30/31\",IF(G68<=18,\"42/43\",IF(G68<=20,\"40/41\",IF(G68<=40,\"10/11\",IF(G68<=50,\"12/13\",IF(G68<=60,\"70/71\",IF(G68<=65,\"72/73\",IF(G68<=70,\"74/75\",IF(G68<=75,\"76/77\",IF(G68<=100,\"78/79\",\"\"))))))))))))","v":""},{"$f":"IF(G68<=11,\"X\",IF(G68<=14,\"20/21\",IF(G68<=16,\"30/31\",IF(G68<=18,\"42/43\",IF(G68<=20,\"40/41\",IF(G68<=40,\"10/11\",IF(G68<=50,\"12/13\",IF(G68<=60,\"14/15\",IF(G68<=100,\"16/17\",\"\")))))))))","v":""},{"$f":"IF(D68=\"\",\"\",DATEDIF(D68,TODAY(),\"Y\"))","v":""},null,null,null,null,null,null,null,null,null,null,null,null,null,null,null,null,null,null,{"$f":"IF(B68=\"\",\"\",(H68*$A$122)+(J68*$A$106)+(K68*$A$107)+(L68*$A$108)+(M68*$A$111)+(N68*$A$112)+(O68*$A$109)+(P68*$A$110)+(Q68*$A$113)+(R68*$A$114)+(S68*$A$116)+(T68*$A$115)+(U68*$A$117)+(V68*$A$118)+(W68*$A$119)+(X68*$A$120)+(Y68*$A$121))","v":""},{"$f":"IF(D68=\"\",\"\",\"Alter: \"&DATEDIF(D68,TODAY(),\"y\")&\" Jahre \"&DATEDIF(D68,TODAY(),\"ym\")&\" Monate \"&DAY(TODAY())-DAY(D68)+(DAY(D68)>DAY(TODAY()))*DAY(DATE(YEAR(D68),MONTH(D68)+1,))&\" Tage\")","v":""}]
[67,null,"Keine Teilnahme",{"$f":"IF(B69=\"\",\"\",VLOOKUP(B69,Mitgliederliste!A:B,2,0))","v":""},"","","",null,null,null,null,null,null,null,null,null,null,null,null,null,null,null,null,null,null,"",""]
[68,null,"Keine Teilnahme",{"$f":"IF(B70=\"\",\"\",VLOOKUP(B70,Mitgliederliste!A:B,2,0))","v":""},"","","",null,null,null,null,null,null,null,null,null,null,null,null,null,null,null,null,null,null,"",""]
[69,null,"Keine Teilnahme",{"$f":"IF(B71=\"\",\"\",VLOOKUP(B71,Mitgliederliste!A:B,2,0))","v":""},"","","",null,null,null,null,null,null,null,null,null,null,null,null,null,null,null,null,null,null,"",""]
[70,null,"Keine Teilnahme",{"$f":"IF(B72=\"\",\"\",VLOOKUP(B72,Mitgliederliste!A:B,2,0))","v":""},"","","",null,null,null,null,null,null,null,null,null,null,null,null,null,null,null,null,null,null,"",""]
[71,null,"Keine Teilnahme",{"$f":"IF(B73=\"\",\"\",VLOOKUP(B73,Mitgliederliste!A:B,2,0))","v":""},"","","",null,null,null,null,null,null,null,null,null,null,null,null,null,null,null,null,null,null,"",""]
[72,null,"Keine Teilnahme",{"$f":"IF(B74=\"\",\"\",VLOOKUP(B74,Mitgliederliste!A:B,2,0))","v":""},"","","",null,null,null,null,null,null,null,null,null,null,null,null,null,null,null,null,null,null,"",""]
[73,null,"Keine Teilnahme",{"$f":"IF(B75=\"\",\"\",VLOOKUP(B75,Mitgliederliste!A:B,2,0))","v":""},"","","",null,null,null,null,null,null,null,null,null,null,null,null,null,null,null,null,null,null,"",""]
[74,null,"Keine Teilnahme",{"$f":"IF(B76=\"\",\"\",VLOOKUP(B76,Mitgliederliste!A:B,2,0))","v":""},"","","",null,null,null,null,null,null,null,null,null,null,null,null,null,null,null,null,null,null,"",""]
[75,null,"Keine Teilnahme",{"$f":"IF(B77=\"\",\"\",VLOOKUP(B77,Mitgliederliste!A:B,2,0))","v":""},"","","",null,null,null,null,null,null,null,null,null,null,null,null,null,null,null,null,null,null,"",""]
[76,null,"Keine Teilnahme",{"$f":"IF(B78=\"\",\"\",VLOOKUP(B78,Mitgliederliste!A:B,2,0))","v":""},"","","",null,null,null,null,null,null,null,null,null,null,null,null,null,null,null,null,null,null,"",""]
[77,null,"Keine Teilnahme",{"$f":"IF(B79=\"\",\"\",VLOOKUP(B79,Mitgliederliste!A:B,2,0))","v":""},"","","",null,null,null,null,null,null,null,null,null,null,null,null,null,null,null,null,null,null,"",""]
[78,null,"Keine Teilnahme",{"$f":"IF(B80=\"\",\"\",VLOOKUP(B80,Mitgliederliste!A:B,2,0))","v":""},"","","",null,null,null,null,null,null,null,null,null,null,null,null,null,null,null,null,null,null,"",""]
[79,null,"Keine Teilnahme",{"$f":"IF(B81=\"\",\"\",VLOOKUP(B81,Mitgliederliste!A:B,2,0))","v":""},"","","",null,null,null,null,null,null,null,null,null,null,null,null,null,null,null,null,null,null,"",""]
[80,null,"Keine Teilnahme",{"$f":"IF(B82=\"\",\"\",VLOOKUP(B82,Mitgliederliste!A:B,2,0))","v":""},"","","",null,null,null,null,null,null,null,null,null,null,null,null,null,null,null,null,null,null,"",""]
[81,null,"Keine Teilnahme",{"$f":"IF(B83=\"\",\"\",VLOOKUP(B83,Mitgliederliste!A:B,2,0))","v":""},"","","",null,null,null,null,null,null,null,null,null,null,null,null,null,null,null,null,null,null,"",""]
[82,null,"Keine Teilnahme",{"$f":"IF(B84=\"\",\"\",VLOOKUP(B84,Mitgliederliste!A:B,2,0))","v":""},"","","",null,null,null,null,null,null,null,null,null,null,null,null,null,null,null,null,null,null,"",""]
[83,null,"Keine Teilnahme",{"$f":"IF(B85=\"\",\"\",VLOOKUP(B85,Mitgliederliste!A:B,2,0))","v":""},"","","",null,null,null,null,null,null,null,null,null,null,null,null,null,null,null,null,null,null,"",""]
[84,null,"Keine Teilnahme",{"$f":"IF(B86=\"\",\"\",VLOOKUP(B86,Mitgliederliste!A:B,2,0))","v":""},"","","",null,null,null,null,null,null,null,null,null,null,null,null,null,null,null,null,null,null,"",""]
[85,null,"Keine Teilnahme",{"$f":"IF(B87=\"\",\"\",VLOOKUP(B87,Mitgliederliste!A:B,2,0))","v":""},"","","",null,null,null,null,null,null,null,null,null,null,null,null,null,null,null,null,null,null,"",""]
[86,null,"Keine Teilnahme",{"$f":"IF(B88=\"\",\"\",VLOOKUP(B88,Mitgliederliste!A:B,2,0))","v":""},"","","",null,null,null,null,null,null,null,null,null,null,null,null,null,null,null,null,null,null,"",""]
[87,null,"Keine Teilnahme",{"$f":"IF(B89=\"\",\"\",VLOOKUP(B89,Mitgliederliste!A:B,2,0))","v":""},"","","",null,null,null,null,null,null,null,null,null,null,null,null,null,null,null,null,null,null,"",""]
[88,null,"Keine Teilnahme",{"$f":"IF(B90=\"\",\"\",VLOOKUP(B90,Mitgliederliste!A:B,2,0))","v":""},"","","",null,null,null,null,null,null,null,null,null,null,null,null,null,null,null,null,null,null,"",""]
[89,null,"Keine Teilnahme",{"$f":"IF(B91=\"\",\"\",VLOOKUP(B91,Mitgliederliste!A:B,2,0))","v":""},"","","",null,null,null,null,null,null,null,null,null,null,null,null,null,null,null,null,null,null,"",""]
[90,null,"Keine Teilnahme",{"$f":"IF(B92=\"\",\"\",VLOOKUP(B92,Mitgliederliste!A:B,2,0))","v":""},"","","",null,null,null,null,null,null,null,null,null,null,null,null,null,null,null,null,null,null,"",""]
[91,null,"Keine Teilnahme",{"$f":"IF(B93=\"\",\"\",VLOOKUP(B93,Mitgliederliste!A:B,2,0))","v":""},"","","",null,null,null,null,null,null,null,null,null,null,null,null,null,null,null,null,null,null,"",""]
[92,null,"Keine Teilnahme",{"$f":"IF(B94=\"\",\"\",VLOOKUP(B94,Mitgliederliste!A:B,2,0))","v":""},"","","",null,null,null,null,null,null,null,null,null,null,null,null,null,null,null,null,null,null,"",""]
[93,null,"Keine Teilnahme",{"$f":"IF(B95=\"\",\"\",VLOOKUP(B95,Mitgliederliste!A:B,2,0))","v":""},"","","",null,null,null,null,null,null,null,null,null,null,null,null,null,null,null,null,null,null,"",""]
[94,null,"Keine Teilnahme",{"$f":"IF(B96=\"\",\"\",VLOOKUP(B96,Mitgliederliste!A:B,2,0))","v":""},"","","",null,null,null,null,null,null,null,null,null,null,null,null,null,null,null,null,null,null,"",""]
[95,null,"Keine Teilnahme",{"$f":"IF(B97=\"\",\"\",VLOOKUP(B97,Mitgliederliste!A:B,2,0))","v":""},"","","",null,null,null,null,null,null,null,null,null,null,null,null,null,null,null,null,null,null,"",""]
[96,null,"Keine Teilnahme",{"$f":"IF(B98=\"\",\"\",VLOOKUP(B98,Mitgliederliste!A:B,2,0))","v":""},"","","",null,null,null,null,null,null,null,null,null,null,null,null,null,null,null,null,null,null,"",""]
[97,null,"Keine Teilnahme",{"$f":"IF(B99=\"\",\"\",VLOOKUP(B99,Mitgliederliste!A:B,2,0))","v":""},"","","",null,null,null,null,null,null,null,null,null,null,null,null,null,null,null,null,null,null,"",""]
[98,null,"Keine Teilnahme",{"$f":"IF(B100=\"\",\"\",VLOOKUP(B100,Mitgliederliste!A:B,2,0))","v":""},"","","",null,null,null,null,null,null,null,null,null,null,null,null,null,null,null,null,null,null,"",""]
[99,null,"Keine Teilnahme",{"$f":"IF(B101=\"\",\"\",VLOOKUP(B101,Mitgliederliste!A:B,2,0))","v":""},"","","",null,null,null,null,null,null,null,null,null,null,null,null,null,null,null,null,null,null,"",""]
[100,null,"Keine Teilnahme",{"$f":"IF(B102=\"\",\"\",VLOOKUP(B102,Mitgliederliste!A:B,2,0))","v":""},"","","",null,null,null,null,null,null,null,null,null,null,null,null,null,null,null,null,null,null,{"$f":"IF(B102=\"\",\"\",(H102*$A$122)+(J102*$A$106)+(K102*$A$107)+(L102*$A$108)+(M102*$A$111)+(N102*$A$112)+(O102*$A$109)+(P102*$A$110)+(Q102*$A$113)+(R102*$A$114)+(S102*$A$116)+(T102*$A$115)+(U102*$A$117)+(V102*$A$118)+(W102*$A$119)+(X102*$A$120)+(Y102*$A$121))","v":""},""]
["Anzahl gelöst: ",null,null,null,null,null,null,{"$f":"IF(SUM(H3:H102)=0,\"\",SUM(H3:H102))","v":""},{"$f":"IF(SUM(I3:I102)=0,\"\",SUM(I3:I102))","v":""},"","","","","","","","","","","","","","","",""]
[null,null,null,null,null,null,null,null,null,null,null,null,null,null,null,null,null,null,null,null,null,"gesamt Summe: ",null,null,null,{"$f":"IF(SUM(Z3:Z102)=0,\"\",SUM(Z3:Z102))","v":""}]
["Preise für VM schießen",null,null,null,null,null,null,null,null,null,null,null,60,null,"vom Preisgeld \"KK\"",null,null,null,null,{"$f":"IF($Z$105=\"\",\"\",$Z$105*$M$105/100)","v":""},null,"Einnahme Preisgeld KK: ",null,null,null,{"$f":"IF(J103=\"\",\"\",J103*$A$106+K103*$A$107)","v":""}]
[8,"Preisschießen KK Satz",null,null,null,null,null,null,null,null,null,null,"Teilnehmer Preisschießen KK: ",null,null,null,null,null,null,{"$f":"IF(COUNTA(J3:J102)=0,\"\",COUNTA(J3:J102))","v":""},null,"Einnahme Preisgeld LG: ",null,null,null,{"$f":"IF(L103=\"\",\"\",L103*$A$108)","v":""}]
[1,"Preisschießen KK - nachgelöst",null,null,null,null,null,null,null,null,null,null,null,null,null,null,null,null,null,null,null,"Einnahme Munition: ",null,null,null,{"$f":"IF(H103=\"\",\"\",H103*$A$122)","v":""}]
[3,"Preisschießen LG (Satz)",null,null,null,null,null,null,null,null,null,null,60,null,"vom Preisgeld \"LG\"",null,null,null,null,{"$f":"IF($Z$106=\"\",\"\",$Z$106*$M$108/100)","v":""},null,"Einnahme VM: ",null,null,null,{"$f":"IF(Z104=\"\",\"\",Z104-SUM(Z105:Z106))","v":""}]
[0,"LG-Auflage - Schüler",null,null,null,null,null,null,null,null,null,null,"Teilnehmer Preisschießen LG: ",null,null,null,null,null,null,{"$f":"IF(COUNTA(L3:L102)=0,\"\",COUNTA(L3:L102))","v":""},null,"Gewinn: ",null,null,null,{"$f":"IF(Z104=\"\",\"\",Z104-SUM(T105,T108))","v":""}," (gesamt Summe minus Preisgeld KK und LG)"]
[0,"LG-Freihand - Schüler"]
[2.5,"LG-Auflage"]
[2,"LG-Auflage - ermäßigt -",null,null,null,null,null,null,null,null,null,null,"Anzahl aller Teilnehmer: ",null,null,null,null,null,null,{"$f":"IF(COUNTA(B3:B102)=0,\"\",COUNTA(B3:B102))","v":""}]
[2.5,"LG-Freihand"]
[2,"LG-Freihand - ermäßigt -"]
[2.5,"Luftpistole"]
[0,"Luftpistole - Schüler"]
[2,"Luftpistole - ermäßigt -"]
[2.5,"KK-Auflage"]
[2,"KK-Auflage - ermäßigt -"]
[2.5,"KK-Freihand"]
[2,"KK-Freihand - ermäßigt -"]
[6,"Munition RWS"]

{"sheet":"Preisschießen KK","index":2,"n_rows":102,"n_cols":10,"rows_kept":102,"cut":false,"hidden":false,"merged":[[0,3,0,5]]}
[null,null,null,"Preisschießen KK"]
[null,null,null,"Nr.:","Name:","Teiler:"]
[null,null,1,null,{"$f":"IF(D3=\"\",\"\",VLOOKUP(D3,Teilnehmer!$A$2:$C$102,2))","v":""},null,null,null,null,"Formel E3: =WENN(D3=\"\";\"\";SVERWEIS(D3;Teilnehmer!$A$2:$C$102;2))"]
[null,null,2,null,{"$f":"IF(D4=\"\",\"\",VLOOKUP(D4,Teilnehmer!$A$2:$C$102,2))","v":""}]
[null,null,3,null,{"$f":"IF(D5=\"\",\"\",VLOOKUP(D5,Teilnehmer!$A$2:$C$102,2))","v":""}]
[null,null,4,null,{"$f":"IF(D6=\"\",\"\",VLOOKUP(D6,Teilnehmer!$A$2:$C$102,2))","v":""}]
[null,null,5,null,{"$f":"IF(D7=\"\",\"\",VLOOKUP(D7,Teilnehmer!$A$2:$C$102,2))","v":""}]
[null,null,6,null,{"$f":"IF(D8=\"\",\"\",VLOOKUP(D8,Teilnehmer!$A$2:$C$102,2))","v":""}]
[null,null,7,null,{"$f":"IF(D9=\"\",\"\",VLOOKUP(D9,Teilnehmer!$A$2:$C$102,2))","v":""}]
[null,null,8,null,{"$f":"IF(D10=\"\",\"\",VLOOKUP(D10,Teilnehmer!$A$2:$C$102,2))","v":""}]
[null,null,9,null,{"$f":"IF(D11=\"\",\"\",VLOOKUP(D11,Teilnehmer!$A$2:$C$102,2))","v":""}]
[null,null,10,null,{"$f":"IF(D12=\"\",\"\",VLOOKUP(D12,Teilnehmer!$A$2:$C$102,2))","v":""}]
[null,null,11,null,{"$f":"IF(D13=\"\",\"\",VLOOKUP(D13,Teilnehmer!$A$2:$C$102,2))","v":""}]
[null,null,12,null,{"$f":"IF(D14=\"\",\"\",VLOOKUP(D14,Teilnehmer!$A$2:$C$102,2))","v":""}]
[null,null,13,null,{"$f":"IF(D15=\"\",\"\",VLOOKUP(D15,Teilnehmer!$A$2:$C$102,2))","v":""}]
[null,null,14,null,{"$f":"IF(D16=\"\",\"\",VLOOKUP(D16,Teilnehmer!$A$2:$C$102,2))","v":""}]
[null,null,15,null,{"$f":"IF(D17=\"\",\"\",VLOOKUP(D17,Teilnehmer!$A$2:$C$102,2))","v":""}]
[null,null,16,null,{"$f":"IF(D18=\"\",\"\",VLOOKUP(D18,Teilnehmer!$A$2:$C$102,2))","v":""}]
[null,null,17,null,{"$f":"IF(D19=\"\",\"\",VLOOKUP(D19,Teilnehmer!$A$2:$C$102,2))","v":""}]
[null,null,18,null,{"$f":"IF(D20=\"\",\"\",VLOOKUP(D20,Teilnehmer!$A$2:$C$102,2))","v":""}]
[null,null,19,null,{"$f":"IF(D21=\"\",\"\",VLOOKUP(D21,Teilnehmer!$A$2:$C$102,2))","v":""}]
[null,null,20,null,{"$f":"IF(D22=\"\",\"\",VLOOKUP(D22,Teilnehmer!$A$2:$C$102,2))","v":""}]
[null,null,21,null,{"$f":"IF(D23=\"\",\"\",VLOOKUP(D23,Teilnehmer!$A$2:$C$102,2))","v":""}]
[null,null,22,null,{"$f":"IF(D24=\"\",\"\",VLOOKUP(D24,Teilnehmer!$A$2:$C$102,2))","v":""}]
[null,null,23,null,{"$f":"IF(D25=\"\",\"\",VLOOKUP(D25,Teilnehmer!$A$2:$C$102,2))","v":""}]
[null,null,24,null,{"$f":"IF(D26=\"\",\"\",VLOOKUP(D26,Teilnehmer!$A$2:$C$102,2))","v":""}]
[null,null,25,null,{"$f":"IF(D27=\"\",\"\",VLOOKUP(D27,Teilnehmer!$A$2:$C$102,2))","v":""}]
[null,null,26,null,{"$f":"IF(D28=\"\",\"\",VLOOKUP(D28,Teilnehmer!$A$2:$C$102,2))","v":""}]
[null,null,27,null,{"$f":"IF(D29=\"\",\"\",VLOOKUP(D29,Teilnehmer!$A$2:$C$102,2))","v":""}]
[null,null,28,null,{"$f":"IF(D30=\"\",\"\",VLOOKUP(D30,Teilnehmer!$A$2:$C$102,2))","v":""}]
[null,null,29,null,{"$f":"IF(D31=\"\",\"\",VLOOKUP(D31,Teilnehmer!$A$2:$C$102,2))","v":""}]
[null,null,30,null,{"$f":"IF(D32=\"\",\"\",VLOOKUP(D32,Teilnehmer!$A$2:$C$102,2))","v":""}]
[null,null,31,null,{"$f":"IF(D33=\"\",\"\",VLOOKUP(D33,Teilnehmer!$A$2:$C$102,2))","v":""}]
[null,null,32,null,{"$f":"IF(D34=\"\",\"\",VLOOKUP(D34,Teilnehmer!$A$2:$C$102,2))","v":""}]
[null,null,33,null,{"$f":"IF(D35=\"\",\"\",VLOOKUP(D35,Teilnehmer!$A$2:$C$102,2))","v":""}]
[null,null,34,null,{"$f":"IF(D36=\"\",\"\",VLOOKUP(D36,Teilnehmer!$A$2:$C$102,2))","v":""}]
[null,null,35,null,{"$f":"IF(D37=\"\",\"\",VLOOKUP(D37,Teilnehmer!$A$2:$C$102,2))","v":""}]
[null,null,36,null,{"$f":"IF(D38=\"\",\"\",VLOOKUP(D38,Teilnehmer!$A$2:$C$102,2))","v":""}]
[null,null,37,null,{"$f":"IF(D39=\"\",\"\",VLOOKUP(D39,Teilnehmer!$A$2:$C$102,2))","v":""}]
[null,null,38,null,{"$f":"IF(D40=\"\",\"\",VLOOKUP(D40,Teilnehmer!$A$2:$C$102,2))","v":""}]
[null,null,39,null,{"$f":"IF(D41=\"\",\"\",VLOOKUP(D41,Teilnehmer!$A$2:$C$102,2))","v":""}]
[null,null,40,null,{"$f":"IF(D42=\"\",\"\",VLOOKUP(D42,Teilnehmer!$A$2:$C$102,2))","v":""}]
[null,null,41,null,{"$f":"IF(D43=\"\",\"\",VLOOKUP(D43,Teilnehmer!$A$2:$C$102,2))","v":""}]
[null,null,42,null,{"$f":"IF(D44=\"\",\"\",VLOOKUP(D44,Teilnehmer!$A$2:$C$102,2))","v":""}]
[null,null,43,null,{"$f":"IF(D45=\"\",\"\",VLOOKUP(D45,Teilnehmer!$A$2:$C$102,2))","v":""}]
[null,null,44,null,{"$f":"IF(D46=\"\",\"\",VLOOKUP(D46,Teilnehmer!$A$2:$C$102,2))","v":""}]
[null,null,45,null,{"$f":"IF(D47=\"\",\"\",VLOOKUP(D47,Teilnehmer!$A$2:$C$102,2))","v":""}]
[null,null,46,null,{"$f":"IF(D48=\"\",\"\",VLOOKUP(D48,Teilnehmer!$A$2:$C$102,2))","v":""}]
[null,null,47,null,{"$f":"IF(D49=\"\",\"\",VLOOKUP(D49,Teilnehmer!$A$2:$C$102,2))","v":""}]
[null,null,48,null,{"$f":"IF(D50=\"\",\"\",VLOOKUP(D50,Teilnehmer!$A$2:$C$102,2))","v":""}]
[null,null,49,null,{"$f":"IF(D51=\"\",\"\",VLOOKUP(D51,Teilnehmer!$A$2:$C$102,2))","v":""}]
[null,null,50,null,{"$f":"IF(D52=\"\",\"\",VLOOKUP(D52,Teilnehmer!$A$2:$C$102,2))","v":""}]
[null,null,51,null,{"$f":"IF(D53=\"\",\"\",VLOOKUP(D53,Teilnehmer!$A$2:$C$102,2))","v":""}]
[null,null,52,null,{"$f":"IF(D54=\"\",\"\",VLOOKUP(D54,Teilnehmer!$A$2:$C$102,2))","v":""}]
[null,null,53,null,{"$f":"IF(D55=\"\",\"\",VLOOKUP(D55,Teilnehmer!$A$2:$C$102,2))","v":""}]
[null,null,54,null,{"$f":"IF(D56=\"\",\"\",VLOOKUP(D56,Teilnehmer!$A$2:$C$102,2))","v":""}]
[null,null,55,null,{"$f":"IF(D57=\"\",\"\",VLOOKUP(D57,Teilnehmer!$A$2:$C$102,2))","v":""}]
[null,null,56,null,{"$f":"IF(D58=\"\",\"\",VLOOKUP(D58,Teilnehmer!$A$2:$C$102,2))","v":""}]
[null,null,57,null,{"$f":"IF(D59=\"\",\"\",VLOOKUP(D59,Teilnehmer!$A$2:$C$102,2))","v":""}]
[null,null,58,null,{"$f":"IF(D60=\"\",\"\",VLOOKUP(D60,Teilnehmer!$A$2:$C$102,2))","v":""}]
[null,null,59,null,{"$f":"IF(D61=\"\",\"\",VLOOKUP(D61,Teilnehmer!$A$2:$C$102,2))","v":""}]
[null,null,60,null,{"$f":"IF(D62=\"\",\"\",VLOOKUP(D62,Teilnehmer!$A$2:$C$102,2))","v":""}]
[null,null,61,null,{"$f":"IF(D63=\"\",\"\",VLOOKUP(D63,Teilnehmer!$A$2:$C$102,2))","v":""}]
[null,null,62,null,{"$f":"IF(D64=\"\",\"\",VLOOKUP(D64,Teilnehmer!$A$2:$C$102,2))","v":""}]
[null,null,63,null,{"$f":"IF(D65=\"\",\"\",VLOOKUP(D65,Teilnehmer!$A$2:$C$102,2))","v":""}]
[null,null,64,null,{"$f":"IF(D66=\"\",\"\",VLOOKUP(D66,Teilnehmer!$A$2:$C$102,2))","v":""}]
[null,null,65,null,{"$f":"IF(D67=\"\",\"\",VLOOKUP(D67,Teilnehmer!$A$2:$C$102,2))","v":""}]
[null,null,66,null,{"$f":"IF(D68=\"\",\"\",VLOOKUP(D68,Teilnehmer!$A$2:$C$102,2))","v":""}]
[null,null,67,null,{"$f":"IF(D69=\"\",\"\",VLOOKUP(D69,Teilnehmer!$A$2:$C$102,2))","v":""}]
[null,null,68,null,{"$f":"IF(D70=\"\",\"\",VLOOKUP(D70,Teilnehmer!$A$2:$C$102,2))","v":""}]
[null,null,69,null,{"$f":"IF(D71=\"\",\"\",VLOOKUP(D71,Teilnehmer!$A$2:$C$102,2))","v":""}]
[null,null,70,null,{"$f":"IF(D72=\"\",\"\",VLOOKUP(D72,Teilnehmer!$A$2:$C$102,2))","v":""}]
[null,null,71,null,{"$f":"IF(D73=\"\",\"\",VLOOKUP(D73,Teilnehmer!$A$2:$C$102,2))","v":""}]
[null,null,72,null,{"$f":"IF(D74=\"\",\"\",VLOOKUP(D74,Teilnehmer!$A$2:$C$102,2))","v":""}]
[null,null,73,null,{"$f":"IF(D75=\"\",\"\",VLOOKUP(D75,Teilnehmer!$A$2:$C$102,2))","v":""}]
[null,null,74,null,{"$f":"IF(D76=\"\",\"\",VLOOKUP(D76,Teilnehmer!$A$2:$C$102,2))","v":""}]
[null,null,75,null,{"$f":"IF(D77=\"\",\"\",VLOOKUP(D77,Teilnehmer!$A$2:$C$102,2))","v":""}]
[null,null,76,null,{"$f":"IF(D78=\"\",\"\",VLOOKUP(D78,Teilnehmer!$A$2:$C$102,2))","v":""}]
[null,null,77,null,{"$f":"IF(D79=\"\",\"\",VLOOKUP(D79,Teilnehmer!$A$2:$C$102,2))","v":""}]
[null,null,78,null,{"$f":"IF(D80=\"\",\"\",VLOOKUP(D80,Teilnehmer!$A$2:$C$102,2))","v":""}]
[null,null,79,null,{"$f":"IF(D81=\"\",\"\",VLOOKUP(D81,Teilnehmer!$A$2:$C$102,2))","v":""}]
[null,null,80,null,{"$f":"IF(D82=\"\",\"\",VLOOKUP(D82,Teilnehmer!$A$2:$C$102,2))","v":""}]
[null,null,81,null,{"$f":"IF(D83=\"\",\"\",VLOOKUP(D83,Teilnehmer!$A$2:$C$102,2))","v":""}]
[null,null,82,null,{"$f":"IF(D84=\"\",\"\",VLOOKUP(D84,Teilnehmer!$A$2:$C$102,2))","v":""}]
[null,null,83,null,{"$f":"IF(D85=\"\",\"\",VLOOKUP(D85,Teilnehmer!$A$2:$C$102,2))","v":""}]
[null,null,84,null,{"$f":"IF(D86=\"\",\"\",VLOOKUP(D86,Teilnehmer!$A$2:$C$102,2))","v":""}]
[null,null,85,null,{"$f":"IF(D87=\"\",\"\",VLOOKUP(D87,Teilnehmer!$A$2:$C$102,2))","v":""}]
[null,null,86,null,{"$f":"IF(D88=\"\",\"\",VLOOKUP(D88,Teilnehmer!$A$2:$C$102,2))","v":""}]
[null,null,87,null,{"$f":"IF(D89=\"\",\"\",VLOOKUP(D89,Teilnehmer!$A$2:$C$102,2))","v":""}]
[null,null,88,null,{"$f":"IF(D90=\"\",\"\",VLOOKUP(D90,Teilnehmer!$A$2:$C$102,2))","v":""}]
[null,null,89,null,{"$f":"IF(D91=\"\",\"\",VLOOKUP(D91,Teilnehmer!$A$2:$C$102,2))","v":""}]
[null,null,90,null,{"$f":"IF(D92=\"\",\"\",VLOOKUP(D92,Teilnehmer!$A$2:$C$102,2))","v":""}]
[null,null,91,null,{"$f":"IF(D93=\"\",\"\",VLOOKUP(D93,Teilnehmer!$A$2:$C$102,2))","v":""}]
[null,null,92,null,{"$f":"IF(D94=\"\",\"\",VLOOKUP(D94,Teilnehmer!$A$2:$C$102,2))","v":""}]
[null,null,93,null,{"$f":"IF(D95=\"\",\"\",VLOOKUP(D95,Teilnehmer!$A$2:$C$102,2))","v":""}]
[null,null,94,null,{"$f":"IF(D96=\"\",\"\",VLOOKUP(D96,Teilnehmer!$A$2:$C$102,2))","v":""}]
[null,null,95,null,{"$f":"IF(D97=\"\",\"\",VLOOKUP(D97,Teilnehmer!$A$2:$C$102,2))","v":""}]
[null,null,96,null,{"$f":"IF(D98=\"\",\"\",VLOOKUP(D98,Teilnehmer!$A$2:$C$102,2))","v":""}]
[null,null,97,null,{"$f":"IF(D99=\"\",\"\",VLOOKUP(D99,Teilnehmer!$A$2:$C$102,2))","v":""}]
[null,null,98,null,{"$f":"IF(D100=\"\",\"\",VLOOKUP(D100,Teilnehmer!$A$2:$C$102,2))","v":""}]
[null,null,99,null,{"$f":"IF(D101=\"\",\"\",VLOOKUP(D101,Teilnehmer!$A$2:$C$102,2))","v":""}]
[null,null,100,null,{"$f":"IF(D102=\"\",\"\",VLOOKUP(D102,Teilnehmer!$A$2:$C$102,2))","v":""}]

{"sheet":"Preisschießen LG","index":3,"n_rows":102,"n_cols":10,"rows_kept":102,"cut":false,"hidden":false,"merged":[[0,3,0,5]]}
[null,null,null,"Preisschießen LG"]
[null,null,null,"Nr.:","Name:","Teiler:"]
[null,null,1,null,{"$f":"IF(D3=\"\",\"\",VLOOKUP(D3,Teilnehmer!$A$2:$C$102,2))","v":""},null,null,null,null,"Formel E3: =WENN(D3=\"\";\"\";SVERWEIS(D3;Teilnehmer!$A$2:$C$102;2))"]
[null,null,2,null,{"$f":"IF(D4=\"\",\"\",VLOOKUP(D4,Teilnehmer!$A$2:$C$102,2))","v":""}]
[null,null,3,null,{"$f":"IF(D5=\"\",\"\",VLOOKUP(D5,Teilnehmer!$A$2:$C$102,2))","v":""}]
[null,null,4,null,{"$f":"IF(D6=\"\",\"\",VLOOKUP(D6,Teilnehmer!$A$2:$C$102,2))","v":""}]
[null,null,5,null,{"$f":"IF(D7=\"\",\"\",VLOOKUP(D7,Teilnehmer!$A$2:$C$102,2))","v":""}]
[null,null,6,null,{"$f":"IF(D8=\"\",\"\",VLOOKUP(D8,Teilnehmer!$A$2:$C$102,2))","v":""}]
[null,null,7,null,{"$f":"IF(D9=\"\",\"\",VLOOKUP(D9,Teilnehmer!$A$2:$C$102,2))","v":""}]
[null,null,8,null,{"$f":"IF(D10=\"\",\"\",VLOOKUP(D10,Teilnehmer!$A$2:$C$102,2))","v":""}]
[null,null,9,null,{"$f":"IF(D11=\"\",\"\",VLOOKUP(D11,Teilnehmer!$A$2:$C$102,2))","v":""}]
[null,null,10,null,{"$f":"IF(D12=\"\",\"\",VLOOKUP(D12,Teilnehmer!$A$2:$C$102,2))","v":""}]
[null,null,11,null,{"$f":"IF(D13=\"\",\"\",VLOOKUP(D13,Teilnehmer!$A$2:$C$102,2))","v":""}]
[null,null,12,null,{"$f":"IF(D14=\"\",\"\",VLOOKUP(D14,Teilnehmer!$A$2:$C$102,2))","v":""}]
[null,null,13,null,{"$f":"IF(D15=\"\",\"\",VLOOKUP(D15,Teilnehmer!$A$2:$C$102,2))","v":""}]
[null,null,14,null,{"$f":"IF(D16=\"\",\"\",VLOOKUP(D16,Teilnehmer!$A$2:$C$102,2))","v":""}]
[null,null,15,null,{"$f":"IF(D17=\"\",\"\",VLOOKUP(D17,Teilnehmer!$A$2:$C$102,2))","v":""}]
[null,null,16,null,{"$f":"IF(D18=\"\",\"\",VLOOKUP(D18,Teilnehmer!$A$2:$C$102,2))","v":""}]
[null,null,17,null,{"$f":"IF(D19=\"\",\"\",VLOOKUP(D19,Teilnehmer!$A$2:$C$102,2))","v":""}]
[null,null,18,null,{"$f":"IF(D20=\"\",\"\",VLOOKUP(D20,Teilnehmer!$A$2:$C$102,2))","v":""}]
[null,null,19,null,{"$f":"IF(D21=\"\",\"\",VLOOKUP(D21,Teilnehmer!$A$2:$C$102,2))","v":""}]
[null,null,20,null,{"$f":"IF(D22=\"\",\"\",VLOOKUP(D22,Teilnehmer!$A$2:$C$102,2))","v":""}]
[null,null,21,null,{"$f":"IF(D23=\"\",\"\",VLOOKUP(D23,Teilnehmer!$A$2:$C$102,2))","v":""}]
[null,null,22,null,{"$f":"IF(D24=\"\",\"\",VLOOKUP(D24,Teilnehmer!$A$2:$C$102,2))","v":""}]
[null,null,23,null,{"$f":"IF(D25=\"\",\"\",VLOOKUP(D25,Teilnehmer!$A$2:$C$102,2))","v":""}]
[null,null,24,null,{"$f":"IF(D26=\"\",\"\",VLOOKUP(D26,Teilnehmer!$A$2:$C$102,2))","v":""}]
[null,null,25,null,{"$f":"IF(D27=\"\",\"\",VLOOKUP(D27,Teilnehmer!$A$2:$C$102,2))","v":""}]
[null,null,26,null,{"$f":"IF(D28=\"\",\"\",VLOOKUP(D28,Teilnehmer!$A$2:$C$102,2))","v":""}]
[null,null,27,null,{"$f":"IF(D29=\"\",\"\",VLOOKUP(D29,Teilnehmer!$A$2:$C$102,2))","v":""}]
[null,null,28,null,{"$f":"IF(D30=\"\",\"\",VLOOKUP(D30,Teilnehmer!$A$2:$C$102,2))","v":""}]
[null,null,29,null,{"$f":"IF(D31=\"\",\"\",VLOOKUP(D31,Teilnehmer!$A$2:$C$102,2))","v":""}]
[null,null,30,null,{"$f":"IF(D32=\"\",\"\",VLOOKUP(D32,Teilnehmer!$A$2:$C$102,2))","v":""}]
[null,null,31,null,{"$f":"IF(D33=\"\",\"\",VLOOKUP(D33,Teilnehmer!$A$2:$C$102,2))","v":""}]
[null,null,32,null,{"$f":"IF(D34=\"\",\"\",VLOOKUP(D34,Teilnehmer!$A$2:$C$102,2))","v":""}]
[null,null,33,null,{"$f":"IF(D35=\"\",\"\",VLOOKUP(D35,Teilnehmer!$A$2:$C$102,2))","v":""}]
[null,null,34,null,{"$f":"IF(D36=\"\",\"\",VLOOKUP(D36,Teilnehmer!$A$2:$C$102,2))","v":""}]
[null,null,35,null,{"$f":"IF(D37=\"\",\"\",VLOOKUP(D37,Teilnehmer!$A$2:$C$102,2))","v":""}]
[null,null,36,null,{"$f":"IF(D38=\"\",\"\",VLOOKUP(D38,Teilnehmer!$A$2:$C$102,2))","v":""}]
[null,null,37,null,{"$f":"IF(D39=\"\",\"\",VLOOKUP(D39,Teilnehmer!$A$2:$C$102,2))","v":""}]
[null,null,38,null,{"$f":"IF(D40=\"\",\"\",VLOOKUP(D40,Teilnehmer!$A$2:$C$102,2))","v":""}]
[null,null,39,null,{"$f":"IF(D41=\"\",\"\",VLOOKUP(D41,Teilnehmer!$A$2:$C$102,2))","v":""}]
[null,null,40,null,{"$f":"IF(D42=\"\",\"\",VLOOKUP(D42,Teilnehmer!$A$2:$C$102,2))","v":""}]
[null,null,41,null,{"$f":"IF(D43=\"\",\"\",VLOOKUP(D43,Teilnehmer!$A$2:$C$102,2))","v":""}]
[null,null,42,null,{"$f":"IF(D44=\"\",\"\",VLOOKUP(D44,Teilnehmer!$A$2:$C$102,2))","v":""}]
[null,null,43,null,{"$f":"IF(D45=\"\",\"\",VLOOKUP(D45,Teilnehmer!$A$2:$C$102,2))","v":""}]
[null,null,44,null,{"$f":"IF(D46=\"\",\"\",VLOOKUP(D46,Teilnehmer!$A$2:$C$102,2))","v":""}]
[null,null,45,null,{"$f":"IF(D47=\"\",\"\",VLOOKUP(D47,Teilnehmer!$A$2:$C$102,2))","v":""}]
[null,null,46,null,{"$f":"IF(D48=\"\",\"\",VLOOKUP(D48,Teilnehmer!$A$2:$C$102,2))","v":""}]
[null,null,47,null,{"$f":"IF(D49=\"\",\"\",VLOOKUP(D49,Teilnehmer!$A$2:$C$102,2))","v":""}]
[null,null,48,null,{"$f":"IF(D50=\"\",\"\",VLOOKUP(D50,Teilnehmer!$A$2:$C$102,2))","v":""}]
[null,null,49,null,{"$f":"IF(D51=\"\",\"\",VLOOKUP(D51,Teilnehmer!$A$2:$C$102,2))","v":""}]
[null,null,50,null,{"$f":"IF(D52=\"\",\"\",VLOOKUP(D52,Teilnehmer!$A$2:$C$102,2))","v":""}]
[null,null,51,null,{"$f":"IF(D53=\"\",\"\",VLOOKUP(D53,Teilnehmer!$A$2:$C$102,2))","v":""}]
[null,null,52,null,{"$f":"IF(D54=\"\",\"\",VLOOKUP(D54,Teilnehmer!$A$2:$C$102,2))","v":""}]
[null,null,53,null,{"$f":"IF(D55=\"\",\"\",VLOOKUP(D55,Teilnehmer!$A$2:$C$102,2))","v":""}]
[null,null,54,null,{"$f":"IF(D56=\"\",\"\",VLOOKUP(D56,Teilnehmer!$A$2:$C$102,2))","v":""}]
[null,null,55,null,{"$f":"IF(D57=\"\",\"\",VLOOKUP(D57,Teilnehmer!$A$2:$C$102,2))","v":""}]
[null,null,56,null,{"$f":"IF(D58=\"\",\"\",VLOOKUP(D58,Teilnehmer!$A$2:$C$102,2))","v":""}]
[null,null,57,null,{"$f":"IF(D59=\"\",\"\",VLOOKUP(D59,Teilnehmer!$A$2:$C$102,2))","v":""}]
[null,null,58,null,{"$f":"IF(D60=\"\",\"\",VLOOKUP(D60,Teilnehmer!$A$2:$C$102,2))","v":""}]
[null,null,59,null,{"$f":"IF(D61=\"\",\"\",VLOOKUP(D61,Teilnehmer!$A$2:$C$102,2))","v":""}]
[null,null,60,null,{"$f":"IF(D62=\"\",\"\",VLOOKUP(D62,Teilnehmer!$A$2:$C$102,2))","v":""}]
[null,null,61,null,{"$f":"IF(D63=\"\",\"\",VLOOKUP(D63,Teilnehmer!$A$2:$C$102,2))","v":""}]
[null,null,62,null,{"$f":"IF(D64=\"\",\"\",VLOOKUP(D64,Teilnehmer!$A$2:$C$102,2))","v":""}]
[null,null,63,null,{"$f":"IF(D65=\"\",\"\",VLOOKUP(D65,Teilnehmer!$A$2:$C$102,2))","v":""}]
[null,null,64,null,{"$f":"IF(D66=\"\",\"\",VLOOKUP(D66,Teilnehmer!$A$2:$C$102,2))","v":""}]
[null,null,65,null,{"$f":"IF(D67=\"\",\"\",VLOOKUP(D67,Teilnehmer!$A$2:$C$102,2))","v":""}]
[null,null,66,null,{"$f":"IF(D68=\"\",\"\",VLOOKUP(D68,Teilnehmer!$A$2:$C$102,2))","v":""}]
[null,null,67,null,{"$f":"IF(D69=\"\",\"\",VLOOKUP(D69,Teilnehmer!$A$2:$C$102,2))","v":""}]
[null,null,68,null,{"$f":"IF(D70=\"\",\"\",VLOOKUP(D70,Teilnehmer!$A$2:$C$102,2))","v":""}]
[null,null,69,null,{"$f":"IF(D71=\"\",\"\",VLOOKUP(D71,Teilnehmer!$A$2:$C$102,2))","v":""}]
[null,null,70,null,{"$f":"IF(D72=\"\",\"\",VLOOKUP(D72,Teilnehmer!$A$2:$C$102,2))","v":""}]
[null,null,71,null,{"$f":"IF(D73=\"\",\"\",VLOOKUP(D73,Teilnehmer!$A$2:$C$102,2))","v":""}]
[null,null,72,null,{"$f":"IF(D74=\"\",\"\",VLOOKUP(D74,Teilnehmer!$A$2:$C$102,2))","v":""}]
[null,null,73,null,{"$f":"IF(D75=\"\",\"\",VLOOKUP(D75,Teilnehmer!$A$2:$C$102,2))","v":""}]
[null,null,74,null,{"$f":"IF(D76=\"\",\"\",VLOOKUP(D76,Teilnehmer!$A$2:$C$102,2))","v":""}]
[null,null,75,null,{"$f":"IF(D77=\"\",\"\",VLOOKUP(D77,Teilnehmer!$A$2:$C$102,2))","v":""}]
[null,null,76,null,{"$f":"IF(D78=\"\",\"\",VLOOKUP(D78,Teilnehmer!$A$2:$C$102,2))","v":""}]
[null,null,77,null,{"$f":"IF(D79=\"\",\"\",VLOOKUP(D79,Teilnehmer!$A$2:$C$102,2))","v":""}]
[null,null,78,null,{"$f":"IF(D80=\"\",\"\",VLOOKUP(D80,Teilnehmer!$A$2:$C$102,2))","v":""}]
[null,null,79,null,{"$f":"IF(D81=\"\",\"\",VLOOKUP(D81,Teilnehmer!$A$2:$C$102,2))","v":""}]
[null,null,80,null,{"$f":"IF(D82=\"\",\"\",VLOOKUP(D82,Teilnehmer!$A$2:$C$102,2))","v":""}]
[null,null,81,null,{"$f":"IF(D83=\"\",\"\",VLOOKUP(D83,Teilnehmer!$A$2:$C$102,2))","v":""}]
[null,null,82,null,{"$f":"IF(D84=\"\",\"\",VLOOKUP(D84,Teilnehmer!$A$2:$C$102,2))","v":""}]
[null,null,83,null,{"$f":"IF(D85=\"\",\"\",VLOOKUP(D85,Teilnehmer!$A$2:$C$102,2))","v":""}]
[null,null,84,null,{"$f":"IF(D86=\"\",\"\",VLOOKUP(D86,Teilnehmer!$A$2:$C$102,2))","v":""}]
[null,null,85,null,{"$f":"IF(D87=\"\",\"\",VLOOKUP(D87,Teilnehmer!$A$2:$C$102,2))","v":""}]
[null,null,86,null,{"$f":"IF(D88=\"\",\"\",VLOOKUP(D88,Teilnehmer!$A$2:$C$102,2))","v":""}]
[null,null,87,null,{"$f":"IF(D89=\"\",\"\",VLOOKUP(D89,Teilnehmer!$A$2:$C$102,2))","v":""}]
[null,null,88,null,{"$f":"IF(D90=\"\",\"\",VLOOKUP(D90,Teilnehmer!$A$2:$C$102,2))","v":""}]
[null,null,89,null,{"$f":"IF(D91=\"\",\"\",VLOOKUP(D91,Teilnehmer!$A$2:$C$102,2))","v":""}]
[null,null,90,null,{"$f":"IF(D92=\"\",\"\",VLOOKUP(D92,Teilnehmer!$A$2:$C$102,2))","v":""}]
[null,null,91,null,{"$f":"IF(D93=\"\",\"\",VLOOKUP(D93,Teilnehmer!$A$2:$C$102,2))","v":""}]
[null,null,92,null,{"$f":"IF(D94=\"\",\"\",VLOOKUP(D94,Teilnehmer!$A$2:$C$102,2))","v":""}]
[null,null,93,null,{"$f":"IF(D95=\"\",\"\",VLOOKUP(D95,Teilnehmer!$A$2:$C$102,2))","v":""}]
[null,null,94,null,{"$f":"IF(D96=\"\",\"\",VLOOKUP(D96,Teilnehmer!$A$2:$C$102,2))","v":""}]
[null,null,95,null,{"$f":"IF(D97=\"\",\"\",VLOOKUP(D97,Teilnehmer!$A$2:$C$102,2))","v":""}]
[null,null,96,null,{"$f":"IF(D98=\"\",\"\",VLOOKUP(D98,Teilnehmer!$A$2:$C$102,2))","v":""}]
[null,null,97,null,{"$f":"IF(D99=\"\",\"\",VLOOKUP(D99,Teilnehmer!$A$2:$C$102,2))","v":""}]
[null,null,98,null,{"$f":"IF(D100=\"\",\"\",VLOOKUP(D100,Teilnehmer!$A$2:$C$102,2))","v":""}]
[null,null,99,null,{"$f":"IF(D101=\"\",\"\",VLOOKUP(D101,Teilnehmer!$A$2:$C$102,2))","v":""}]
[null,null,100,null,{"$f":"IF(D102=\"\",\"\",VLOOKUP(D102,Teilnehmer!$A$2:$C$102,2))","v":""}]

{"sheet":"Eingabe-Ergebnisse VM","index":4,"n_rows":50,"n_cols":307,"rows_kept":50,"cut":false,"hidden":false,"merged":[[0,259,0,264],[1,259,1,264],[0,133,0,138],[0,140,0,145],[1,56,1,61],[0,224,0,229],[0,189,0,194],[1,175,1,180],[1,182,1,187],[0,196,0,201],[0,168,0,173],[0,175,0,180],[0,182,0,187],[1,133,1,138],[1,140,1,145],[1,161,1,166],[1,168,1,173],[1,147,1,152],[1,154,1,159],[0,161,0,166],[0,252,0,257],[1,252,1,257],[0,210,0,215],[1,210,1,215],[0,217,0,222],[1,217,1,222],[0,231,0,236],[1,245,1,250],[0,245,0,250],[0,14,0,19],[0,0,0,5],[1,0,1,5],[0,7,0,12],[1,7,1,12],[1,14,1,19],[1,63,1,68],[0,42,0,47],[0,56,0,61],[0,49,0,54],[1,21,1,26],[1,28,1,33],[0,35,0,40],[1,35,1,40],[1,42,1,47],[0,21,0,26],[0,28,0,33],[1,49,1,54],[0,63,0,68],[0,70,0,75],[0,77,0,82],[1,70,1,75],[1,77,1,82],[0,84,0,89],[0,91,0,96],[1,84,1,89],[1,91,1,96],[0,98,0,103],[1,98,1,103],[0,105,0,110],[1,105,1,110],[0,112,0,117],[1,112,1,117],[0,119,0,124],[1,119,1,124],[0,126,0,131],[1,126,1,131],[0,266,0,271],[0,273,0,278],[1,266,1,271],[1,273,1,278],[0,147,0,152],[0,154,0,159],[1,224,1,229],[1,231,1,236],[1,238,1,243],[1,203,1,208],[1,189,1,194],[1,196,1,201],[0,238,0,243],[0,203,0,208],[0,301,0,306],[1,301,1,306],[0,280,0,285],[0,287,0,292],[1,280,1,285],[1,287,1,292],[0,294,0,299],[1,294,1,299]]}
["LG-Auflage [ WK 21 / WK 20 ]",null,null,null,null,null,null,"LG-Freihand [ WK 21 / WK 20 ]",null,null,null,null,null,null,"LG-Auflage [ WK 31 / WK 30 ]",null,null,null,null,null,null,"LG-Freihand [ WK 31 / WK 30 ]",null,null,null,null,null,null,"LG-Auflage [ WK 43 / WK 42 ]",null,null,null,null,null,null,"LG-Freihand [ WK 43 / WK 42 ]",null,null,null,null,null,null,"LG-Auflage [ WK 41 / WK 40 ]",null,null,null,null,null,null,"LG-Freihand [ WK 41 / WK 40 ]",null,null,null,null,null,null,"LG-Auflage [ WK 11 / WK 10 ]",null,null,null,null,null,null,"LG-Freihand [ WK 11 / WK 10 ]",null,null,null,null,null,null,"LG-Auflage [ WK 13 / WK 12 ]",null,null,null,null,null,null,"LG-Freihand [ WK 13 / WK 12 ]",null,null,null,null,null,null,"LG-Freihand [ WK 15 / WK 14 ]",null,null,null,null,null,null,"LG-Freihand [ WK 17 / WK 16 ]",null,null,null,null,null,null,"LG-Auflage [ WK 71 / WK 70 ]",null,null,null,null,null,null,"LG-Auflage [ WK 73 / WK 72 ]",null,null,null,null,null,null,"LG-Auflage [ WK 75 / WK 74 ]",null,null,null,null,null,null,"LG-Auflage [ WK 77 / WK 76 ]",null,null,null,null,null,null,"LG-Auflage [ WK 79 / WK 78 ]",null,null,null,null,null,null,"KK-Auflage [ WK 31 / WK 30 ]",null,null,null,null,null,null,"KK-Freihand [ WK 31 / WK 30 ]",null,null,null,null,null,null,"KK-Auflage [ WK 43 / WK 42 ]",null,null,null,null,null,null,"KK-Freihand [ WK 43 / WK 42 ]",null,null,null,null,null,null,"KK-Auflage [ WK 41 / WK 40 ]",null,null,null,null,null,null,"KK-Freihand [ WK 41 / WK 40 ]",null,null,null,null,null,null,"KK-Auflage [ WK 11 / WK 10 ]",null,null,null,null,null,null,"KK-Freihand [ WK 11 / WK 10 ]",null,null,null,null,null,null,"KK-Auflage [ WK 13 / WK 12 ]",null,null,null,null,null,null,"KK-Freihand [ WK 13 / WK 12 ]",null,null,null,null,null,null,"KK-Freihand [ WK 15 / WK 14 ]",null,null,null,null,null,null,"KK-Freihand [ WK 17 / WK 16 ]",null,null,null,null,null,null,"KK-Auflage [ WK 71 / WK 70 ]",null,null,null,null,null,null,"KK-Auflage [ WK 73 / WK 72 ]",null,null,null,null,null,null,"KK-Auflage [ WK 75 / WK 74 ]",null,null,null,null,null,null,"KK-Auflage [ WK 77 / WK 76 ]",null,null,null,null,null,null,"KK-Auflage [ WK 79 / WK 78 ]",null,null,null,null,null,null,"Luftpistole [ WK 21 / WK 20 ]",null,null,null,null,null,null,"Luftpistole [ WK 31 / WK 30 ]",null,null,null,null,null,null,"Luftpistole [ WK 43 / WK 42 ]",null,null,null,null,null,null,"Luftpistole [ WK 41 / WK 40 ]",null,null,null,null,null,null,"Luftpistole [ WK 11 / WK 10 ]",null,null,null,null,null,null,"Luftpistole [ WK 13 / WK 12 ]",null,null,null,null,null,null,"Luftpistole [ WK 15 / WK 14 ]",null,null,null,null,null,null,"Luftpistole [ WK 17 / WK 16 ]"]
["Schüler ( 12 bis 14 Jahre )",null,null,null,null,null,null,"Schüler ( 12 bis 14 Jahre )",null,null,null,null,null,null,"Jugend ( 15-16 Jahre )",null,null,null,null,null,null,"Jugend ( 15-16 Jahre )",null,null,null,null,null,null,"Junioren II (17-18 Jahre )",null,null,null,null,null,null,"Junioren II (17-18 Jahre )",null,null,null,null,null,null,"Junioren I (19-20 Jahre )",null,null,null,null,null,null,"Junioren I (19-20 Jahre )",null,null,null,null,null,null,"Damen I und Herren I ( 21-40 Jahre )",null,null,null,null,null,null,"Damen I und Herren I ( 21-40 Jahre )",null,null,null,null,null,null,"Damen II und Herren II ( 41-50 Jahre )",null,null,null,null,null,null,"Damen II und Herren II ( 41-50 Jahre )",null,null,null,null,null,null,"Damen III und Herren III ( 51-60 Jahre )",null,null,null,null,null,null,"Damen IV und Herren IV ( 61 Jahre und älter )",null,null,null,null,null,null,"Senioren I ( 51-60 Jahre )",null,null,null,null,null,null,"Senioren II ( 61-65 Jahre )",null,null,null,null,null,null,"Senioren III ( 66-70 Jahre )",null,null,null,null,null,null,"Senioren IV ( 71-75 Jahre )",null,null,null,null,null,null,"Senioren V ( 76 Jahre und älter )",null,null,null,null,null,null,"Jugend ( ab 15 Jahre )",null,null,null,null,null,null,"Jugend ( ab 15 Jahre )",null,null,null,null,null,null,"Junioren II ( 17-18 Jahre )",null,null,null,null,null,null,"Junioren II ( 17-18 Jahre )",null,null,null,null,null,null,"Junioren I ( 19-20 Jahre )",null,null,null,null,null,null,"Junioren I ( 19-20 Jahre )",null,null,null,null,null,null,"Damen I und Herren I ( 21-40 Jahre )",null,null,null,null,null,null,"Damen I und Herren I ( 21-40 Jahre )",null,null,null,null,null,null,"Damen II und Herren II ( 41-50 Jahre )",null,null,null,null,null,null,"Damen II und Herren II ( 41-50 Jahre )",null,null,null,null,null,null,"Damen III und Herren III ( 51-60 Jahre )",null,null,null,null,null,null,"Damen IV und Herren IV ( 61 Jahre und älter )",null,null,null,null,null,null,"Senioren I ( 51-60 Jahre )",null,null,null,null,null,null,"Senioren II ( 61-65 Jahre )",null,null,null,null,null,null,"Senioren III ( 66-70 Jahre )",null,null,null,null,null,null,"Senioren IV ( 71-75 Jahre )",null,null,null,null,null,null,"Senioren V ( 76 Jahre und älter )",null,null,null,null,null,null,"Schüler ( bis 14 Jahre )",null,null,null,null,null,null,"Jugend ( 15 bis 16 Jahre )",null,null,null,null,null,null,"Junioren II ( 17 bis 18 Jahre )",null,null,null,null,null,null,"Junioren I ( 19 bis 20 Jahre )",null,null,null,null,null,null,"Damen I und Herren I ( 21 bis 40 Jahre )",null,null,null,null,null,null,"Damen II und Herren II ( 41 bis 50 Jahre )",null,null,null,null,null,null,"Damen III und Herren III ( 51 bis 60 Jahre )",null,null,null,null,null,null,"Damen IV und Herren IV ( 61 Jahre und älter )"]
["Nr.:","Damen","Ringe:","Nr.:","Herren","Ringe:",null,"Nr.:","Damen","Ringe:","Nr.:","Herren","Ringe:",null,"Nr.:","Damen","Ringe:","Nr.:","Herren","Ringe:",null,"Nr.:","Damen","Ringe:","Nr.:","Herren","Ringe:",null,"Nr.:","Damen","Ringe:","Nr.:","Herren","Ringe:",null,"Nr.:","Damen","Ringe:","Nr.:","Herren","Ringe:",null,"Nr.:","Damen","Ringe:","Nr.:","Herren","Ringe:",null,"Nr.:","Damen","Ringe:","Nr.:","Herren","Ringe:",null,"Nr.:","Damen","Ringe:","Nr.:","Herren","Ringe:",null,"Nr.:","Damen","Ringe:","Nr.:","Herren","Ringe:",null,"Nr.:","Damen","Ringe:","Nr.:","Herren","Ringe:",null,"Nr.:","Damen","Ringe:","Nr.:","Herren","Ringe:",null,"Nr.:","Damen","Ringe:","Nr.:","Herren","Ringe:",null,"Nr.:","Damen","Ringe:","Nr.:","Herren","Ringe:",null,"Nr.:","Damen","Ringe:","Nr.:","Herren","Ringe:",null,"Nr.:","Damen","Ringe:","Nr.:","Herren","Ringe:",null,"Nr.:","Damen","Ringe:","Nr.:","Herren","Ringe:",null,"Nr.:","Damen","Ringe:","Nr.:","Herren","Ringe:",null,"Nr.:","Damen","Ringe:","Nr.:","Herren","Ringe:",null,"Nr.:","Damen","Ringe:","Nr.:","Herren","Ringe:",null,"Nr.:","Damen","Ringe:","Nr.:","Herren","Ringe:",null,"Nr.:","Damen","Ringe:","Nr.:","Herren","Ringe:",null,"Nr.:","Damen","Ringe:","Nr.:","Herren","Ringe:",null,"Nr.:","Damen","Ringe:","Nr.:","Herren","Ringe:",null,"Nr.:","Damen","Ringe:","Nr.:","Herren","Ringe:",null,"Nr.:","Damen","Ringe:","Nr.:","Herren","Ringe:",null,"Nr.:","Damen","Ringe:","Nr.:","Herren","Ringe:",null,"Nr.:","Damen","Ringe:","Nr.:","Herren","Ringe:",null,"Nr.:","Damen","Ringe:","Nr.:","Herren","Ringe:",null,"Nr.:","Damen","Ringe:","Nr.:","Herren","Ringe:",null,"Nr.:","Damen","Ringe:","Nr.:","Herren","Ringe:",null,"Nr.:","Damen","Ringe:","Nr.:","Herren","Ringe:",null,"Nr.:","Damen","Ringe:","Nr.:","Herren","Ringe:",null,"Nr.:","Damen","Ringe:","Nr.:","Herren","Ringe:",null,"Nr.:","Damen","Ringe:","Nr.:","Herren","Ringe:",null,"Nr.:","Damen","Ringe:","Nr.:","Herren","Ringe:",null,"Nr.:","Damen","Ringe:","Nr.:","Herren","Ringe:",null,"Nr.:","Damen","Ringe:","Nr.:","Herren","Ringe:",null,"Nr.:","Damen","Ringe:","Nr.:","Herren","Ringe:",null,"Nr.:","Damen","Ringe:","Nr.:","Herren","Ringe:",null,"Nr.:","Damen","Ringe:","Nr.:","Herren","Ringe:",null,"Nr.:","Damen","Ringe:","Nr.:","Herren","Ringe:",null,"Nr.:","Damen","Ringe:","Nr.:","Herren","Ringe:",null,"Nr.:","Damen","Ringe:","Nr.:","Herren","Ringe:"]
[null,{"$f":"IF(A4=\"\",\"\",VLOOKUP(A4,Teilnehmer!$A$3:$C$102,2))","v":""},null,null,{"$f":"IF(D4=\"\",\"\",VLOOKUP(D4,Teilnehmer!$A$3:$C$102,2))","v":""},null,null,null,{"$f":"IF(H4=\"\",\"\",VLOOKUP(H4,Teilnehmer!$A$3:$C$102,2))","v":""},null,null,{"$f":"IF(K4=\"\",\"\",VLOOKUP(K4,Teilnehmer!$A$3:$C$102,2))","v":""},null,null,null,{"$f":"IF(O4=\"\",\"\",VLOOKUP(O4,Teilnehmer!$A$3:$C$102,2))","v":""},null,null,{"$f":"IF(R4=\"\",\"\",VLOOKUP(R4,Teilnehmer!$A$3:$C$102,2))","v":""},null,null,null,{"$f":"IF(V4=\"\",\"\",VLOOKUP(V4,Teilnehmer!$A$3:$C$102,2))","v":""},null,null,{"$f":"IF(Y4=\"\",\"\",VLOOKUP(Y4,Teilnehmer!$A$3:$C$102,2))","v":""},null,null,null,{"$f":"IF(AC4=\"\",\"\",VLOOKUP(AC4,Teilnehmer!$A$3:$C$102,2))","v":""},null,null,{"$f":"IF(AF4=\"\",\"\",VLOOKUP(AF4,Teilnehmer!$A$3:$C$102,2))","v":""},null,null,null,{"$f":"IF(AJ4=\"\",\"\",VLOOKUP(AJ4,Teilnehmer!$A$3:$C$102,2))","v":""},null,null,{"$f":"IF(AM4=\"\",\"\",VLOOKUP(AM4,Teilnehmer!$A$3:$C$102,2))","v":""},null,null,null,{"$f":"IF(AQ4=\"\",\"\",VLOOKUP(AQ4,Teilnehmer!$A$3:$C$102,2))","v":""},null,null,{"$f":"IF(AT4=\"\",\"\",VLOOKUP(AT4,Teilnehmer!$A$3:$C$102,2))","v":""},null,null,null,{"$f":"IF(AX4=\"\",\"\",VLOOKUP(AX4,Teilnehmer!$A$3:$C$102,2))","v":""},null,null,{"$f":"IF(BA4=\"\",\"\",VLOOKUP(BA4,Teilnehmer!$A$3:$C$102,2))","v":""},null,null,null,{"$f":"IF(BE4=\"\",\"\",VLOOKUP(BE4,Teilnehmer!$A$3:$C$102,2))","v":""},null,null,{"$f":"IF(BH4=\"\",\"\",VLOOKUP(BH4,Teilnehmer!$A$3:$C$102,2))","v":""},null,null,null,{"$f":"IF(BL4=\"\",\"\",VLOOKUP(BL4,Teilnehmer!$A$3:$C$102,2))","v":""},null,null,{"$f":"IF(BO4=\"\",\"\",VLOOKUP(BO4,Teilnehmer!$A$3:$C$102,2))","v":""},null,null,null,{"$f":"IF(BS4=\"\",\"\",VLOOKUP(BS4,Teilnehmer!$A$3:$C$102,2))","v":""},null,null,{"$f":"IF(BV4=\"\",\"\",VLOOKUP(BV4,Teilnehmer!$A$3:$C$102,2))","v":""},null,null,null,{"$f":"IF(BZ4=\"\",\"\",VLOOKUP(BZ4,Teilnehmer!$A$3:$C$102,2))","v":""},null,null,{"$f":"IF(CC4=\"\",\"\",VLOOKUP(CC4,Teilnehmer!$A$3:$C$102,2))","v":""},null,null,null,{"$f":"IF(CG4=\"\",\"\",VLOOKUP(CG4,Teilnehmer!$A$3:$C$102,2))","v":""},null,null,{"$f":"IF(CJ4=\"\",\"\",VLOOKUP(CJ4,Teilnehmer!$A$3:$C$102,2))","v":""},null,null,null,{"$f":"IF(CN4=\"\",\"\",VLOOKUP(CN4,Teilnehmer!$A$3:$C$102,2))","v":""},null,null,{"$f":"IF(CQ4=\"\",\"\",VLOOKUP(CQ4,Teilnehmer!$A$3:$C$102,2))","v":""},null,null,null,{"$f":"IF(CU4=\"\",\"\",VLOOKUP(CU4,Teilnehmer!$A$3:$C$102,2))","v":""},null,null,{"$f":"IF(CX4=\"\",\"\",VLOOKUP(CX4,Teilnehmer!$A$3:$C$102,2))","v":""},null,null,null,{"$f":"IF(DB4=\"\",\"\",VLOOKUP(DB4,Teilnehmer!$A$3:$C$102,2))","v":""},null,null,{"$f":"IF(DE4=\"\",\"\",VLOOKUP(DE4,Teilnehmer!$A$3:$C$102,2))","v":""},null,null,null,{"$f":"IF(DI4=\"\",\"\",VLOOKUP(DI4,Teilnehmer!$A$3:$C$102,2))","v":""},null,null,{"$f":"IF(DL4=\"\",\"\",VLOOKUP(DL4,Teilnehmer!$A$3:$C$102,2))","v":""},null,null,null,{"$f":"IF(DP4=\"\",\"\",VLOOKUP(DP4,Teilnehmer!$A$3:$C$102,2))","v":""},null,null,{"$f":"IF(DS4=\"\",\"\",VLOOKUP(DS4,Teilnehmer!$A$3:$C$102,2))","v":""},null,null,null,{"$f":"IF(DW4=\"\",\"\",VLOOKUP(DW4,Teilnehmer!$A$3:$C$102,2))","v":""},null,null,{"$f":"IF(DZ4=\"\",\"\",VLOOKUP(DZ4,Teilnehmer!$A$3:$C$102,2))","v":""},null,null,null,{"$f":"IF(ED4=\"\",\"\",VLOOKUP(ED4,Teilnehmer!$A$3:$C$102,2))","v":""},null,null,{"$f":"IF(EG4=\"\",\"\",VLOOKUP(EG4,Teilnehmer!$A$3:$C$102,2))","v":""},null,null,null,{"$f":"IF(EK4=\"\",\"\",VLOOKUP(EK4,Teilnehmer!$A$3:$C$102,2))","v":""},null,null,{"$f":"IF(EN4=\"\",\"\",VLOOKUP(EN4,Teilnehmer!$A$3:$C$102,2))","v":""},null,null,null,{"$f":"IF(ER4=\"\",\"\",VLOOKUP(ER4,Teilnehmer!$A$3:$C$102,2))","v":""},null,null,{"$f":"IF(EU4=\"\",\"\",VLOOKUP(EU4,Teilnehmer!$A$3:$C$102,2))","v":""},null,null,null,{"$f":"IF(EY4=\"\",\"\",VLOOKUP(EY4,Teilnehmer!$A$3:$C$102,2))","v":""},null,null,{"$f":"IF(FB4=\"\",\"\",VLOOKUP(FB4,Teilnehmer!$A$3:$C$102,2))","v":""},null,null,null,{"$f":"IF(FF4=\"\",\"\",VLOOKUP(FF4,Teilnehmer!$A$3:$C$102,2))","v":""},null,null,{"$f":"IF(FI4=\"\",\"\",VLOOKUP(FI4,Teilnehmer!$A$3:$C$102,2))","v":""},null,null,null,{"$f":"IF(FM4=\"\",\"\",VLOOKUP(FM4,Teilnehmer!$A$3:$C$102,2))","v":""},null,null,{"$f":"IF(FP4=\"\",\"\",VLOOKUP(FP4,Teilnehmer!$A$3:$C$102,2))","v":""},null,null,null,{"$f":"IF(FT4=\"\",\"\",VLOOKUP(FT4,Teilnehmer!$A$3:$C$102,2))","v":""},null,null,{"$f":"IF(FW4=\"\",\"\",VLOOKUP(FW4,Teilnehmer!$A$3:$C$102,2))","v":""},null,null,null,{"$f":"IF(GA4=\"\",\"\",VLOOKUP(GA4,Teilnehmer!$A$3:$C$102,2))","v":""},null,null,{"$f":"IF(GD4=\"\",\"\",VLOOKUP(GD4,Teilnehmer!$A$3:$C$102,2))","v":""},null,null,null,{"$f":"IF(GH4=\"\",\"\",VLOOKUP(GH4,Teilnehmer!$A$3:$C$102,2))","v":""},null,null,{"$f":"IF(GK4=\"\",\"\",VLOOKUP(GK4,Teilnehmer!$A$3:$C$102,2))","v":""},null,null,null,{"$f":"IF(GO4=\"\",\"\",VLOOKUP(GO4,Teilnehmer!$A$3:$C$102,2))","v":""},null,null,{"$f":"IF(GR4=\"\",\"\",VLOOKUP(GR4,Teilnehmer!$A$3:$C$102,2))","v":""},null,null,null,{"$f":"IF(GV4=\"\",\"\",VLOOKUP(GV4,Teilnehmer!$A$3:$C$102,2))","v":""},null,null,{"$f":"IF(GY4=\"\",\"\",VLOOKUP(GY4,Teilnehmer!$A$3:$C$102,2))","v":""},null,null,null,{"$f":"IF(HC4=\"\",\"\",VLOOKUP(HC4,Teilnehmer!$A$3:$C$102,2))","v":""},null,null,{"$f":"IF(HF4=\"\",\"\",VLOOKUP(HF4,Teilnehmer!$A$3:$C$102,2))","v":""},null,null,null,{"$f":"IF(HJ4=\"\",\"\",VLOOKUP(HJ4,Teilnehmer!$A$3:$C$102,2))","v":""},null,null,{"$f":"IF(HM4=\"\",\"\",VLOOKUP(HM4,Teilnehmer!$A$3:$C$102,2))","v":""},null,null,null,{"$f":"IF(HQ4=\"\",\"\",VLOOKUP(HQ4,Teilnehmer!$A$3:$C$102,2))","v":""},null,null,{"$f":"IF(HT4=\"\",\"\",VLOOKUP(HT4,Teilnehmer!$A$3:$C$102,2))","v":""},null,null,null,{"$f":"IF(HX4=\"\",\"\",VLOOKUP(HX4,Teilnehmer!$A$3:$C$102,2))","v":""},null,null,{"$f":"IF(IA4=\"\",\"\",VLOOKUP(IA4,Teilnehmer!$A$3:$C$102,2))","v":""},null,null,null,{"$f":"IF(IE4=\"\",\"\",VLOOKUP(IE4,Teilnehmer!$A$3:$C$102,2))","v":""},null,null,{"$f":"IF(IH4=\"\",\"\",VLOOKUP(IH4,Teilnehmer!$A$3:$C$102,2))","v":""},null,null,null,{"$f":"IF(IL4=\"\",\"\",VLOOKUP(IL4,Teilnehmer!$A$3:$C$102,2))","v":""},null,null,{"$f":"IF(IO4=\"\",\"\",VLOOKUP(IO4,Teilnehmer!$A$3:$C$102,2))","v":""},null,null,null,{"$f":"IF(IS4=\"\",\"\",VLOOKUP(IS4,Teilnehmer!$A$3:$C$102,2))","v":""},null,null,{"$f":"IF(IV4=\"\",\"\",VLOOKUP(IV4,Teilnehmer!$A$3:$C$102,2))","v":""},null,null,null,{"$f":"IF(IZ4=\"\",\"\",VLOOKUP(IZ4,Teilnehmer!$A$3:$C$102,2))","v":""},null,null,{"$f":"IF(JC4=\"\",\"\",VLOOKUP(JC4,Teilnehmer!$A$3:$C$102,2))","v":""},null,null,null,{"$f":"IF(JG4=\"\",\"\",VLOOKUP(JG4,Teilnehmer!$A$3:$C$102,2))","v":""},null,null,{"$f":"IF(JJ4=\"\",\"\",VLOOKUP(JJ4,Teilnehmer!$A$3:$C$102,2))","v":""},null,null,null,{"$f":"IF(JN4=\"\",\"\",VLOOKUP(JN4,Teilnehmer!$A$3:$C$102,2))","v":""},null,null,{"$f":"IF(JQ4=\"\",\"\",VLOOKUP(JQ4,Teilnehmer!$A$3:$C$102,2))","v":""},null,null,null,{"$f":"IF(JU4=\"\",\"\",VLOOKUP(JU4,Teilnehmer!$A$3:$C$102,2))","v":""},null,null,{"$f":"IF(JX4=\"\",\"\",VLOOKUP(JX4,Teilnehmer!$A$3:$C$102,2))","v":""},null,null,null,{"$f":"IF(KB4=\"\",\"\",VLOOKUP(KB4,Teilnehmer!$A$3:$C$102,2))","v":""},null,null,{"$f":"IF(KE4=\"\",\"\",VLOOKUP(KE4,Teilnehmer!$A$3:$C$102,2))","v":""},null,null,null,{"$f":"IF(KI4=\"\",\"\",VLOOKUP(KI4,Teilnehmer!$A$3:$C$102,2))","v":""},null,null,{"$f":"IF(KL4=\"\",\"\",VLOOKUP(KL4,Teilnehmer!$A$3:$C$102,2))","v":""},null,null,null,{"$f":"IF(KP4=\"\",\"\",VLOOKUP(KP4,Teilnehmer!$A$3:$C$102,2))","v":""},null,null,{"$f":"IF(KS4=\"\",\"\",VLOOKUP(KS4,Teilnehmer!$A$3:$C$102,2))","v":""}]
[null,{"$f":"IF(A5=\"\",\"\",VLOOKUP(A5,Teilnehmer!$A$3:$C$102,2))","v":""},null,null,{"$f":"IF(D5=\"\",\"\",VLOOKUP(D5,Teilnehmer!$A$3:$C$102,2))","v":""},null,null,null,{"$f":"IF(H5=\"\",\"\",VLOOKUP(H5,Teilnehmer!$A$3:$C$102,2))","v":""},null,null,{"$f":"IF(K5=\"\",\"\",VLOOKUP(K5,Teilnehmer!$A$3:$C$102,2))","v":""},null,null,null,{"$f":"IF(O5=\"\",\"\",VLOOKUP(O5,Teilnehmer!$A$3:$C$102,2))","v":""},null,null,{"$f":"IF(R5=\"\",\"\",VLOOKUP(R5,Teilnehmer!$A$3:$C$102,2))","v":""},null,null,null,{"$f":"IF(V5=\"\",\"\",VLOOKUP(V5,Teilnehmer!$A$3:$C$102,2))","v":""},null,null,{"$f":"IF(Y5=\"\",\"\",VLOOKUP(Y5,Teilnehmer!$A$3:$C$102,2))","v":""},null,null,null,{"$f":"IF(AC5=\"\",\"\",VLOOKUP(AC5,Teilnehmer!$A$3:$C$102,2))","v":""},null,null,{"$f":"IF(AF5=\"\",\"\",VLOOKUP(AF5,Teilnehmer!$A$3:$C$102,2))","v":""},null,null,null,{"$f":"IF(AJ5=\"\",\"\",VLOOKUP(AJ5,Teilnehmer!$A$3:$C$102,2))","v":""},null,null,{"$f":"IF(AM5=\"\",\"\",VLOOKUP(AM5,Teilnehmer!$A$3:$C$102,2))","v":""},null,null,null,{"$f":"IF(AQ5=\"\",\"\",VLOOKUP(AQ5,Teilnehmer!$A$3:$C$102,2))","v":""},null,null,{"$f":"IF(AT5=\"\",\"\",VLOOKUP(AT5,Teilnehmer!$A$3:$C$102,2))","v":""},null,null,null,{"$f":"IF(AX5=\"\",\"\",VLOOKUP(AX5,Teilnehmer!$A$3:$C$102,2))","v":""},null,null,{"$f":"IF(BA5=\"\",\"\",VLOOKUP(BA5,Teilnehmer!$A$3:$C$102,2))","v":""},null,null,null,{"$f":"IF(BE5=\"\",\"\",VLOOKUP(BE5,Teilnehmer!$A$3:$C$102,2))","v":""},null,null,{"$f":"IF(BH5=\"\",\"\",VLOOKUP(BH5,Teilnehmer!$A$3:$C$102,2))","v":""},null,null,null,{"$f":"IF(BL5=\"\",\"\",VLOOKUP(BL5,Teilnehmer!$A$3:$C$102,2))","v":""},null,null,{"$f":"IF(BO5=\"\",\"\",VLOOKUP(BO5,Teilnehmer!$A$3:$C$102,2))","v":""},null,null,null,{"$f":"IF(BS5=\"\",\"\",VLOOKUP(BS5,Teilnehmer!$A$3:$C$102,2))","v":""},null,null,{"$f":"IF(BV5=\"\",\"\",VLOOKUP(BV5,Teilnehmer!$A$3:$C$102,2))","v":""},null,null,null,{"$f":"IF(BZ5=\"\",\"\",VLOOKUP(BZ5,Teilnehmer!$A$3:$C$102,2))","v":""},null,null,{"$f":"IF(CC5=\"\",\"\",VLOOKUP(CC5,Teilnehmer!$A$3:$C$102,2))","v":""},null,null,null,{"$f":"IF(CG5=\"\",\"\",VLOOKUP(CG5,Teilnehmer!$A$3:$C$102,2))","v":""},null,null,{"$f":"IF(CJ5=\"\",\"\",VLOOKUP(CJ5,Teilnehmer!$A$3:$C$102,2))","v":""},null,null,null,{"$f":"IF(CN5=\"\",\"\",VLOOKUP(CN5,Teilnehmer!$A$3:$C$102,2))","v":""},null,null,{"$f":"IF(CQ5=\"\",\"\",VLOOKUP(CQ5,Teilnehmer!$A$3:$C$102,2))","v":""},null,null,null,{"$f":"IF(CU5=\"\",\"\",VLOOKUP(CU5,Teilnehmer!$A$3:$C$102,2))","v":""},null,null,{"$f":"IF(CX5=\"\",\"\",VLOOKUP(CX5,Teilnehmer!$A$3:$C$102,2))","v":""},null,null,null,{"$f":"IF(DB5=\"\",\"\",VLOOKUP(DB5,Teilnehmer!$A$3:$C$102,2))","v":""},null,null,{"$f":"IF(DE5=\"\",\"\",VLOOKUP(DE5,Teilnehmer!$A$3:$C$102,2))","v":""},null,null,null,{"$f":"IF(DI5=\"\",\"\",VLOOKUP(DI5,Teilnehmer!$A$3:$C$102,2))","v":""},null,null,{"$f":"IF(DL5=\"\",\"\",VLOOKUP(DL5,Teilnehmer!$A$3:$C$102,2))","v":""},null,null,null,{"$f":"IF(DP5=\"\",\"\",VLOOKUP(DP5,Teilnehmer!$A$3:$C$102,2))","v":""},null,null,{"$f":"IF(DS5=\"\",\"\",VLOOKUP(DS5,Teilnehmer!$A$3:$C$102,2))","v":""},null,null,null,{"$f":"IF(DW5=\"\",\"\",VLOOKUP(DW5,Teilnehmer!$A$3:$C$102,2))","v":""},null,null,{"$f":"IF(DZ5=\"\",\"\",VLOOKUP(DZ5,Teilnehmer!$A$3:$C$102,2))","v":""},null,null,null,{"$f":"IF(ED5=\"\",\"\",VLOOKUP(ED5,Teilnehmer!$A$3:$C$102,2))","v":""},null,null,{"$f":"IF(EG5=\"\",\"\",VLOOKUP(EG5,Teilnehmer!$A$3:$C$102,2))","v":""},null,null,null,{"$f":"IF(EK5=\"\",\"\",VLOOKUP(EK5,Teilnehmer!$A$3:$C$102,2))","v":""},null,null,{"$f":"IF(EN5=\"\",\"\",VLOOKUP(EN5,Teilnehmer!$A$3:$C$102,2))","v":""},null,null,null,{"$f":"IF(ER5=\"\",\"\",VLOOKUP(ER5,Teilnehmer!$A$3:$C$102,2))","v":""},null,null,{"$f":"IF(EU5=\"\",\"\",VLOOKUP(EU5,Teilnehmer!$A$3:$C$102,2))","v":""},null,null,null,{"$f":"IF(EY5=\"\",\"\",VLOOKUP(EY5,Teilnehmer!$A$3:$C$102,2))","v":""},null,null,{"$f":"IF(FB5=\"\",\"\",VLOOKUP(FB5,Teilnehmer!$A$3:$C$102,2))","v":""},null,null,null,{"$f":"IF(FF5=\"\",\"\",VLOOKUP(FF5,Teilnehmer!$A$3:$C$102,2))","v":""},null,null,{"$f":"IF(FI5=\"\",\"\",VLOOKUP(FI5,Teilnehmer!$A$3:$C$102,2))","v":""},null,null,null,{"$f":"IF(FM5=\"\",\"\",VLOOKUP(FM5,Teilnehmer!$A$3:$C$102,2))","v":""},null,null,{"$f":"IF(FP5=\"\",\"\",VLOOKUP(FP5,Teilnehmer!$A$3:$C$102,2))","v":""},null,null,null,{"$f":"IF(FT5=\"\",\"\",VLOOKUP(FT5,Teilnehmer!$A$3:$C$102,2))","v":""},null,null,{"$f":"IF(FW5=\"\",\"\",VLOOKUP(FW5,Teilnehmer!$A$3:$C$102,2))","v":""},null,null,null,{"$f":"IF(GA5=\"\",\"\",VLOOKUP(GA5,Teilnehmer!$A$3:$C$102,2))","v":""},null,null,{"$f":"IF(GD5=\"\",\"\",VLOOKUP(GD5,Teilnehmer!$A$3:$C$102,2))","v":""},null,null,null,{"$f":"IF(GH5=\"\",\"\",VLOOKUP(GH5,Teilnehmer!$A$3:$C$102,2))","v":""},null,null,{"$f":"IF(GK5=\"\",\"\",VLOOKUP(GK5,Teilnehmer!$A$3:$C$102,2))","v":""},null,null,null,{"$f":"IF(GO5=\"\",\"\",VLOOKUP(GO5,Teilnehmer!$A$3:$C$102,2))","v":""},null,null,{"$f":"IF(GR5=\"\",\"\",VLOOKUP(GR5,Teilnehmer!$A$3:$C$102,2))","v":""},null,null,null,{"$f":"IF(GV5=\"\",\"\",VLOOKUP(GV5,Teilnehmer!$A$3:$C$102,2))","v":""},null,null,{"$f":"IF(GY5=\"\",\"\",VLOOKUP(GY5,Teilnehmer!$A$3:$C$102,2))","v":""},null,null,null,{"$f":"IF(HC5=\"\",\"\",VLOOKUP(HC5,Teilnehmer!$A$3:$C$102,2))","v":""},null,null,{"$f":"IF(HF5=\"\",\"\",VLOOKUP(HF5,Teilnehmer!$A$3:$C$102,2))","v":""},null,null,null,{"$f":"IF(HJ5=\"\",\"\",VLOOKUP(HJ5,Teilnehmer!$A$3:$C$102,2))","v":""},null,null,{"$f":"IF(HM5=\"\",\"\",VLOOKUP(HM5,Teilnehmer!$A$3:$C$102,2))","v":""},null,null,null,{"$f":"IF(HQ5=\"\",\"\",VLOOKUP(HQ5,Teilnehmer!$A$3:$C$102,2))","v":""},null,null,{"$f":"IF(HT5=\"\",\"\",VLOOKUP(HT5,Teilnehmer!$A$3:$C$102,2))","v":""},null,null,null,{"$f":"IF(HX5=\"\",\"\",VLOOKUP(HX5,Teilnehmer!$A$3:$C$102,2))","v":""},null,null,{"$f":"IF(IA5=\"\",\"\",VLOOKUP(IA5,Teilnehmer!$A$3:$C$102,2))","v":""},null,null,null,{"$f":"IF(IE5=\"\",\"\",VLOOKUP(IE5,Teilnehmer!$A$3:$C$102,2))","v":""},null,null,{"$f":"IF(IH5=\"\",\"\",VLOOKUP(IH5,Teilnehmer!$A$3:$C$102,2))","v":""},null,null,null,{"$f":"IF(IL5=\"\",\"\",VLOOKUP(IL5,Teilnehmer!$A$3:$C$102,2))","v":""},null,null,{"$f":"IF(IO5=\"\",\"\",VLOOKUP(IO5,Teilnehmer!$A$3:$C$102,2))","v":""},null,null,null,{"$f":"IF(IS5=\"\",\"\",VLOOKUP(IS5,Teilnehmer!$A$3:$C$102,2))","v":""},null,null,{"$f":"IF(IV5=\"\",\"\",VLOOKUP(IV5,Teilnehmer!$A$3:$C$102,2))","v":""},null,null,null,{"$f":"IF(IZ5=\"\",\"\",VLOOKUP(IZ5,Teilnehmer!$A$3:$C$102,2))","v":""},null,null,{"$f":"IF(JC5=\"\",\"\",VLOOKUP(JC5,Teilnehmer!$A$3:$C$102,2))","v":""},null,null,null,{"$f":"IF(JG5=\"\",\"\",VLOOKUP(JG5,Teilnehmer!$A$3:$C$102,2))","v":""},null,null,{"$f":"IF(JJ5=\"\",\"\",VLOOKUP(JJ5,Teilnehmer!$A$3:$C$102,2))","v":""},null,null,null,{"$f":"IF(JN5=\"\",\"\",VLOOKUP(JN5,Teilnehmer!$A$3:$C$102,2))","v":""},null,null,{"$f":"IF(JQ5=\"\",\"\",VLOOKUP(JQ5,Teilnehmer!$A$3:$C$102,2))","v":""},null,null,null,{"$f":"IF(JU5=\"\",\"\",VLOOKUP(JU5,Teilnehmer!$A$3:$C$102,2))","v":""},null,null,{"$f":"IF(JX5=\"\",\"\",VLOOKUP(JX5,Teilnehmer!$A$3:$C$102,2))","v":""},null,null,null,{"$f":"IF(KB5=\"\",\"\",VLOOKUP(KB5,Teilnehmer!$A$3:$C$102,2))","v":""},null,null,{"$f":"IF(KE5=\"\",\"\",VLOOKUP(KE5,Teilnehmer!$A$3:$C$102,2))","v":""},null,null,null,{"$f":"IF(KI5=\"\",\"\",VLOOKUP(KI5,Teilnehmer!$A$3:$C$102,2))","v":""},null,null,{"$f":"IF(KL5=\"\",\"\",VLOOKUP(KL5,Teilnehmer!$A$3:$C$102,2))","v":""},null,null,null,{"$f":"IF(KP5=\"\",\"\",VLOOKUP(KP5,Teilnehmer!$A$3:$C$102,2))","v":""},null,null,{"$f":"IF(KS5=\"\",\"\",VLOOKUP(KS5,Teilnehmer!$A$3:$C$102,2))","v":""}]
[null,{"$f":"IF(A6=\"\",\"\",VLOOKUP(A6,Teilnehmer!$A$3:$C$102,2))","v":""},null,null,{"$f":"IF(D6=\"\",\"\",VLOOKUP(D6,Teilnehmer!$A$3:$C$102,2))","v":""},null,null,null,{"$f":"IF(H6=\"\",\"\",VLOOKUP(H6,Teilnehmer!$A$3:$C$102,2))","v":""},null,null,{"$f":"IF(K6=\"\",\"\",VLOOKUP(K6,Teilnehmer!$A$3:$C$102,2))","v":""},null,null,null,{"$f":"IF(O6=\"\",\"\",VLOOKUP(O6,Teilnehmer!$A$3:$C$102,2))","v":""},null,null,{"$f":"IF(R6=\"\",\"\",VLOOKUP(R6,Teilnehmer!$A$3:$C$102,2))","v":""},null,null,null,{"$f":"IF(V6=\"\",\"\",VLOOKUP(V6,Teilnehmer!$A$3:$C$102,2))","v":""},null,null,{"$f":"IF(Y6=\"\",\"\",VLOOKUP(Y6,Teilnehmer!$A$3:$C$102,2))","v":""},null,null,null,{"$f":"IF(AC6=\"\",\"\",VLOOKUP(AC6,Teilnehmer!$A$3:$C$102,2))","v":""},null,null,{"$f":"IF(AF6=\"\",\"\",VLOOKUP(AF6,Teilnehmer!$A$3:$C$102,2))","v":""},null,null,null,{"$f":"IF(AJ6=\"\",\"\",VLOOKUP(AJ6,Teilnehmer!$A$3:$C$102,2))","v":""},null,null,{"$f":"IF(AM6=\"\",\"\",VLOOKUP(AM6,Teilnehmer!$A$3:$C$102,2))","v":""},null,null,null,{"$f":"IF(AQ6=\"\",\"\",VLOOKUP(AQ6,Teilnehmer!$A$3:$C$102,2))","v":""},null,null,{"$f":"IF(AT6=\"\",\"\",VLOOKUP(AT6,Teilnehmer!$A$3:$C$102,2))","v":""},null,null,null,{"$f":"IF(AX6=\"\",\"\",VLOOKUP(AX6,Teilnehmer!$A$3:$C$102,2))","v":""},null,null,{"$f":"IF(BA6=\"\",\"\",VLOOKUP(BA6,Teilnehmer!$A$3:$C$102,2))","v":""},null,null,null,{"$f":"IF(BE6=\"\",\"\",VLOOKUP(BE6,Teilnehmer!$A$3:$C$102,2))","v":""},null,null,{"$f":"IF(BH6=\"\",\"\",VLOOKUP(BH6,Teilnehmer!$A$3:$C$102,2))","v":""},null,null,null,{"$f":"IF(BL6=\"\",\"\",VLOOKUP(BL6,Teilnehmer!$A$3:$C$102,2))","v":""},null,null,{"$f":"IF(BO6=\"\",\"\",VLOOKUP(BO6,Teilnehmer!$A$3:$C$102,2))","v":""},null,null,null,{"$f":"IF(BS6=\"\",\"\",VLOOKUP(BS6,Teilnehmer!$A$3:$C$102,2))","v":""},null,null,{"$f":"IF(BV6=\"\",\"\",VLOOKUP(BV6,Teilnehmer!$A$3:$C$102,2))","v":""},null,null,null,{"$f":"IF(BZ6=\"\",\"\",VLOOKUP(BZ6,Teilnehmer!$A$3:$C$102,2))","v":""},null,null,{"$f":"IF(CC6=\"\",\"\",VLOOKUP(CC6,Teilnehmer!$A$3:$C$102,2))","v":""},null,null,null,{"$f":"IF(CG6=\"\",\"\",VLOOKUP(CG6,Teilnehmer!$A$3:$C$102,2))","v":""},null,null,{"$f":"IF(CJ6=\"\",\"\",VLOOKUP(CJ6,Teilnehmer!$A$3:$C$102,2))","v":""},null,null,null,{"$f":"IF(CN6=\"\",\"\",VLOOKUP(CN6,Teilnehmer!$A$3:$C$102,2))","v":""},null,null,{"$f":"IF(CQ6=\"\",\"\",VLOOKUP(CQ6,Teilnehmer!$A$3:$C$102,2))","v":""},null,null,null,{"$f":"IF(CU6=\"\",\"\",VLOOKUP(CU6,Teilnehmer!$A$3:$C$102,2))","v":""},null,null,{"$f":"IF(CX6=\"\",\"\",VLOOKUP(CX6,Teilnehmer!$A$3:$C$102,2))","v":""},null,null,null,{"$f":"IF(DB6=\"\",\"\",VLOOKUP(DB6,Teilnehmer!$A$3:$C$102,2))","v":""},null,null,{"$f":"IF(DE6=\"\",\"\",VLOOKUP(DE6,Teilnehmer!$A$3:$C$102,2))","v":""},null,null,null,{"$f":"IF(DI6=\"\",\"\",VLOOKUP(DI6,Teilnehmer!$A$3:$C$102,2))","v":""},null,null,{"$f":"IF(DL6=\"\",\"\",VLOOKUP(DL6,Teilnehmer!$A$3:$C$102,2))","v":""},null,null,null,{"$f":"IF(DP6=\"\",\"\",VLOOKUP(DP6,Teilnehmer!$A$3:$C$102,2))","v":""},null,null,{"$f":"IF(DS6=\"\",\"\",VLOOKUP(DS6,Teilnehmer!$A$3:$C$102,2))","v":""},null,null,null,{"$f":"IF(DW6=\"\",\"\",VLOOKUP(DW6,Teilnehmer!$A$3:$C$102,2))","v":""},null,null,{"$f":"IF(DZ6=\"\",\"\",VLOOKUP(DZ6,Teilnehmer!$A$3:$C$102,2))","v":""},null,null,null,{"$f":"IF(ED6=\"\",\"\",VLOOKUP(ED6,Teilnehmer!$A$3:$C$102,2))","v":""},null,null,{"$f":"IF(EG6=\"\",\"\",VLOOKUP(EG6,Teilnehmer!$A$3:$C$102,2))","v":""},null,null,null,{"$f":"IF(EK6=\"\",\"\",VLOOKUP(EK6,Teilnehmer!$A$3:$C$102,2))","v":""},null,null,{"$f":"IF(EN6=\"\",\"\",VLOOKUP(EN6,Teilnehmer!$A$3:$C$102,2))","v":""},null,null,null,{"$f":"IF(ER6=\"\",\"\",VLOOKUP(ER6,Teilnehmer!$A$3:$C$102,2))","v":""},null,null,{"$f":"IF(EU6=\"\",\"\",VLOOKUP(EU6,Teilnehmer!$A$3:$C$102,2))","v":""},null,null,null,{"$f":"IF(EY6=\"\",\"\",VLOOKUP(EY6,Teilnehmer!$A$3:$C$102,2))","v":""},null,null,{"$f":"IF(FB6=\"\",\"\",VLOOKUP(FB6,Teilnehmer!$A$3:$C$102,2))","v":""},null,null,null,{"$f":"IF(FF6=\"\",\"\",VLOOKUP(FF6,Teilnehmer!$A$3:$C$102,2))","v":""},null,null,{"$f":"IF(FI6=\"\",\"\",VLOOKUP(FI6,Teilnehmer!$A$3:$C$102,2))","v":""},null,null,null,{"$f":"IF(FM6=\"\",\"\",VLOOKUP(FM6,Teilnehmer!$A$3:$C$102,2))","v":""},null,null,{"$f":"IF(FP6=\"\",\"\",VLOOKUP(FP6,Teilnehmer!$A$3:$C$102,2))","v":""},null,null,null,{"$f":"IF(FT6=\"\",\"\",VLOOKUP(FT6,Teilnehmer!$A$3:$C$102,2))","v":""},null,null,{"$f":"IF(FW6=\"\",\"\",VLOOKUP(FW6,Teilnehmer!$A$3:$C$102,2))","v":""},null,null,null,{"$f":"IF(GA6=\"\",\"\",VLOOKUP(GA6,Teilnehmer!$A$3:$C$102,2))","v":""},null,null,{"$f":"IF(GD6=\"\",\"\",VLOOKUP(GD6,Teilnehmer!$A$3:$C$102,2))","v":""},null,null,null,{"$f":"IF(GH6=\"\",\"\",VLOOKUP(GH6,Teilnehmer!$A$3:$C$102,2))","v":""},null,null,{"$f":"IF(GK6=\"\",\"\",VLOOKUP(GK6,Teilnehmer!$A$3:$C$102,2))","v":""},null,null,null,{"$f":"IF(GO6=\"\",\"\",VLOOKUP(GO6,Teilnehmer!$A$3:$C$102,2))","v":""},null,null,{"$f":"IF(GR6=\"\",\"\",VLOOKUP(GR6,Teilnehmer!$A$3:$C$102,2))","v":""},null,null,null,{"$f":"IF(GV6=\"\",\"\",VLOOKUP(GV6,Teilnehmer!$A$3:$C$102,2))","v":""},null,null,{"$f":"IF(GY6=\"\",\"\",VLOOKUP(GY6,Teilnehmer!$A$3:$C$102,2))","v":""},null,null,null,{"$f":"IF(HC6=\"\",\"\",VLOOKUP(HC6,Teilnehmer!$A$3:$C$102,2))","v":""},null,null,{"$f":"IF(HF6=\"\",\"\",VLOOKUP(HF6,Teilnehmer!$A$3:$C$102,2))","v":""},null,null,null,{"$f":"IF(HJ6=\"\",\"\",VLOOKUP(HJ6,Teilnehmer!$A$3:$C$102,2))","v":""},null,null,{"$f":"IF(HM6=\"\",\"\",VLOOKUP(HM6,Teilnehmer!$A$3:$C$102,2))","v":""},null,null,null,{"$f":"IF(HQ6=\"\",\"\",VLOOKUP(HQ6,Teilnehmer!$A$3:$C$102,2))","v":""},null,null,{"$f":"IF(HT6=\"\",\"\",VLOOKUP(HT6,Teilnehmer!$A$3:$C$102,2))","v":""},null,null,null,{"$f":"IF(HX6=\"\",\"\",VLOOKUP(HX6,Teilnehmer!$A$3:$C$102,2))","v":""},null,null,{"$f":"IF(IA6=\"\",\"\",VLOOKUP(IA6,Teilnehmer!$A$3:$C$102,2))","v":""},null,null,null,{"$f":"IF(IE6=\"\",\"\",VLOOKUP(IE6,Teilnehmer!$A$3:$C$102,2))","v":""},null,null,{"$f":"IF(IH6=\"\",\"\",VLOOKUP(IH6,Teilnehmer!$A$3:$C$102,2))","v":""},null,null,null,{"$f":"IF(IL6=\"\",\"\",VLOOKUP(IL6,Teilnehmer!$A$3:$C$102,2))","v":""},null,null,{"$f":"IF(IO6=\"\",\"\",VLOOKUP(IO6,Teilnehmer!$A$3:$C$102,2))","v":""},null,null,null,{"$f":"IF(IS6=\"\",\"\",VLOOKUP(IS6,Teilnehmer!$A$3:$C$102,2))","v":""},null,null,{"$f":"IF(IV6=\"\",\"\",VLOOKUP(IV6,Teilnehmer!$A$3:$C$102,2))","v":""},null,null,null,{"$f":"IF(IZ6=\"\",\"\",VLOOKUP(IZ6,Teilnehmer!$A$3:$C$102,2))","v":""},null,null,{"$f":"IF(JC6=\"\",\"\",VLOOKUP(JC6,Teilnehmer!$A$3:$C$102,2))","v":""},null,null,null,{"$f":"IF(JG6=\"\",\"\",VLOOKUP(JG6,Teilnehmer!$A$3:$C$102,2))","v":""},null,null,{"$f":"IF(JJ6=\"\",\"\",VLOOKUP(JJ6,Teilnehmer!$A$3:$C$102,2))","v":""},null,null,null,{"$f":"IF(JN6=\"\",\"\",VLOOKUP(JN6,Teilnehmer!$A$3:$C$102,2))","v":""},null,null,{"$f":"IF(JQ6=\"\",\"\",VLOOKUP(JQ6,Teilnehmer!$A$3:$C$102,2))","v":""},null,null,null,{"$f":"IF(JU6=\"\",\"\",VLOOKUP(JU6,Teilnehmer!$A$3:$C$102,2))","v":""},null,null,{"$f":"IF(JX6=\"\",\"\",VLOOKUP(JX6,Teilnehmer!$A$3:$C$102,2))","v":""},null,null,null,{"$f":"IF(KB6=\"\",\"\",VLOOKUP(KB6,Teilnehmer!$A$3:$C$102,2))","v":""},null,null,{"$f":"IF(KE6=\"\",\"\",VLOOKUP(KE6,Teilnehmer!$A$3:$C$102,2))","v":""},null,null,null,{"$f":"IF(KI6=\"\",\"\",VLOOKUP(KI6,Teilnehmer!$A$3:$C$102,2))","v":""},null,null,{"$f":"IF(KL6=\"\",\"\",VLOOKUP(KL6,Teilnehmer!$A$3:$C$102,2))","v":""},null,null,null,{"$f":"IF(KP6=\"\",\"\",VLOOKUP(KP6,Teilnehmer!$A$3:$C$102,2))","v":""},null,null,{"$f":"IF(KS6=\"\",\"\",VLOOKUP(KS6,Teilnehmer!$A$3:$C$102,2))","v":""}]
[null,{"$f":"IF(A7=\"\",\"\",VLOOKUP(A7,Teilnehmer!$A$3:$C$102,2))","v":""},null,null,{"$f":"IF(D7=\"\",\"\",VLOOKUP(D7,Teilnehmer!$A$3:$C$102,2))","v":""},null,null,null,{"$f":"IF(H7=\"\",\"\",VLOOKUP(H7,Teilnehmer!$A$3:$C$102,2))","v":""},null,null,{"$f":"IF(K7=\"\",\"\",VLOOKUP(K7,Teilnehmer!$A$3:$C$102,2))","v":""},null,null,null,{"$f":"IF(O7=\"\",\"\",VLOOKUP(O7,Teilnehmer!$A$3:$C$102,2))","v":""},null,null,{"$f":"IF(R7=\"\",\"\",VLOOKUP(R7,Teilnehmer!$A$3:$C$102,2))","v":""},null,null,null,{"$f":"IF(V7=\"\",\"\",VLOOKUP(V7,Teilnehmer!$A$3:$C$102,2))","v":""},null,null,{"$f":"IF(Y7=\"\",\"\",VLOOKUP(Y7,Teilnehmer!$A$3:$C$102,2))","v":""},null,null,null,{"$f":"IF(AC7=\"\",\"\",VLOOKUP(AC7,Teilnehmer!$A$3:$C$102,2))","v":""},null,null,{"$f":"IF(AF7=\"\",\"\",VLOOKUP(AF7,Teilnehmer!$A$3:$C$102,2))","v":""},null,null,null,{"$f":"IF(AJ7=\"\",\"\",VLOOKUP(AJ7,Teilnehmer!$A$3:$C$102,2))","v":""},null,null,{"$f":"IF(AM7=\"\",\"\",VLOOKUP(AM7,Teilnehmer!$A$3:$C$102,2))","v":""},null,null,null,{"$f":"IF(AQ7=\"\",\"\",VLOOKUP(AQ7,Teilnehmer!$A$3:$C$102,2))","v":""},null,null,{"$f":"IF(AT7=\"\",\"\",VLOOKUP(AT7,Teilnehmer!$A$3:$C$102,2))","v":""},null,null,null,{"$f":"IF(AX7=\"\",\"\",VLOOKUP(AX7,Teilnehmer!$A$3:$C$102,2))","v":""},null,null,{"$f":"IF(BA7=\"\",\"\",VLOOKUP(BA7,Teilnehmer!$A$3:$C$102,2))","v":""},null,null,null,{"$f":"IF(BE7=\"\",\"\",VLOOKUP(BE7,Teilnehmer!$A$3:$C$102,2))","v":""},null,null,{"$f":"IF(BH7=\"\",\"\",VLOOKUP(BH7,Teilnehmer!$A$3:$C$102,2))","v":""},null,null,null,{"$f":"IF(BL7=\"\",\"\",VLOOKUP(BL7,Teilnehmer!$A$3:$C$102,2))","v":""},null,null,{"$f":"IF(BO7=\"\",\"\",VLOOKUP(BO7,Teilnehmer!$A$3:$C$102,2))","v":""},null,null,null,{"$f":"IF(BS7=\"\",\"\",VLOOKUP(BS7,Teilnehmer!$A$3:$C$102,2))","v":""},null,null,{"$f":"IF(BV7=\"\",\"\",VLOOKUP(BV7,Teilnehmer!$A$3:$C$102,2))","v":""},null,null,null,{"$f":"IF(BZ7=\"\",\"\",VLOOKUP(BZ7,Teilnehmer!$A$3:$C$102,2))","v":""},null,null,{"$f":"IF(CC7=\"\",\"\",VLOOKUP(CC7,Teilnehmer!$A$3:$C$102,2))","v":""},null,null,null,{"$f":"IF(CG7=\"\",\"\",VLOOKUP(CG7,Teilnehmer!$A$3:$C$102,2))","v":""},null,null,{"$f":"IF(CJ7=\"\",\"\",VLOOKUP(CJ7,Teilnehmer!$A$3:$C$102,2))","v":""},null,null,null,{"$f":"IF(CN7=\"\",\"\",VLOOKUP(CN7,Teilnehmer!$A$3:$C$102,2))","v":""},null,null,{"$f":"IF(CQ7=\"\",\"\",VLOOKUP(CQ7,Teilnehmer!$A$3:$C$102,2))","v":""},null,null,null,{"$f":"IF(CU7=\"\",\"\",VLOOKUP(CU7,Teilnehmer!$A$3:$C$102,2))","v":""},null,null,{"$f":"IF(CX7=\"\",\"\",VLOOKUP(CX7,Teilnehmer!$A$3:$C$102,2))","v":""},null,null,null,{"$f":"IF(DB7=\"\",\"\",VLOOKUP(DB7,Teilnehmer!$A$3:$C$102,2))","v":""},null,null,{"$f":"IF(DE7=\"\",\"\",VLOOKUP(DE7,Teilnehmer!$A$3:$C$102,2))","v":""},null,null,null,{"$f":"IF(DI7=\"\",\"\",VLOOKUP(DI7,Teilnehmer!$A$3:$C$102,2))","v":""},null,null,{"$f":"IF(DL7=\"\",\"\",VLOOKUP(DL7,Teilnehmer!$A$3:$C$102,2))","v":""},null,null,null,{"$f":"IF(DP7=\"\",\"\",VLOOKUP(DP7,Teilnehmer!$A$3:$C$102,2))","v":""},null,null,{"$f":"IF(DS7=\"\",\"\",VLOOKUP(DS7,Teilnehmer!$A$3:$C$102,2))","v":""},null,null,null,{"$f":"IF(DW7=\"\",\"\",VLOOKUP(DW7,Teilnehmer!$A$3:$C$102,2))","v":""},null,null,{"$f":"IF(DZ7=\"\",\"\",VLOOKUP(DZ7,Teilnehmer!$A$3:$C$102,2))","v":""},null,null,null,{"$f":"IF(ED7=\"\",\"\",VLOOKUP(ED7,Teilnehmer!$A$3:$C$102,2))","v":""},null,null,{"$f":"IF(EG7=\"\",\"\",VLOOKUP(EG7,Teilnehmer!$A$3:$C$102,2))","v":""},null,null,null,{"$f":"IF(EK7=\"\",\"\",VLOOKUP(EK7,Teilnehmer!$A$3:$C$102,2))","v":""},null,null,{"$f":"IF(EN7=\"\",\"\",VLOOKUP(EN7,Teilnehmer!$A$3:$C$102,2))","v":""},null,null,null,{"$f":"IF(ER7=\"\",\"\",VLOOKUP(ER7,Teilnehmer!$A$3:$C$102,2))","v":""},null,null,{"$f":"IF(EU7=\"\",\"\",VLOOKUP(EU7,Teilnehmer!$A$3:$C$102,2))","v":""},null,null,null,{"$f":"IF(EY7=\"\",\"\",VLOOKUP(EY7,Teilnehmer!$A$3:$C$102,2))","v":""},null,null,{"$f":"IF(FB7=\"\",\"\",VLOOKUP(FB7,Teilnehmer!$A$3:$C$102,2))","v":""},null,null,null,{"$f":"IF(FF7=\"\",\"\",VLOOKUP(FF7,Teilnehmer!$A$3:$C$102,2))","v":""},null,null,{"$f":"IF(FI7=\"\",\"\",VLOOKUP(FI7,Teilnehmer!$A$3:$C$102,2))","v":""},null,null,null,{"$f":"IF(FM7=\"\",\"\",VLOOKUP(FM7,Teilnehmer!$A$3:$C$102,2))","v":""},null,null,{"$f":"IF(FP7=\"\",\"\",VLOOKUP(FP7,Teilnehmer!$A$3:$C$102,2))","v":""},null,null,null,{"$f":"IF(FT7=\"\",\"\",VLOOKUP(FT7,Teilnehmer!$A$3:$C$102,2))","v":""},null,null,{"$f":"IF(FW7=\"\",\"\",VLOOKUP(FW7,Teilnehmer!$A$3:$C$102,2))","v":""},null,null,null,{"$f":"IF(GA7=\"\",\"\",VLOOKUP(GA7,Teilnehmer!$A$3:$C$102,2))","v":""},null,null,{"$f":"IF(GD7=\"\",\"\",VLOOKUP(GD7,Teilnehmer!$A$3:$C$102,2))","v":""},null,null,null,{"$f":"IF(GH7=\"\",\"\",VLOOKUP(GH7,Teilnehmer!$A$3:$C$102,2))","v":""},null,null,{"$f":"IF(GK7=\"\",\"\",VLOOKUP(GK7,Teilnehmer!$A$3:$C$102,2))","v":""},null,null,null,{"$f":"IF(GO7=\"\",\"\",VLOOKUP(GO7,Teilnehmer!$A$3:$C$102,2))","v":""},null,null,{"$f":"IF(GR7=\"\",\"\",VLOOKUP(GR7,Teilnehmer!$A$3:$C$102,2))","v":""},null,null,null,{"$f":"IF(GV7=\"\",\"\",VLOOKUP(GV7,Teilnehmer!$A$3:$C$102,2))","v":""},null,null,{"$f":"IF(GY7=\"\",\"\",VLOOKUP(GY7,Teilnehmer!$A$3:$C$102,2))","v":""},null,null,null,{"$f":"IF(HC7=\"\",\"\",VLOOKUP(HC7,Teilnehmer!$A$3:$C$102,2))","v":""},null,null,{"$f":"IF(HF7=\"\",\"\",VLOOKUP(HF7,Teilnehmer!$A$3:$C$102,2))","v":""},null,null,null,{"$f":"IF(HJ7=\"\",\"\",VLOOKUP(HJ7,Teilnehmer!$A$3:$C$102,2))","v":""},null,null,{"$f":"IF(HM7=\"\",\"\",VLOOKUP(HM7,Teilnehmer!$A$3:$C$102,2))","v":""},null,null,null,{"$f":"IF(HQ7=\"\",\"\",VLOOKUP(HQ7,Teilnehmer!$A$3:$C$102,2))","v":""},null,null,{"$f":"IF(HT7=\"\",\"\",VLOOKUP(HT7,Teilnehmer!$A$3:$C$102,2))","v":""},null,null,null,{"$f":"IF(HX7=\"\",\"\",VLOOKUP(HX7,Teilnehmer!$A$3:$C$102,2))","v":""},null,null,{"$f":"IF(IA7=\"\",\"\",VLOOKUP(IA7,Teilnehmer!$A$3:$C$102,2))","v":""},null,null,null,{"$f":"IF(IE7=\"\",\"\",VLOOKUP(IE7,Teilnehmer!$A$3:$C$102,2))","v":""},null,null,{"$f":"IF(IH7=\"\",\"\",VLOOKUP(IH7,Teilnehmer!$A$3:$C$102,2))","v":""},null,null,null,{"$f":"IF(IL7=\"\",\"\",VLOOKUP(IL7,Teilnehmer!$A$3:$C$102,2))","v":""},null,null,{"$f":"IF(IO7=\"\",\"\",VLOOKUP(IO7,Teilnehmer!$A$3:$C$102,2))","v":""},null,null,null,{"$f":"IF(IS7=\"\",\"\",VLOOKUP(IS7,Teilnehmer!$A$3:$C$102,2))","v":""},null,null,{"$f":"IF(IV7=\"\",\"\",VLOOKUP(IV7,Teilnehmer!$A$3:$C$102,2))","v":""},null,null,null,{"$f":"IF(IZ7=\"\",\"\",VLOOKUP(IZ7,Teilnehmer!$A$3:$C$102,2))","v":""},null,null,{"$f":"IF(JC7=\"\",\"\",VLOOKUP(JC7,Teilnehmer!$A$3:$C$102,2))","v":""},null,null,null,{"$f":"IF(JG7=\"\",\"\",VLOOKUP(JG7,Teilnehmer!$A$3:$C$102,2))","v":""},null,null,{"$f":"IF(JJ7=\"\",\"\",VLOOKUP(JJ7,Teilnehmer!$A$3:$C$102,2))","v":""},null,null,null,{"$f":"IF(JN7=\"\",\"\",VLOOKUP(JN7,Teilnehmer!$A$3:$C$102,2))","v":""},null,null,{"$f":"IF(JQ7=\"\",\"\",VLOOKUP(JQ7,Teilnehmer!$A$3:$C$102,2))","v":""},null,null,null,{"$f":"IF(JU7=\"\",\"\",VLOOKUP(JU7,Teilnehmer!$A$3:$C$102,2))","v":""},null,null,{"$f":"IF(JX7=\"\",\"\",VLOOKUP(JX7,Teilnehmer!$A$3:$C$102,2))","v":""},null,null,null,{"$f":"IF(KB7=\"\",\"\",VLOOKUP(KB7,Teilnehmer!$A$3:$C$102,2))","v":""},null,null,{"$f":"IF(KE7=\"\",\"\",VLOOKUP(KE7,Teilnehmer!$A$3:$C$102,2))","v":""},null,null,null,{"$f":"IF(KI7=\"\",\"\",VLOOKUP(KI7,Teilnehmer!$A$3:$C$102,2))","v":""},null,null,{"$f":"IF(KL7=\"\",\"\",VLOOKUP(KL7,Teilnehmer!$A$3:$C$102,2))","v":""},null,null,null,{"$f":"IF(KP7=\"\",\"\",VLOOKUP(KP7,Teilnehmer!$A$3:$C$102,2))","v":""},null,null,{"$f":"IF(KS7=\"\",\"\",VLOOKUP(KS7,Teilnehmer!$A$3:$C$102,2))","v":""}]
[null,{"$f":"IF(A8=\"\",\"\",VLOOKUP(A8,Teilnehmer!$A$3:$C$102,2))","v":""},null,null,{"$f":"IF(D8=\"\",\"\",VLOOKUP(D8,Teilnehmer!$A$3:$C$102,2))","v":""},null,null,null,{"$f":"IF(H8=\"\",\"\",VLOOKUP(H8,Teilnehmer!$A$3:$C$102,2))","v":""},null,null,{"$f":"IF(K8=\"\",\"\",VLOOKUP(K8,Teilnehmer!$A$3:$C$102,2))","v":""},null,null,null,{"$f":"IF(O8=\"\",\"\",VLOOKUP(O8,Teilnehmer!$A$3:$C$102,2))","v":""},null,null,{"$f":"IF(R8=\"\",\"\",VLOOKUP(R8,Teilnehmer!$A$3:$C$102,2))","v":""},null,null,null,{"$f":"IF(V8=\"\",\"\",VLOOKUP(V8,Teilnehmer!$A$3:$C$102,2))","v":""},null,null,{"$f":"IF(Y8=\"\",\"\",VLOOKUP(Y8,Teilnehmer!$A$3:$C$102,2))","v":""},null,null,null,{"$f":"IF(AC8=\"\",\"\",VLOOKUP(AC8,Teilnehmer!$A$3:$C$102,2))","v":""},null,null,{"$f":"IF(AF8=\"\",\"\",VLOOKUP(AF8,Teilnehmer!$A$3:$C$102,2))","v":""},null,null,null,{"$f":"IF(AJ8=\"\",\"\",VLOOKUP(AJ8,Teilnehmer!$A$3:$C$102,2))","v":""},null,null,{"$f":"IF(AM8=\"\",\"\",VLOOKUP(AM8,Teilnehmer!$A$3:$C$102,2))","v":""},null,null,null,{"$f":"IF(AQ8=\"\",\"\",VLOOKUP(AQ8,Teilnehmer!$A$3:$C$102,2))","v":""},null,null,{"$f":"IF(AT8=\"\",\"\",VLOOKUP(AT8,Teilnehmer!$A$3:$C$102,2))","v":""},null,null,null,{"$f":"IF(AX8=\"\",\"\",VLOOKUP(AX8,Teilnehmer!$A$3:$C$102,2))","v":""},null,null,{"$f":"IF(BA8=\"\",\"\",VLOOKUP(BA8,Teilnehmer!$A$3:$C$102,2))","v":""},null,null,null,{"$f":"IF(BE8=\"\",\"\",VLOOKUP(BE8,Teilnehmer!$A$3:$C$102,2))","v":""},null,null,{"$f":"IF(BH8=\"\",\"\",VLOOKUP(BH8,Teilnehmer!$A$3:$C$102,2))","v":""},null,null,null,{"$f":"IF(BL8=\"\",\"\",VLOOKUP(BL8,Teilnehmer!$A$3:$C$102,2))","v":""},null,null,{"$f":"IF(BO8=\"\",\"\",VLOOKUP(BO8,Teilnehmer!$A$3:$C$102,2))","v":""},null,null,null,{"$f":"IF(BS8=\"\",\"\",VLOOKUP(BS8,Teilnehmer!$A$3:$C$102,2))","v":""},null,null,{"$f":"IF(BV8=\"\",\"\",VLOOKUP(BV8,Teilnehmer!$A$3:$C$102,2))","v":""},null,null,null,{"$f":"IF(BZ8=\"\",\"\",VLOOKUP(BZ8,Teilnehmer!$A$3:$C$102,2))","v":""},null,null,{"$f":"IF(CC8=\"\",\"\",VLOOKUP(CC8,Teilnehmer!$A$3:$C$102,2))","v":""},null,null,null,{"$f":"IF(CG8=\"\",\"\",VLOOKUP(CG8,Teilnehmer!$A$3:$C$102,2))","v":""},null,null,{"$f":"IF(CJ8=\"\",\"\",VLOOKUP(CJ8,Teilnehmer!$A$3:$C$102,2))","v":""},null,null,null,{"$f":"IF(CN8=\"\",\"\",VLOOKUP(CN8,Teilnehmer!$A$3:$C$102,2))","v":""},null,null,{"$f":"IF(CQ8=\"\",\"\",VLOOKUP(CQ8,Teilnehmer!$A$3:$C$102,2))","v":""},null,null,null,{"$f":"IF(CU8=\"\",\"\",VLOOKUP(CU8,Teilnehmer!$A$3:$C$102,2))","v":""},null,null,{"$f":"IF(CX8=\"\",\"\",VLOOKUP(CX8,Teilnehmer!$A$3:$C$102,2))","v":""},null,null,null,{"$f":"IF(DB8=\"\",\"\",VLOOKUP(DB8,Teilnehmer!$A$3:$C$102,2))","v":""},null,null,{"$f":"IF(DE8=\"\",\"\",VLOOKUP(DE8,Teilnehmer!$A$3:$C$102,2))","v":""},null,null,null,{"$f":"IF(DI8=\"\",\"\",VLOOKUP(DI8,Teilnehmer!$A$3:$C$102,2))","v":""},null,null,{"$f":"IF(DL8=\"\",\"\",VLOOKUP(DL8,Teilnehmer!$A$3:$C$102,2))","v":""},null,null,null,{"$f":"IF(DP8=\"\",\"\",VLOOKUP(DP8,Teilnehmer!$A$3:$C$102,2))","v":""},null,null,{"$f":"IF(DS8=\"\",\"\",VLOOKUP(DS8,Teilnehmer!$A$3:$C$102,2))","v":""},null,null,null,{"$f":"IF(DW8=\"\",\"\",VLOOKUP(DW8,Teilnehmer!$A$3:$C$102,2))","v":""},null,null,{"$f":"IF(DZ8=\"\",\"\",VLOOKUP(DZ8,Teilnehmer!$A$3:$C$102,2))","v":""},null,null,null,{"$f":"IF(ED8=\"\",\"\",VLOOKUP(ED8,Teilnehmer!$A$3:$C$102,2))","v":""},null,null,{"$f":"IF(EG8=\"\",\"\",VLOOKUP(EG8,Teilnehmer!$A$3:$C$102,2))","v":""},null,null,null,{"$f":"IF(EK8=\"\",\"\",VLOOKUP(EK8,Teilnehmer!$A$3:$C$102,2))","v":""},null,null,{"$f":"IF(EN8=\"\",\"\",VLOOKUP(EN8,Teilnehmer!$A$3:$C$102,2))","v":""},null,null,null,{"$f":"IF(ER8=\"\",\"\",VLOOKUP(ER8,Teilnehmer!$A$3:$C$102,2))","v":""},null,null,{"$f":"IF(EU8=\"\",\"\",VLOOKUP(EU8,Teilnehmer!$A$3:$C$102,2))","v":""},null,null,null,{"$f":"IF(EY8=\"\",\"\",VLOOKUP(EY8,Teilnehmer!$A$3:$C$102,2))","v":""},null,null,{"$f":"IF(FB8=\"\",\"\",VLOOKUP(FB8,Teilnehmer!$A$3:$C$102,2))","v":""},null,null,null,{"$f":"IF(FF8=\"\",\"\",VLOOKUP(FF8,Teilnehmer!$A$3:$C$102,2))","v":""},null,null,{"$f":"IF(FI8=\"\",\"\",VLOOKUP(FI8,Teilnehmer!$A$3:$C$102,2))","v":""},null,null,null,{"$f":"IF(FM8=\"\",\"\",VLOOKUP(FM8,Teilnehmer!$A$3:$C$102,2))","v":""},null,null,{"$f":"IF(FP8=\"\",\"\",VLOOKUP(FP8,Teilnehmer!$A$3:$C$102,2))","v":""},null,null,null,{"$f":"IF(FT8=\"\",\"\",VLOOKUP(FT8,Teilnehmer!$A$3:$C$102,2))","v":""},null,null,{"$f":"IF(FW8=\"\",\"\",VLOOKUP(FW8,Teilnehmer!$A$3:$C$102,2))","v":""},null,null,null,{"$f":"IF(GA8=\"\",\"\",VLOOKUP(GA8,Teilnehmer!$A$3:$C$102,2))","v":""},null,null,{"$f":"IF(GD8=\"\",\"\",VLOOKUP(GD8,Teilnehmer!$A$3:$C$102,2))","v":""},null,null,null,{"$f":"IF(GH8=\"\",\"\",VLOOKUP(GH8,Teilnehmer!$A$3:$C$102,2))","v":""},null,null,{"$f":"IF(GK8=\"\",\"\",VLOOKUP(GK8,Teilnehmer!$A$3:$C$102,2))","v":""},null,null,null,{"$f":"IF(GO8=\"\",\"\",VLOOKUP(GO8,Teilnehmer!$A$3:$C$102,2))","v":""},null,null,{"$f":"IF(GR8=\"\",\"\",VLOOKUP(GR8,Teilnehmer!$A$3:$C$102,2))","v":""},null,null,null,{"$f":"IF(GV8=\"\",\"\",VLOOKUP(GV8,Teilnehmer!$A$3:$C$102,2))","v":""},null,null,{"$f":"IF(GY8=\"\",\"\",VLOOKUP(GY8,Teilnehmer!$A$3:$C$102,2))","v":""},null,null,null,{"$f":"IF(HC8=\"\",\"\",VLOOKUP(HC8,Teilnehmer!$A$3:$C$102,2))","v":""},null,null,{"$f":"IF(HF8=\"\",\"\",VLOOKUP(HF8,Teilnehmer!$A$3:$C$102,2))","v":""},null,null,null,{"$f":"IF(HJ8=\"\",\"\",VLOOKUP(HJ8,Teilnehmer!$A$3:$C$102,2))","v":""},null,null,{"$f":"IF(HM8=\"\",\"\",VLOOKUP(HM8,Teilnehmer!$A$3:$C$102,2))","v":""},null,null,null,{"$f":"IF(HQ8=\"\",\"\",VLOOKUP(HQ8,Teilnehmer!$A$3:$C$102,2))","v":""},null,null,{"$f":"IF(HT8=\"\",\"\",VLOOKUP(HT8,Teilnehmer!$A$3:$C$102,2))","v":""},null,null,null,{"$f":"IF(HX8=\"\",\"\",VLOOKUP(HX8,Teilnehmer!$A$3:$C$102,2))","v":""},null,null,{"$f":"IF(IA8=\"\",\"\",VLOOKUP(IA8,Teilnehmer!$A$3:$C$102,2))","v":""},null,null,null,{"$f":"IF(IE8=\"\",\"\",VLOOKUP(IE8,Teilnehmer!$A$3:$C$102,2))","v":""},null,null,{"$f":"IF(IH8=\"\",\"\",VLOOKUP(IH8,Teilnehmer!$A$3:$C$102,2))","v":""},null,null,null,{"$f":"IF(IL8=\"\",\"\",VLOOKUP(IL8,Teilnehmer!$A$3:$C$102,2))","v":""},null,null,{"$f":"IF(IO8=\"\",\"\",VLOOKUP(IO8,Teilnehmer!$A$3:$C$102,2))","v":""},null,null,null,{"$f":"IF(IS8=\"\",\"\",VLOOKUP(IS8,Teilnehmer!$A$3:$C$102,2))","v":""},null,null,{"$f":"IF(IV8=\"\",\"\",VLOOKUP(IV8,Teilnehmer!$A$3:$C$102,2))","v":""},null,null,null,{"$f":"IF(IZ8=\"\",\"\",VLOOKUP(IZ8,Teilnehmer!$A$3:$C$102,2))","v":""},null,null,{"$f":"IF(JC8=\"\",\"\",VLOOKUP(JC8,Teilnehmer!$A$3:$C$102,2))","v":""},null,null,null,{"$f":"IF(JG8=\"\",\"\",VLOOKUP(JG8,Teilnehmer!$A$3:$C$102,2))","v":""},null,null,{"$f":"IF(JJ8=\"\",\"\",VLOOKUP(JJ8,Teilnehmer!$A$3:$C$102,2))","v":""},null,null,null,{"$f":"IF(JN8=\"\",\"\",VLOOKUP(JN8,Teilnehmer!$A$3:$C$102,2))","v":""},null,null,{"$f":"IF(JQ8=\"\",\"\",VLOOKUP(JQ8,Teilnehmer!$A$3:$C$102,2))","v":""},null,null,null,{"$f":"IF(JU8=\"\",\"\",VLOOKUP(JU8,Teilnehmer!$A$3:$C$102,2))","v":""},null,null,{"$f":"IF(JX8=\"\",\"\",VLOOKUP(JX8,Teilnehmer!$A$3:$C$102,2))","v":""},null,null,null,{"$f":"IF(KB8=\"\",\"\",VLOOKUP(KB8,Teilnehmer!$A$3:$C$102,2))","v":""},null,null,{"$f":"IF(KE8=\"\",\"\",VLOOKUP(KE8,Teilnehmer!$A$3:$C$102,2))","v":""},null,null,null,{"$f":"IF(KI8=\"\",\"\",VLOOKUP(KI8,Teilnehmer!$A$3:$C$102,2))","v":""},null,null,{"$f":"IF(KL8=\"\",\"\",VLOOKUP(KL8,Teilnehmer!$A$3:$C$102,2))","v":""},null,null,null,{"$f":"IF(KP8=\"\",\"\",VLOOKUP(KP8,Teilnehmer!$A$3:$C$102,2))","v":""},null,null,{"$f":"IF(KS8=\"\",\"\",VLOOKUP(KS8,Teilnehmer!$A$3:$C$102,2))","v":""}]
[null,{"$f":"IF(A9=\"\",\"\",VLOOKUP(A9,Teilnehmer!$A$3:$C$102,2))","v":""},null,null,{"$f":"IF(D9=\"\",\"\",VLOOKUP(D9,Teilnehmer!$A$3:$C$102,2))","v":""},null,null,null,{"$f":"IF(H9=\"\",\"\",VLOOKUP(H9,Teilnehmer!$A$3:$C$102,2))","v":""},null,null,{"$f":"IF(K9=\"\",\"\",VLOOKUP(K9,Teilnehmer!$A$3:$C$102,2))","v":""},null,null,null,{"$f":"IF(O9=\"\",\"\",VLOOKUP(O9,Teilnehmer!$A$3:$C$102,2))","v":""},null,null,{"$f":"IF(R9=\"\",\"\",VLOOKUP(R9,Teilnehmer!$A$3:$C$102,2))","v":""},null,null,null,{"$f":"IF(V9=\"\",\"\",VLOOKUP(V9,Teilnehmer!$A$3:$C$102,2))","v":""},null,null,{"$f":"IF(Y9=\"\",\"\",VLOOKUP(Y9,Teilnehmer!$A$3:$C$102,2))","v":""},null,null,null,{"$f":"IF(AC9=\"\",\"\",VLOOKUP(AC9,Teilnehmer!$A$3:$C$102,2))","v":""},null,null,{"$f":"IF(AF9=\"\",\"\",VLOOKUP(AF9,Teilnehmer!$A$3:$C$102,2))","v":""},null,null,null,{"$f":"IF(AJ9=\"\",\"\",VLOOKUP(AJ9,Teilnehmer!$A$3:$C$102,2))","v":""},null,null,{"$f":"IF(AM9=\"\",\"\",VLOOKUP(AM9,Teilnehmer!$A$3:$C$102,2))","v":""},null,null,null,{"$f":"IF(AQ9=\"\",\"\",VLOOKUP(AQ9,Teilnehmer!$A$3:$C$102,2))","v":""},null,null,{"$f":"IF(AT9=\"\",\"\",VLOOKUP(AT9,Teilnehmer!$A$3:$C$102,2))","v":""},null,null,null,{"$f":"IF(AX9=\"\",\"\",VLOOKUP(AX9,Teilnehmer!$A$3:$C$102,2))","v":""},null,null,{"$f":"IF(BA9=\"\",\"\",VLOOKUP(BA9,Teilnehmer!$A$3:$C$102,2))","v":""},null,null,null,{"$f":"IF(BE9=\"\",\"\",VLOOKUP(BE9,Teilnehmer!$A$3:$C$102,2))","v":""},null,null,{"$f":"IF(BH9=\"\",\"\",VLOOKUP(BH9,Teilnehmer!$A$3:$C$102,2))","v":""},null,null,null,{"$f":"IF(BL9=\"\",\"\",VLOOKUP(BL9,Teilnehmer!$A$3:$C$102,2))","v":""},null,null,{"$f":"IF(BO9=\"\",\"\",VLOOKUP(BO9,Teilnehmer!$A$3:$C$102,2))","v":""},null,null,null,{"$f":"IF(BS9=\"\",\"\",VLOOKUP(BS9,Teilnehmer!$A$3:$C$102,2))","v":""},null,null,{"$f":"IF(BV9=\"\",\"\",VLOOKUP(BV9,Teilnehmer!$A$3:$C$102,2))","v":""},null,null,null,{"$f":"IF(BZ9=\"\",\"\",VLOOKUP(BZ9,Teilnehmer!$A$3:$C$102,2))","v":""},null,null,{"$f":"IF(CC9=\"\",\"\",VLOOKUP(CC9,Teilnehmer!$A$3:$C$102,2))","v":""},null,null,null,{"$f":"IF(CG9=\"\",\"\",VLOOKUP(CG9,Teilnehmer!$A$3:$C$102,2))","v":""},null,null,{"$f":"IF(CJ9=\"\",\"\",VLOOKUP(CJ9,Teilnehmer!$A$3:$C$102,2))","v":""},null,null,null,{"$f":"IF(CN9=\"\",\"\",VLOOKUP(CN9,Teilnehmer!$A$3:$C$102,2))","v":""},null,null,{"$f":"IF(CQ9=\"\",\"\",VLOOKUP(CQ9,Teilnehmer!$A$3:$C$102,2))","v":""},null,null,null,{"$f":"IF(CU9=\"\",\"\",VLOOKUP(CU9,Teilnehmer!$A$3:$C$102,2))","v":""},null,null,{"$f":"IF(CX9=\"\",\"\",VLOOKUP(CX9,Teilnehmer!$A$3:$C$102,2))","v":""},null,null,null,{"$f":"IF(DB9=\"\",\"\",VLOOKUP(DB9,Teilnehmer!$A$3:$C$102,2))","v":""},null,null,{"$f":"IF(DE9=\"\",\"\",VLOOKUP(DE9,Teilnehmer!$A$3:$C$102,2))","v":""},null,null,null,{"$f":"IF(DI9=\"\",\"\",VLOOKUP(DI9,Teilnehmer!$A$3:$C$102,2))","v":""},null,null,{"$f":"IF(DL9=\"\",\"\",VLOOKUP(DL9,Teilnehmer!$A$3:$C$102,2))","v":""},null,null,null,{"$f":"IF(DP9=\"\",\"\",VLOOKUP(DP9,Teilnehmer!$A$3:$C$102,2))","v":""},null,null,{"$f":"IF(DS9=\"\",\"\",VLOOKUP(DS9,Teilnehmer!$A$3:$C$102,2))","v":""},null,null,null,{"$f":"IF(DW9=\"\",\"\",VLOOKUP(DW9,Teilnehmer!$A$3:$C$102,2))","v":""},null,null,{"$f":"IF(DZ9=\"\",\"\",VLOOKUP(DZ9,Teilnehmer!$A$3:$C$102,2))","v":""},null,null,null,{"$f":"IF(ED9=\"\",\"\",VLOOKUP(ED9,Teilnehmer!$A$3:$C$102,2))","v":""},null,null,{"$f":"IF(EG9=\"\",\"\",VLOOKUP(EG9,Teilnehmer!$A$3:$C$102,2))","v":""},null,null,null,{"$f":"IF(EK9=\"\",\"\",VLOOKUP(EK9,Teilnehmer!$A$3:$C$102,2))","v":""},null,null,{"$f":"IF(EN9=\"\",\"\",VLOOKUP(EN9,Teilnehmer!$A$3:$C$102,2))","v":""},null,null,null,{"$f":"IF(ER9=\"\",\"\",VLOOKUP(ER9,Teilnehmer!$A$3:$C$102,2))","v":""},null,null,{"$f":"IF(EU9=\"\",\"\",VLOOKUP(EU9,Teilnehmer!$A$3:$C$102,2))","v":""},null,null,null,{"$f":"IF(EY9=\"\",\"\",VLOOKUP(EY9,Teilnehmer!$A$3:$C$102,2))","v":""},null,null,{"$f":"IF(FB9=\"\",\"\",VLOOKUP(FB9,Teilnehmer!$A$3:$C$102,2))","v":""},null,null,null,{"$f":"IF(FF9=\"\",\"\",VLOOKUP(FF9,Teilnehmer!$A$3:$C$102,2))","v":""},null,null,{"$f":"IF(FI9=\"\",\"\",VLOOKUP(FI9,Teilnehmer!$A$3:$C$102,2))","v":""},null,null,null,{"$f":"IF(FM9=\"\",\"\",VLOOKUP(FM9,Teilnehmer!$A$3:$C$102,2))","v":""},null,null,{"$f":"IF(FP9=\"\",\"\",VLOOKUP(FP9,Teilnehmer!$A$3:$C$102,2))","v":""},null,null,null,{"$f":"IF(FT9=\"\",\"\",VLOOKUP(FT9,Teilnehmer!$A$3:$C$102,2))","v":""},null,null,{"$f":"IF(FW9=\"\",\"\",VLOOKUP(FW9,Teilnehmer!$A$3:$C$102,2))","v":""},null,null,null,{"$f":"IF(GA9=\"\",\"\",VLOOKUP(GA9,Teilnehmer!$A$3:$C$102,2))","v":""},null,null,{"$f":"IF(GD9=\"\",\"\",VLOOKUP(GD9,Teilnehmer!$A$3:$C$102,2))","v":""},null,null,null,{"$f":"IF(GH9=\"\",\"\",VLOOKUP(GH9,Teilnehmer!$A$3:$C$102,2))","v":""},null,null,{"$f":"IF(GK9=\"\",\"\",VLOOKUP(GK9,Teilnehmer!$A$3:$C$102,2))","v":""},null,null,null,{"$f":"IF(GO9=\"\",\"\",VLOOKUP(GO9,Teilnehmer!$A$3:$C$102,2))","v":""},null,null,{"$f":"IF(GR9=\"\",\"\",VLOOKUP(GR9,Teilnehmer!$A$3:$C$102,2))","v":""},null,null,null,{"$f":"IF(GV9=\"\",\"\",VLOOKUP(GV9,Teilnehmer!$A$3:$C$102,2))","v":""},null,null,{"$f":"IF(GY9=\"\",\"\",VLOOKUP(GY9,Teilnehmer!$A$3:$C$102,2))","v":""},null,null,null,{"$f":"IF(HC9=\"\",\"\",VLOOKUP(HC9,Teilnehmer!$A$3:$C$102,2))","v":""},null,null,{"$f":"IF(HF9=\"\",\"\",VLOOKUP(HF9,Teilnehmer!$A$3:$C$102,2))","v":""},null,null,null,{"$f":"IF(HJ9=\"\",\"\",VLOOKUP(HJ9,Teilnehmer!$A$3:$C$102,2))","v":""},null,null,{"$f":"IF(HM9=\"\",\"\",VLOOKUP(HM9,Teilnehmer!$A$3:$C$102,2))","v":""},null,null,null,{"$f":"IF(HQ9=\"\",\"\",VLOOKUP(HQ9,Teilnehmer!$A$3:$C$102,2))","v":""},null,null,{"$f":"IF(HT9=\"\",\"\",VLOOKUP(HT9,Teilnehmer!$A$3:$C$102,2))","v":""},null,null,null,{"$f":"IF(HX9=\"\",\"\",VLOOKUP(HX9,Teilnehmer!$A$3:$C$102,2))","v":""},null,null,{"$f":"IF(IA9=\"\",\"\",VLOOKUP(IA9,Teilnehmer!$A$3:$C$102,2))","v":""},null,null,null,{"$f":"IF(IE9=\"\",\"\",VLOOKUP(IE9,Teilnehmer!$A$3:$C$102,2))","v":""},null,null,{"$f":"IF(IH9=\"\",\"\",VLOOKUP(IH9,Teilnehmer!$A$3:$C$102,2))","v":""},null,null,null,{"$f":"IF(IL9=\"\",\"\",VLOOKUP(IL9,Teilnehmer!$A$3:$C$102,2))","v":""},null,null,{"$f":"IF(IO9=\"\",\"\",VLOOKUP(IO9,Teilnehmer!$A$3:$C$102,2))","v":""},null,null,null,{"$f":"IF(IS9=\"\",\"\",VLOOKUP(IS9,Teilnehmer!$A$3:$C$102,2))","v":""},null,null,{"$f":"IF(IV9=\"\",\"\",VLOOKUP(IV9,Teilnehmer!$A$3:$C$102,2))","v":""},null,null,null,{"$f":"IF(IZ9=\"\",\"\",VLOOKUP(IZ9,Teilnehmer!$A$3:$C$102,2))","v":""},null,null,{"$f":"IF(JC9=\"\",\"\",VLOOKUP(JC9,Teilnehmer!$A$3:$C$102,2))","v":""},null,null,null,{"$f":"IF(JG9=\"\",\"\",VLOOKUP(JG9,Teilnehmer!$A$3:$C$102,2))","v":""},null,null,{"$f":"IF(JJ9=\"\",\"\",VLOOKUP(JJ9,Teilnehmer!$A$3:$C$102,2))","v":""},null,null,null,{"$f":"IF(JN9=\"\",\"\",VLOOKUP(JN9,Teilnehmer!$A$3:$C$102,2))","v":""},null,null,{"$f":"IF(JQ9=\"\",\"\",VLOOKUP(JQ9,Teilnehmer!$A$3:$C$102,2))","v":""},null,null,null,{"$f":"IF(JU9=\"\",\"\",VLOOKUP(JU9,Teilnehmer!$A$3:$C$102,2))","v":""},null,null,{"$f":"IF(JX9=\"\",\"\",VLOOKUP(JX9,Teilnehmer!$A$3:$C$102,2))","v":""},null,null,null,{"$f":"IF(KB9=\"\",\"\",VLOOKUP(KB9,Teilnehmer!$A$3:$C$102,2))","v":""},null,null,{"$f":"IF(KE9=\"\",\"\",VLOOKUP(KE9,Teilnehmer!$A$3:$C$102,2))","v":""},null,null,null,{"$f":"IF(KI9=\"\",\"\",VLOOKUP(KI9,Teilnehmer!$A$3:$C$102,2))","v":""},null,null,{"$f":"IF(KL9=\"\",\"\",VLOOKUP(KL9,Teilnehmer!$A$3:$C$102,2))","v":""},null,null,null,{"$f":"IF(KP9=\"\",\"\",VLOOKUP(KP9,Teilnehmer!$A$3:$C$102,2))","v":""},null,null,{"$f":"IF(KS9=\"\",\"\",VLOOKUP(KS9,Teilnehmer!$A$3:$C$102,2))","v":""}]
[null,{"$f":"IF(A10=\"\",\"\",VLOOKUP(A10,Teilnehmer!$A$3:$C$102,2))","v":""},null,null,{"$f":"IF(D10=\"\",\"\",VLOOKUP(D10,Teilnehmer!$A$3:$C$102,2))","v":""},null,null,null,{"$f":"IF(H10=\"\",\"\",VLOOKUP(H10,Teilnehmer!$A$3:$C$102,2))","v":""},null,null,{"$f":"IF(K10=\"\",\"\",VLOOKUP(K10,Teilnehmer!$A$3:$C$102,2))","v":""},null,null,null,{"$f":"IF(O10=\"\",\"\",VLOOKUP(O10,Teilnehmer!$A$3:$C$102,2))","v":""},null,null,{"$f":"IF(R10=\"\",\"\",VLOOKUP(R10,Teilnehmer!$A$3:$C$102,2))","v":""},null,null,null,{"$f":"IF(V10=\"\",\"\",VLOOKUP(V10,Teilnehmer!$A$3:$C$102,2))","v":""},null,null,{"$f":"IF(Y10=\"\",\"\",VLOOKUP(Y10,Teilnehmer!$A$3:$C$102,2))","v":""},null,null,null,{"$f":"IF(AC10=\"\",\"\",VLOOKUP(AC10,Teilnehmer!$A$3:$C$102,2))","v":""},null,null,{"$f":"IF(AF10=\"\",\"\",VLOOKUP(AF10,Teilnehmer!$A$3:$C$102,2))","v":""},null,null,null,{"$f":"IF(AJ10=\"\",\"\",VLOOKUP(AJ10,Teilnehmer!$A$3:$C$102,2))","v":""},null,null,{"$f":"IF(AM10=\"\",\"\",VLOOKUP(AM10,Teilnehmer!$A$3:$C$102,2))","v":""},null,null,null,{"$f":"IF(AQ10=\"\",\"\",VLOOKUP(AQ10,Teilnehmer!$A$3:$C$102,2))","v":""},null,null,{"$f":"IF(AT10=\"\",\"\",VLOOKUP(AT10,Teilnehmer!$A$3:$C$102,2))","v":""},null,null,null,{"$f":"IF(AX10=\"\",\"\",VLOOKUP(AX10,Teilnehmer!$A$3:$C$102,2))","v":""},null,null,{"$f":"IF(BA10=\"\",\"\",VLOOKUP(BA10,Teilnehmer!$A$3:$C$102,2))","v":""},null,null,null,{"$f":"IF(BE10=\"\",\"\",VLOOKUP(BE10,Teilnehmer!$A$3:$C$102,2))","v":""},null,null,{"$f":"IF(BH10=\"\",\"\",VLOOKUP(BH10,Teilnehmer!$A$3:$C$102,2))","v":""},null,null,null,{"$f":"IF(BL10=\"\",\"\",VLOOKUP(BL10,Teilnehmer!$A$3:$C$102,2))","v":""},null,null,{"$f":"IF(BO10=\"\",\"\",VLOOKUP(BO10,Teilnehmer!$A$3:$C$102,2))","v":""},null,null,null,{"$f":"IF(BS10=\"\",\"\",VLOOKUP(BS10,Teilnehmer!$A$3:$C$102,2))","v":""},null,null,{"$f":"IF(BV10=\"\",\"\",VLOOKUP(BV10,Teilnehmer!$A$3:$C$102,2))","v":""},null,null,null,{"$f":"IF(BZ10=\"\",\"\",VLOOKUP(BZ10,Teilnehmer!$A$3:$C$102,2))","v":""},null,null,{"$f":"IF(CC10=\"\",\"\",VLOOKUP(CC10,Teilnehmer!$A$3:$C$102,2))","v":""},null,null,null,{"$f":"IF(CG10=\"\",\"\",VLOOKUP(CG10,Teilnehmer!$A$3:$C$102,2))","v":""},null,null,{"$f":"IF(CJ10=\"\",\"\",VLOOKUP(CJ10,Teilnehmer!$A$3:$C$102,2))","v":""},null,null,null,{"$f":"IF(CN10=\"\",\"\",VLOOKUP(CN10,Teilnehmer!$A$3:$C$102,2))","v":""},null,null,{"$f":"IF(CQ10=\"\",\"\",VLOOKUP(CQ10,Teilnehmer!$A$3:$C$102,2))","v":""},null,null,null,{"$f":"IF(CU10=\"\",\"\",VLOOKUP(CU10,Teilnehmer!$A$3:$C$102,2))","v":""},null,null,{"$f":"IF(CX10=\"\",\"\",VLOOKUP(CX10,Teilnehmer!$A$3:$C$102,2))","v":""},null,null,null,{"$f":"IF(DB10=\"\",\"\",VLOOKUP(DB10,Teilnehmer!$A$3:$C$102,2))","v":""},null,null,{"$f":"IF(DE10=\"\",\"\",VLOOKUP(DE10,Teilnehmer!$A$3:$C$102,2))","v":""},null,null,null,{"$f":"IF(DI10=\"\",\"\",VLOOKUP(DI10,Teilnehmer!$A$3:$C$102,2))","v":""},null,null,{"$f":"IF(DL10=\"\",\"\",VLOOKUP(DL10,Teilnehmer!$A$3:$C$102,2))","v":""},null,null,null,{"$f":"IF(DP10=\"\",\"\",VLOOKUP(DP10,Teilnehmer!$A$3:$C$102,2))","v":""},null,null,{"$f":"IF(DS10=\"\",\"\",VLOOKUP(DS10,Teilnehmer!$A$3:$C$102,2))","v":""},null,null,null,{"$f":"IF(DW10=\"\",\"\",VLOOKUP(DW10,Teilnehmer!$A$3:$C$102,2))","v":""},null,null,{"$f":"IF(DZ10=\"\",\"\",VLOOKUP(DZ10,Teilnehmer!$A$3:$C$102,2))","v":""},null,null,null,{"$f":"IF(ED10=\"\",\"\",VLOOKUP(ED10,Teilnehmer!$A$3:$C$102,2))","v":""},null,null,{"$f":"IF(EG10=\"\",\"\",VLOOKUP(EG10,Teilnehmer!$A$3:$C$102,2))","v":""},null,null,null,{"$f":"IF(EK10=\"\",\"\",VLOOKUP(EK10,Teilnehmer!$A$3:$C$102,2))","v":""},null,null,{"$f":"IF(EN10=\"\",\"\",VLOOKUP(EN10,Teilnehmer!$A$3:$C$102,2))","v":""},null,null,null,{"$f":"IF(ER10=\"\",\"\",VLOOKUP(ER10,Teilnehmer!$A$3:$C$102,2))","v":""},null,null,{"$f":"IF(EU10=\"\",\"\",VLOOKUP(EU10,Teilnehmer!$A$3:$C$102,2))","v":""},null,null,null,{"$f":"IF(EY10=\"\",\"\",VLOOKUP(EY10,Teilnehmer!$A$3:$C$102,2))","v":""},null,null,{"$f":"IF(FB10=\"\",\"\",VLOOKUP(FB10,Teilnehmer!$A$3:$C$102,2))","v":""},null,null,null,{"$f":"IF(FF10=\"\",\"\",VLOOKUP(FF10,Teilnehmer!$A$3:$C$102,2))","v":""},null,null,{"$f":"IF(FI10=\"\",\"\",VLOOKUP(FI10,Teilnehmer!$A$3:$C$102,2))","v":""},null,null,null,{"$f":"IF(FM10=\"\",\"\",VLOOKUP(FM10,Teilnehmer!$A$3:$C$102,2))","v":""},null,null,{"$f":"IF(FP10=\"\",\"\",VLOOKUP(FP10,Teilnehmer!$A$3:$C$102,2))","v":""},null,null,null,{"$f":"IF(FT10=\"\",\"\",VLOOKUP(FT10,Teilnehmer!$A$3:$C$102,2))","v":""},null,null,{"$f":"IF(FW10=\"\",\"\",VLOOKUP(FW10,Teilnehmer!$A$3:$C$102,2))","v":""},null,null,null,{"$f":"IF(GA10=\"\",\"\",VLOOKUP(GA10,Teilnehmer!$A$3:$C$102,2))","v":""},null,null,{"$f":"IF(GD10=\"\",\"\",VLOOKUP(GD10,Teilnehmer!$A$3:$C$102,2))","v":""},null,null,null,{"$f":"IF(GH10=\"\",\"\",VLOOKUP(GH10,Teilnehmer!$A$3:$C$102,2))","v":""},null,null,{"$f":"IF(GK10=\"\",\"\",VLOOKUP(GK10,Teilnehmer!$A$3:$C$102,2))","v":""},null,null,null,{"$f":"IF(GO10=\"\",\"\",VLOOKUP(GO10,Teilnehmer!$A$3:$C$102,2))","v":""},null,null,{"$f":"IF(GR10=\"\",\"\",VLOOKUP(GR10,Teilnehmer!$A$3:$C$102,2))","v":""},null,null,null,{"$f":"IF(GV10=\"\",\"\",VLOOKUP(GV10,Teilnehmer!$A$3:$C$102,2))","v":""},null,null,{"$f":"IF(GY10=\"\",\"\",VLOOKUP(GY10,Teilnehmer!$A$3:$C$102,2))","v":""},null,null,null,{"$f":"IF(HC10=\"\",\"\",VLOOKUP(HC10,Teilnehmer!$A$3:$C$102,2))","v":""},null,null,{"$f":"IF(HF10=\"\",\"\",VLOOKUP(HF10,Teilnehmer!$A$3:$C$102,2))","v":""},null,null,null,{"$f":"IF(HJ10=\"\",\"\",VLOOKUP(HJ10,Teilnehmer!$A$3:$C$102,2))","v":""},null,null,{"$f":"IF(HM10=\"\",\"\",VLOOKUP(HM10,Teilnehmer!$A$3:$C$102,2))","v":""},null,null,null,{"$f":"IF(HQ10=\"\",\"\",VLOOKUP(HQ10,Teilnehmer!$A$3:$C$102,2))","v":""},null,null,{"$f":"IF(HT10=\"\",\"\",VLOOKUP(HT10,Teilnehmer!$A$3:$C$102,2))","v":""},null,null,null,{"$f":"IF(HX10=\"\",\"\",VLOOKUP(HX10,Teilnehmer!$A$3:$C$102,2))","v":""},null,null,{"$f":"IF(IA10=\"\",\"\",VLOOKUP(IA10,Teilnehmer!$A$3:$C$102,2))","v":""},null,null,null,{"$f":"IF(IE10=\"\",\"\",VLOOKUP(IE10,Teilnehmer!$A$3:$C$102,2))","v":""},null,null,{"$f":"IF(IH10=\"\",\"\",VLOOKUP(IH10,Teilnehmer!$A$3:$C$102,2))","v":""},null,null,null,{"$f":"IF(IL10=\"\",\"\",VLOOKUP(IL10,Teilnehmer!$A$3:$C$102,2))","v":""},null,null,{"$f":"IF(IO10=\"\",\"\",VLOOKUP(IO10,Teilnehmer!$A$3:$C$102,2))","v":""},null,null,null,{"$f":"IF(IS10=\"\",\"\",VLOOKUP(IS10,Teilnehmer!$A$3:$C$102,2))","v":""},null,null,{"$f":"IF(IV10=\"\",\"\",VLOOKUP(IV10,Teilnehmer!$A$3:$C$102,2))","v":""},null,null,null,{"$f":"IF(IZ10=\"\",\"\",VLOOKUP(IZ10,Teilnehmer!$A$3:$C$102,2))","v":""},null,null,{"$f":"IF(JC10=\"\",\"\",VLOOKUP(JC10,Teilnehmer!$A$3:$C$102,2))","v":""},null,null,null,{"$f":"IF(JG10=\"\",\"\",VLOOKUP(JG10,Teilnehmer!$A$3:$C$102,2))","v":""},null,null,{"$f":"IF(JJ10=\"\",\"\",VLOOKUP(JJ10,Teilnehmer!$A$3:$C$102,2))","v":""},null,null,null,{"$f":"IF(JN10=\"\",\"\",VLOOKUP(JN10,Teilnehmer!$A$3:$C$102,2))","v":""},null,null,{"$f":"IF(JQ10=\"\",\"\",VLOOKUP(JQ10,Teilnehmer!$A$3:$C$102,2))","v":""},null,null,null,{"$f":"IF(JU10=\"\",\"\",VLOOKUP(JU10,Teilnehmer!$A$3:$C$102,2))","v":""},null,null,{"$f":"IF(JX10=\"\",\"\",VLOOKUP(JX10,Teilnehmer!$A$3:$C$102,2))","v":""},null,null,null,{"$f":"IF(KB10=\"\",\"\",VLOOKUP(KB10,Teilnehmer!$A$3:$C$102,2))","v":""},null,null,{"$f":"IF(KE10=\"\",\"\",VLOOKUP(KE10,Teilnehmer!$A$3:$C$102,2))","v":""},null,null,null,{"$f":"IF(KI10=\"\",\"\",VLOOKUP(KI10,Teilnehmer!$A$3:$C$102,2))","v":""},null,null,{"$f":"IF(KL10=\"\",\"\",VLOOKUP(KL10,Teilnehmer!$A$3:$C$102,2))","v":""},null,null,null,{"$f":"IF(KP10=\"\",\"\",VLOOKUP(KP10,Teilnehmer!$A$3:$C$102,2))","v":""},null,null,{"$f":"IF(KS10=\"\",\"\",VLOOKUP(KS10,Teilnehmer!$A$3:$C$102,2))","v":""}]
[null,{"$f":"IF(A11=\"\",\"\",VLOOKUP(A11,Teilnehmer!$A$3:$C$102,2))","v":""},null,null,{"$f":"IF(D11=\"\",\"\",VLOOKUP(D11,Teilnehmer!$A$3:$C$102,2))","v":""},null,null,null,{"$f":"IF(H11=\"\",\"\",VLOOKUP(H11,Teilnehmer!$A$3:$C$102,2))","v":""},null,null,{"$f":"IF(K11=\"\",\"\",VLOOKUP(K11,Teilnehmer!$A$3:$C$102,2))","v":""},null,null,null,{"$f":"IF(O11=\"\",\"\",VLOOKUP(O11,Teilnehmer!$A$3:$C$102,2))","v":""},null,null,{"$f":"IF(R11=\"\",\"\",VLOOKUP(R11,Teilnehmer!$A$3:$C$102,2))","v":""},null,null,null,{"$f":"IF(V11=\"\",\"\",VLOOKUP(V11,Teilnehmer!$A$3:$C$102,2))","v":""},null,null,{"$f":"IF(Y11=\"\",\"\",VLOOKUP(Y11,Teilnehmer!$A$3:$C$102,2))","v":""},null,null,null,{"$f":"IF(AC11=\"\",\"\",VLOOKUP(AC11,Teilnehmer!$A$3:$C$102,2))","v":""},null,null,{"$f":"IF(AF11=\"\",\"\",VLOOKUP(AF11,Teilnehmer!$A$3:$C$102,2))","v":""},null,null,null,{"$f":"IF(AJ11=\"\",\"\",VLOOKUP(AJ11,Teilnehmer!$A$3:$C$102,2))","v":""},null,null,{"$f":"IF(AM11=\"\",\"\",VLOOKUP(AM11,Teilnehmer!$A$3:$C$102,2))","v":""},null,null,null,{"$f":"IF(AQ11=\"\",\"\",VLOOKUP(AQ11,Teilnehmer!$A$3:$C$102,2))","v":""},null,null,{"$f":"IF(AT11=\"\",\"\",VLOOKUP(AT11,Teilnehmer!$A$3:$C$102,2))","v":""},null,null,null,{"$f":"IF(AX11=\"\",\"\",VLOOKUP(AX11,Teilnehmer!$A$3:$C$102,2))","v":""},null,null,{"$f":"IF(BA11=\"\",\"\",VLOOKUP(BA11,Teilnehmer!$A$3:$C$102,2))","v":""},null,null,null,{"$f":"IF(BE11=\"\",\"\",VLOOKUP(BE11,Teilnehmer!$A$3:$C$102,2))","v":""},null,null,{"$f":"IF(BH11=\"\",\"\",VLOOKUP(BH11,Teilnehmer!$A$3:$C$102,2))","v":""},null,null,null,{"$f":"IF(BL11=\"\",\"\",VLOOKUP(BL11,Teilnehmer!$A$3:$C$102,2))","v":""},null,null,{"$f":"IF(BO11=\"\",\"\",VLOOKUP(BO11,Teilnehmer!$A$3:$C$102,2))","v":""},null,null,null,{"$f":"IF(BS11=\"\",\"\",VLOOKUP(BS11,Teilnehmer!$A$3:$C$102,2))","v":""},null,null,{"$f":"IF(BV11=\"\",\"\",VLOOKUP(BV11,Teilnehmer!$A$3:$C$102,2))","v":""},null,null,null,{"$f":"IF(BZ11=\"\",\"\",VLOOKUP(BZ11,Teilnehmer!$A$3:$C$102,2))","v":""},null,null,{"$f":"IF(CC11=\"\",\"\",VLOOKUP(CC11,Teilnehmer!$A$3:$C$102,2))","v":""},null,null,null,{"$f":"IF(CG11=\"\",\"\",VLOOKUP(CG11,Teilnehmer!$A$3:$C$102,2))","v":""},null,null,{"$f":"IF(CJ11=\"\",\"\",VLOOKUP(CJ11,Teilnehmer!$A$3:$C$102,2))","v":""},null,null,null,{"$f":"IF(CN11=\"\",\"\",VLOOKUP(CN11,Teilnehmer!$A$3:$C$102,2))","v":""},null,null,{"$f":"IF(CQ11=\"\",\"\",VLOOKUP(CQ11,Teilnehmer!$A$3:$C$102,2))","v":""},null,null,null,{"$f":"IF(CU11=\"\",\"\",VLOOKUP(CU11,Teilnehmer!$A$3:$C$102,2))","v":""},null,null,{"$f":"IF(CX11=\"\",\"\",VLOOKUP(CX11,Teilnehmer!$A$3:$C$102,2))","v":""},null,null,null,{"$f":"IF(DB11=\"\",\"\",VLOOKUP(DB11,Teilnehmer!$A$3:$C$102,2))","v":""},null,null,{"$f":"IF(DE11=\"\",\"\",VLOOKUP(DE11,Teilnehmer!$A$3:$C$102,2))","v":""},null,null,null,{"$f":"IF(DI11=\"\",\"\",VLOOKUP(DI11,Teilnehmer!$A$3:$C$102,2))","v":""},null,null,{"$f":"IF(DL11=\"\",\"\",VLOOKUP(DL11,Teilnehmer!$A$3:$C$102,2))","v":""},null,null,null,{"$f":"IF(DP11=\"\",\"\",VLOOKUP(DP11,Teilnehmer!$A$3:$C$102,2))","v":""},null,null,{"$f":"IF(DS11=\"\",\"\",VLOOKUP(DS11,Teilnehmer!$A$3:$C$102,2))","v":""},null,null,null,{"$f":"IF(DW11=\"\",\"\",VLOOKUP(DW11,Teilnehmer!$A$3:$C$102,2))","v":""},null,null,{"$f":"IF(DZ11=\"\",\"\",VLOOKUP(DZ11,Teilnehmer!$A$3:$C$102,2))","v":""},null,null,null,{"$f":"IF(ED11=\"\",\"\",VLOOKUP(ED11,Teilnehmer!$A$3:$C$102,2))","v":""},null,null,{"$f":"IF(EG11=\"\",\"\",VLOOKUP(EG11,Teilnehmer!$A$3:$C$102,2))","v":""},null,null,null,{"$f":"IF(EK11=\"\",\"\",VLOOKUP(EK11,Teilnehmer!$A$3:$C$102,2))","v":""},null,null,{"$f":"IF(EN11=\"\",\"\",VLOOKUP(EN11,Teilnehmer!$A$3:$C$102,2))","v":""},null,null,null,{"$f":"IF(ER11=\"\",\"\",VLOOKUP(ER11,Teilnehmer!$A$3:$C$102,2))","v":""},null,null,{"$f":"IF(EU11=\"\",\"\",VLOOKUP(EU11,Teilnehmer!$A$3:$C$102,2))","v":""},null,null,null,{"$f":"IF(EY11=\"\",\"\",VLOOKUP(EY11,Teilnehmer!$A$3:$C$102,2))","v":""},null,null,{"$f":"IF(FB11=\"\",\"\",VLOOKUP(FB11,Teilnehmer!$A$3:$C$102,2))","v":""},null,null,null,{"$f":"IF(FF11=\"\",\"\",VLOOKUP(FF11,Teilnehmer!$A$3:$C$102,2))","v":""},null,null,{"$f":"IF(FI11=\"\",\"\",VLOOKUP(FI11,Teilnehmer!$A$3:$C$102,2))","v":""},null,null,null,{"$f":"IF(FM11=\"\",\"\",VLOOKUP(FM11,Teilnehmer!$A$3:$C$102,2))","v":""},null,null,{"$f":"IF(FP11=\"\",\"\",VLOOKUP(FP11,Teilnehmer!$A$3:$C$102,2))","v":""},null,null,null,{"$f":"IF(FT11=\"\",\"\",VLOOKUP(FT11,Teilnehmer!$A$3:$C$102,2))","v":""},null,null,{"$f":"IF(FW11=\"\",\"\",VLOOKUP(FW11,Teilnehmer!$A$3:$C$102,2))","v":""},null,null,null,{"$f":"IF(GA11=\"\",\"\",VLOOKUP(GA11,Teilnehmer!$A$3:$C$102,2))","v":""},null,null,{"$f":"IF(GD11=\"\",\"\",VLOOKUP(GD11,Teilnehmer!$A$3:$C$102,2))","v":""},null,null,null,{"$f":"IF(GH11=\"\",\"\",VLOOKUP(GH11,Teilnehmer!$A$3:$C$102,2))","v":""},null,null,{"$f":"IF(GK11=\"\",\"\",VLOOKUP(GK11,Teilnehmer!$A$3:$C$102,2))","v":""},null,null,null,{"$f":"IF(GO11=\"\",\"\",VLOOKUP(GO11,Teilnehmer!$A$3:$C$102,2))","v":""},null,null,{"$f":"IF(GR11=\"\",\"\",VLOOKUP(GR11,Teilnehmer!$A$3:$C$102,2))","v":""},null,null,null,{"$f":"IF(GV11=\"\",\"\",VLOOKUP(GV11,Teilnehmer!$A$3:$C$102,2))","v":""},null,null,{"$f":"IF(GY11=\"\",\"\",VLOOKUP(GY11,Teilnehmer!$A$3:$C$102,2))","v":""},null,null,null,{"$f":"IF(HC11=\"\",\"\",VLOOKUP(HC11,Teilnehmer!$A$3:$C$102,2))","v":""},null,null,{"$f":"IF(HF11=\"\",\"\",VLOOKUP(HF11,Teilnehmer!$A$3:$C$102,2))","v":""},null,null,null,{"$f":"IF(HJ11=\"\",\"\",VLOOKUP(HJ11,Teilnehmer!$A$3:$C$102,2))","v":""},null,null,{"$f":"IF(HM11=\"\",\"\",VLOOKUP(HM11,Teilnehmer!$A$3:$C$102,2))","v":""},null,null,null,{"$f":"IF(HQ11=\"\",\"\",VLOOKUP(HQ11,Teilnehmer!$A$3:$C$102,2))","v":""},null,null,{"$f":"IF(HT11=\"\",\"\",VLOOKUP(HT11,Teilnehmer!$A$3:$C$102,2))","v":""},null,null,null,{"$f":"IF(HX11=\"\",\"\",VLOOKUP(HX11,Teilnehmer!$A$3:$C$102,2))","v":""},null,null,{"$f":"IF(IA11=\"\",\"\",VLOOKUP(IA11,Teilnehmer!$A$3:$C$102,2))","v":""},null,null,null,{"$f":"IF(IE11=\"\",\"\",VLOOKUP(IE11,Teilnehmer!$A$3:$C$102,2))","v":""},null,null,{"$f":"IF(IH11=\"\",\"\",VLOOKUP(IH11,Teilnehmer!$A$3:$C$102,2))","v":""},null,null,null,{"$f":"IF(IL11=\"\",\"\",VLOOKUP(IL11,Teilnehmer!$A$3:$C$102,2))","v":""},null,null,{"$f":"IF(IO11=\"\",\"\",VLOOKUP(IO11,Teilnehmer!$A$3:$C$102,2))","v":""},null,null,null,{"$f":"IF(IS11=\"\",\"\",VLOOKUP(IS11,Teilnehmer!$A$3:$C$102,2))","v":""},null,null,{"$f":"IF(IV11=\"\",\"\",VLOOKUP(IV11,Teilnehmer!$A$3:$C$102,2))","v":""},null,null,null,{"$f":"IF(IZ11=\"\",\"\",VLOOKUP(IZ11,Teilnehmer!$A$3:$C$102,2))","v":""},null,null,{"$f":"IF(JC11=\"\",\"\",VLOOKUP(JC11,Teilnehmer!$A$3:$C$102,2))","v":""},null,null,null,{"$f":"IF(JG11=\"\",\"\",VLOOKUP(JG11,Teilnehmer!$A$3:$C$102,2))","v":""},null,null,{"$f":"IF(JJ11=\"\",\"\",VLOOKUP(JJ11,Teilnehmer!$A$3:$C$102,2))","v":""},null,null,null,{"$f":"IF(JN11=\"\",\"\",VLOOKUP(JN11,Teilnehmer!$A$3:$C$102,2))","v":""},null,null,{"$f":"IF(JQ11=\"\",\"\",VLOOKUP(JQ11,Teilnehmer!$A$3:$C$102,2))","v":""},null,null,null,{"$f":"IF(JU11=\"\",\"\",VLOOKUP(JU11,Teilnehmer!$A$3:$C$102,2))","v":""},null,null,{"$f":"IF(JX11=\"\",\"\",VLOOKUP(JX11,Teilnehmer!$A$3:$C$102,2))","v":""},null,null,null,{"$f":"IF(KB11=\"\",\"\",VLOOKUP(KB11,Teilnehmer!$A$3:$C$102,2))","v":""},null,null,{"$f":"IF(KE11=\"\",\"\",VLOOKUP(KE11,Teilnehmer!$A$3:$C$102,2))","v":""},null,null,null,{"$f":"IF(KI11=\"\",\"\",VLOOKUP(KI11,Teilnehmer!$A$3:$C$102,2))","v":""},null,null,{"$f":"IF(KL11=\"\",\"\",VLOOKUP(KL11,Teilnehmer!$A$3:$C$102,2))","v":""},null,null,null,{"$f":"IF(KP11=\"\",\"\",VLOOKUP(KP11,Teilnehmer!$A$3:$C$102,2))","v":""},null,null,{"$f":"IF(KS11=\"\",\"\",VLOOKUP(KS11,Teilnehmer!$A$3:$C$102,2))","v":""}]
[null,{"$f":"IF(A12=\"\",\"\",VLOOKUP(A12,Teilnehmer!$A$3:$C$102,2))","v":""},null,null,{"$f":"IF(D12=\"\",\"\",VLOOKUP(D12,Teilnehmer!$A$3:$C$102,2))","v":""},null,null,null,{"$f":"IF(H12=\"\",\"\",VLOOKUP(H12,Teilnehmer!$A$3:$C$102,2))","v":""},null,null,{"$f":"IF(K12=\"\",\"\",VLOOKUP(K12,Teilnehmer!$A$3:$C$102,2))","v":""},null,null,null,{"$f":"IF(O12=\"\",\"\",VLOOKUP(O12,Teilnehmer!$A$3:$C$102,2))","v":""},null,null,{"$f":"IF(R12=\"\",\"\",VLOOKUP(R12,Teilnehmer!$A$3:$C$102,2))","v":""},null,null,null,{"$f":"IF(V12=\"\",\"\",VLOOKUP(V12,Teilnehmer!$A$3:$C$102,2))","v":""},null,null,{"$f":"IF(Y12=\"\",\"\",VLOOKUP(Y12,Teilnehmer!$A$3:$C$102,2))","v":""},null,null,null,{"$f":"IF(AC12=\"\",\"\",VLOOKUP(AC12,Teilnehmer!$A$3:$C$102,2))","v":""},null,null,{"$f":"IF(AF12=\"\",\"\",VLOOKUP(AF12,Teilnehmer!$A$3:$C$102,2))","v":""},null,null,null,{"$f":"IF(AJ12=\"\",\"\",VLOOKUP(AJ12,Teilnehmer!$A$3:$C$102,2))","v":""},null,null,{"$f":"IF(AM12=\"\",\"\",VLOOKUP(AM12,Teilnehmer!$A$3:$C$102,2))","v":""},null,null,null,{"$f":"IF(AQ12=\"\",\"\",VLOOKUP(AQ12,Teilnehmer!$A$3:$C$102,2))","v":""},null,null,{"$f":"IF(AT12=\"\",\"\",VLOOKUP(AT12,Teilnehmer!$A$3:$C$102,2))","v":""},null,null,null,{"$f":"IF(AX12=\"\",\"\",VLOOKUP(AX12,Teilnehmer!$A$3:$C$102,2))","v":""},null,null,{"$f":"IF(BA12=\"\",\"\",VLOOKUP(BA12,Teilnehmer!$A$3:$C$102,2))","v":""},null,null,null,{"$f":"IF(BE12=\"\",\"\",VLOOKUP(BE12,Teilnehmer!$A$3:$C$102,2))","v":""},null,null,{"$f":"IF(BH12=\"\",\"\",VLOOKUP(BH12,Teilnehmer!$A$3:$C$102,2))","v":""},null,null,null,{"$f":"IF(BL12=\"\",\"\",VLOOKUP(BL12,Teilnehmer!$A$3:$C$102,2))","v":""},null,null,{"$f":"IF(BO12=\"\",\"\",VLOOKUP(BO12,Teilnehmer!$A$3:$C$102,2))","v":""},null,null,null,{"$f":"IF(BS12=\"\",\"\",VLOOKUP(BS12,Teilnehmer!$A$3:$C$102,2))","v":""},null,null,{"$f":"IF(BV12=\"\",\"\",VLOOKUP(BV12,Teilnehmer!$A$3:$C$102,2))","v":""},null,null,null,{"$f":"IF(BZ12=\"\",\"\",VLOOKUP(BZ12,Teilnehmer!$A$3:$C$102,2))","v":""},null,null,{"$f":"IF(CC12=\"\",\"\",VLOOKUP(CC12,Teilnehmer!$A$3:$C$102,2))","v":""},null,null,null,{"$f":"IF(CG12=\"\",\"\",VLOOKUP(CG12,Teilnehmer!$A$3:$C$102,2))","v":""},null,null,{"$f":"IF(CJ12=\"\",\"\",VLOOKUP(CJ12,Teilnehmer!$A$3:$C$102,2))","v":""},null,null,null,{"$f":"IF(CN12=\"\",\"\",VLOOKUP(CN12,Teilnehmer!$A$3:$C$102,2))","v":""},null,null,{"$f":"IF(CQ12=\"\",\"\",VLOOKUP(CQ12,Teilnehmer!$A$3:$C$102,2))","v":""},null,null,null,{"$f":"IF(CU12=\"\",\"\",VLOOKUP(CU12,Teilnehmer!$A$3:$C$102,2))","v":""},null,null,{"$f":"IF(CX12=\"\",\"\",VLOOKUP(CX12,Teilnehmer!$A$3:$C$102,2))","v":""},null,null,null,{"$f":"IF(DB12=\"\",\"\",VLOOKUP(DB12,Teilnehmer!$A$3:$C$102,2))","v":""},null,null,{"$f":"IF(DE12=\"\",\"\",VLOOKUP(DE12,Teilnehmer!$A$3:$C$102,2))","v":""},null,null,null,{"$f":"IF(DI12=\"\",\"\",VLOOKUP(DI12,Teilnehmer!$A$3:$C$102,2))","v":""},null,null,{"$f":"IF(DL12=\"\",\"\",VLOOKUP(DL12,Teilnehmer!$A$3:$C$102,2))","v":""},null,null,null,{"$f":"IF(DP12=\"\",\"\",VLOOKUP(DP12,Teilnehmer!$A$3:$C$102,2))","v":""},null,null,{"$f":"IF(DS12=\"\",\"\",VLOOKUP(DS12,Teilnehmer!$A$3:$C$102,2))","v":""},null,null,null,{"$f":"IF(DW12=\"\",\"\",VLOOKUP(DW12,Teilnehmer!$A$3:$C$102,2))","v":""},null,null,{"$f":"IF(DZ12=\"\",\"\",VLOOKUP(DZ12,Teilnehmer!$A$3:$C$102,2))","v":""},null,null,null,{"$f":"IF(ED12=\"\",\"\",VLOOKUP(ED12,Teilnehmer!$A$3:$C$102,2))","v":""},null,null,{"$f":"IF(EG12=\"\",\"\",VLOOKUP(EG12,Teilnehmer!$A$3:$C$102,2))","v":""},null,null,null,{"$f":"IF(EK12=\"\",\"\",VLOOKUP(EK12,Teilnehmer!$A$3:$C$102,2))","v":""},null,null,{"$f":"IF(EN12=\"\",\"\",VLOOKUP(EN12,Teilnehmer!$A$3:$C$102,2))","v":""},null,null,null,{"$f":"IF(ER12=\"\",\"\",VLOOKUP(ER12,Teilnehmer!$A$3:$C$102,2))","v":""},null,null,{"$f":"IF(EU12=\"\",\"\",VLOOKUP(EU12,Teilnehmer!$A$3:$C$102,2))","v":""},null,null,null,{"$f":"IF(EY12=\"\",\"\",VLOOKUP(EY12,Teilnehmer!$A$3:$C$102,2))","v":""},null,null,{"$f":"IF(FB12=\"\",\"\",VLOOKUP(FB12,Teilnehmer!$A$3:$C$102,2))","v":""},null,null,null,{"$f":"IF(FF12=\"\",\"\",VLOOKUP(FF12,Teilnehmer!$A$3:$C$102,2))","v":""},null,null,{"$f":"IF(FI12=\"\",\"\",VLOOKUP(FI12,Teilnehmer!$A$3:$C$102,2))","v":""},null,null,null,{"$f":"IF(FM12=\"\",\"\",VLOOKUP(FM12,Teilnehmer!$A$3:$C$102,2))","v":""},null,null,{"$f":"IF(FP12=\"\",\"\",VLOOKUP(FP12,Teilnehmer!$A$3:$C$102,2))","v":""},null,null,null,{"$f":"IF(FT12=\"\",\"\",VLOOKUP(FT12,Teilnehmer!$A$3:$C$102,2))","v":""},null,null,{"$f":"IF(FW12=\"\",\"\",VLOOKUP(FW12,Teilnehmer!$A$3:$C$102,2))","v":""},null,null,null,{"$f":"IF(GA12=\"\",\"\",VLOOKUP(GA12,Teilnehmer!$A$3:$C$102,2))","v":""},null,null,{"$f":"IF(GD12=\"\",\"\",VLOOKUP(GD12,Teilnehmer!$A$3:$C$102,2))","v":""},null,null,null,{"$f":"IF(GH12=\"\",\"\",VLOOKUP(GH12,Teilnehmer!$A$3:$C$102,2))","v":""},null,null,{"$f":"IF(GK12=\"\",\"\",VLOOKUP(GK12,Teilnehmer!$A$3:$C$102,2))","v":""},null,null,null,{"$f":"IF(GO12=\"\",\"\",VLOOKUP(GO12,Teilnehmer!$A$3:$C$102,2))","v":""},null,null,{"$f":"IF(GR12=\"\",\"\",VLOOKUP(GR12,Teilnehmer!$A$3:$C$102,2))","v":""},null,null,null,{"$f":"IF(GV12=\"\",\"\",VLOOKUP(GV12,Teilnehmer!$A$3:$C$102,2))","v":""},null,null,{"$f":"IF(GY12=\"\",\"\",VLOOKUP(GY12,Teilnehmer!$A$3:$C$102,2))","v":""},null,null,null,{"$f":"IF(HC12=\"\",\"\",VLOOKUP(HC12,Teilnehmer!$A$3:$C$102,2))","v":""},null,null,{"$f":"IF(HF12=\"\",\"\",VLOOKUP(HF12,Teilnehmer!$A$3:$C$102,2))","v":""},null,null,null,{"$f":"IF(HJ12=\"\",\"\",VLOOKUP(HJ12,Teilnehmer!$A$3:$C$102,2))","v":""},null,null,{"$f":"IF(HM12=\"\",\"\",VLOOKUP(HM12,Teilnehmer!$A$3:$C$102,2))","v":""},null,null,null,{"$f":"IF(HQ12=\"\",\"\",VLOOKUP(HQ12,Teilnehmer!$A$3:$C$102,2))","v":""},null,null,{"$f":"IF(HT12=\"\",\"\",VLOOKUP(HT12,Teilnehmer!$A$3:$C$102,2))","v":""},null,null,null,{"$f":"IF(HX12=\"\",\"\",VLOOKUP(HX12,Teilnehmer!$A$3:$C$102,2))","v":""},null,null,{"$f":"IF(IA12=\"\",\"\",VLOOKUP(IA12,Teilnehmer!$A$3:$C$102,2))","v":""},null,null,null,{"$f":"IF(IE12=\"\",\"\",VLOOKUP(IE12,Teilnehmer!$A$3:$C$102,2))","v":""},null,null,{"$f":"IF(IH12=\"\",\"\",VLOOKUP(IH12,Teilnehmer!$A$3:$C$102,2))","v":""},null,null,null,{"$f":"IF(IL12=\"\",\"\",VLOOKUP(IL12,Teilnehmer!$A$3:$C$102,2))","v":""},null,null,{"$f":"IF(IO12=\"\",\"\",VLOOKUP(IO12,Teilnehmer!$A$3:$C$102,2))","v":""},null,null,null,{"$f":"IF(IS12=\"\",\"\",VLOOKUP(IS12,Teilnehmer!$A$3:$C$102,2))","v":""},null,null,{"$f":"IF(IV12=\"\",\"\",VLOOKUP(IV12,Teilnehmer!$A$3:$C$102,2))","v":""},null,null,null,{"$f":"IF(IZ12=\"\",\"\",VLOOKUP(IZ12,Teilnehmer!$A$3:$C$102,2))","v":""},null,null,{"$f":"IF(JC12=\"\",\"\",VLOOKUP(JC12,Teilnehmer!$A$3:$C$102,2))","v":""},null,null,null,{"$f":"IF(JG12=\"\",\"\",VLOOKUP(JG12,Teilnehmer!$A$3:$C$102,2))","v":""},null,null,{"$f":"IF(JJ12=\"\",\"\",VLOOKUP(JJ12,Teilnehmer!$A$3:$C$102,2))","v":""},null,null,null,{"$f":"IF(JN12=\"\",\"\",VLOOKUP(JN12,Teilnehmer!$A$3:$C$102,2))","v":""},null,null,{"$f":"IF(JQ12=\"\",\"\",VLOOKUP(JQ12,Teilnehmer!$A$3:$C$102,2))","v":""},null,null,null,{"$f":"IF(JU12=\"\",\"\",VLOOKUP(JU12,Teilnehmer!$A$3:$C$102,2))","v":""},null,null,{"$f":"IF(JX12=\"\",\"\",VLOOKUP(JX12,Teilnehmer!$A$3:$C$102,2))","v":""},null,null,null,{"$f":"IF(KB12=\"\",\"\",VLOOKUP(KB12,Teilnehmer!$A$3:$C$102,2))","v":""},null,null,{"$f":"IF(KE12=\"\",\"\",VLOOKUP(KE12,Teilnehmer!$A$3:$C$102,2))","v":""},null,null,null,{"$f":"IF(KI12=\"\",\"\",VLOOKUP(KI12,Teilnehmer!$A$3:$C$102,2))","v":""},null,null,{"$f":"IF(KL12=\"\",\"\",VLOOKUP(KL12,Teilnehmer!$A$3:$C$102,2))","v":""},null,null,null,{"$f":"IF(KP12=\"\",\"\",VLOOKUP(KP12,Teilnehmer!$A$3:$C$102,2))","v":""},null,null,{"$f":"IF(KS12=\"\",\"\",VLOOKUP(KS12,Teilnehmer!$A$3:$C$102,2))","v":""}]
[null,{"$f":"IF(A13=\"\",\"\",VLOOKUP(A13,Teilnehmer!$A$3:$C$102,2))","v":""},null,null,{"$f":"IF(D13=\"\",\"\",VLOOKUP(D13,Teilnehmer!$A$3:$C$102,2))","v":""},null,null,null,{"$f":"IF(H13=\"\",\"\",VLOOKUP(H13,Teilnehmer!$A$3:$C$102,2))","v":""},null,null,{"$f":"IF(K13=\"\",\"\",VLOOKUP(K13,Teilnehmer!$A$3:$C$102,2))","v":""},null,null,null,{"$f":"IF(O13=\"\",\"\",VLOOKUP(O13,Teilnehmer!$A$3:$C$102,2))","v":""},null,null,{"$f":"IF(R13=\"\",\"\",VLOOKUP(R13,Teilnehmer!$A$3:$C$102,2))","v":""},null,null,null,{"$f":"IF(V13=\"\",\"\",VLOOKUP(V13,Teilnehmer!$A$3:$C$102,2))","v":""},null,null,{"$f":"IF(Y13=\"\",\"\",VLOOKUP(Y13,Teilnehmer!$A$3:$C$102,2))","v":""},null,null,null,{"$f":"IF(AC13=\"\",\"\",VLOOKUP(AC13,Teilnehmer!$A$3:$C$102,2))","v":""},null,null,{"$f":"IF(AF13=\"\",\"\",VLOOKUP(AF13,Teilnehmer!$A$3:$C$102,2))","v":""},null,null,null,{"$f":"IF(AJ13=\"\",\"\",VLOOKUP(AJ13,Teilnehmer!$A$3:$C$102,2))","v":""},null,null,{"$f":"IF(AM13=\"\",\"\",VLOOKUP(AM13,Teilnehmer!$A$3:$C$102,2))","v":""},null,null,null,{"$f":"IF(AQ13=\"\",\"\",VLOOKUP(AQ13,Teilnehmer!$A$3:$C$102,2))","v":""},null,null,{"$f":"IF(AT13=\"\",\"\",VLOOKUP(AT13,Teilnehmer!$A$3:$C$102,2))","v":""},null,null,null,{"$f":"IF(AX13=\"\",\"\",VLOOKUP(AX13,Teilnehmer!$A$3:$C$102,2))","v":""},null,null,{"$f":"IF(BA13=\"\",\"\",VLOOKUP(BA13,Teilnehmer!$A$3:$C$102,2))","v":""},null,null,null,{"$f":"IF(BE13=\"\",\"\",VLOOKUP(BE13,Teilnehmer!$A$3:$C$102,2))","v":""},null,null,{"$f":"IF(BH13=\"\",\"\",VLOOKUP(BH13,Teilnehmer!$A$3:$C$102,2))","v":""},null,null,null,{"$f":"IF(BL13=\"\",\"\",VLOOKUP(BL13,Teilnehmer!$A$3:$C$102,2))","v":""},null,null,{"$f":"IF(BO13=\"\",\"\",VLOOKUP(BO13,Teilnehmer!$A$3:$C$102,2))","v":""},null,null,null,{"$f":"IF(BS13=\"\",\"\",VLOOKUP(BS13,Teilnehmer!$A$3:$C$102,2))","v":""},null,null,{"$f":"IF(BV13=\"\",\"\",VLOOKUP(BV13,Teilnehmer!$A$3:$C$102,2))","v":""},null,null,null,{"$f":"IF(BZ13=\"\",\"\",VLOOKUP(BZ13,Teilnehmer!$A$3:$C$102,2))","v":""},null,null,{"$f":"IF(CC13=\"\",\"\",VLOOKUP(CC13,Teilnehmer!$A$3:$C$102,2))","v":""},null,null,null,{"$f":"IF(CG13=\"\",\"\",VLOOKUP(CG13,Teilnehmer!$A$3:$C$102,2))","v":""},null,null,{"$f":"IF(CJ13=\"\",\"\",VLOOKUP(CJ13,Teilnehmer!$A$3:$C$102,2))","v":""},null,null,null,{"$f":"IF(CN13=\"\",\"\",VLOOKUP(CN13,Teilnehmer!$A$3:$C$102,2))","v":""},null,null,{"$f":"IF(CQ13=\"\",\"\",VLOOKUP(CQ13,Teilnehmer!$A$3:$C$102,2))","v":""},null,null,null,{"$f":"IF(CU13=\"\",\"\",VLOOKUP(CU13,Teilnehmer!$A$3:$C$102,2))","v":""},null,null,{"$f":"IF(CX13=\"\",\"\",VLOOKUP(CX13,Teilnehmer!$A$3:$C$102,2))","v":""},null,null,null,{"$f":"IF(DB13=\"\",\"\",VLOOKUP(DB13,Teilnehmer!$A$3:$C$102,2))","v":""},null,null,{"$f":"IF(DE13=\"\",\"\",VLOOKUP(DE13,Teilnehmer!$A$3:$C$102,2))","v":""},null,null,null,{"$f":"IF(DI13=\"\",\"\",VLOOKUP(DI13,Teilnehmer!$A$3:$C$102,2))","v":""},null,null,{"$f":"IF(DL13=\"\",\"\",VLOOKUP(DL13,Teilnehmer!$A$3:$C$102,2))","v":""},null,null,null,{"$f":"IF(DP13=\"\",\"\",VLOOKUP(DP13,Teilnehmer!$A$3:$C$102,2))","v":""},null,null,{"$f":"IF(DS13=\"\",\"\",VLOOKUP(DS13,Teilnehmer!$A$3:$C$102,2))","v":""},null,null,null,{"$f":"IF(DW13=\"\",\"\",VLOOKUP(DW13,Teilnehmer!$A$3:$C$102,2))","v":""},null,null,{"$f":"IF(DZ13=\"\",\"\",VLOOKUP(DZ13,Teilnehmer!$A$3:$C$102,2))","v":""},null,null,null,{"$f":"IF(ED13=\"\",\"\",VLOOKUP(ED13,Teilnehmer!$A$3:$C$102,2))","v":""},null,null,{"$f":"IF(EG13=\"\",\"\",VLOOKUP(EG13,Teilnehmer!$A$3:$C$102,2))","v":""},null,null,null,{"$f":"IF(EK13=\"\",\"\",VLOOKUP(EK13,Teilnehmer!$A$3:$C$102,2))","v":""},null,null,{"$f":"IF(EN13=\"\",\"\",VLOOKUP(EN13,Teilnehmer!$A$3:$C$102,2))","v":""},null,null,null,{"$f":"IF(ER13=\"\",\"\",VLOOKUP(ER13,Teilnehmer!$A$3:$C$102,2))","v":""},null,null,{"$f":"IF(EU13=\"\",\"\",VLOOKUP(EU13,Teilnehmer!$A$3:$C$102,2))","v":""},null,null,null,{"$f":"IF(EY13=\"\",\"\",VLOOKUP(EY13,Teilnehmer!$A$3:$C$102,2))","v":""},null,null,{"$f":"IF(FB13=\"\",\"\",VLOOKUP(FB13,Teilnehmer!$A$3:$C$102,2))","v":""},null,null,null,{"$f":"IF(FF13=\"\",\"\",VLOOKUP(FF13,Teilnehmer!$A$3:$C$102,2))","v":""},null,null,{"$f":"IF(FI13=\"\",\"\",VLOOKUP(FI13,Teilnehmer!$A$3:$C$102,2))","v":""},null,null,null,{"$f":"IF(FM13=\"\",\"\",VLOOKUP(FM13,Teilnehmer!$A$3:$C$102,2))","v":""},null,null,{"$f":"IF(FP13=\"\",\"\",VLOOKUP(FP13,Teilnehmer!$A$3:$C$102,2))","v":""},null,null,null,{"$f":"IF(FT13=\"\",\"\",VLOOKUP(FT13,Teilnehmer!$A$3:$C$102,2))","v":""},null,null,{"$f":"IF(FW13=\"\",\"\",VLOOKUP(FW13,Teilnehmer!$A$3:$C$102,2))","v":""},null,null,null,{"$f":"IF(GA13=\"\",\"\",VLOOKUP(GA13,Teilnehmer!$A$3:$C$102,2))","v":""},null,null,{"$f":"IF(GD13=\"\",\"\",VLOOKUP(GD13,Teilnehmer!$A$3:$C$102,2))","v":""},null,null,null,{"$f":"IF(GH13=\"\",\"\",VLOOKUP(GH13,Teilnehmer!$A$3:$C$102,2))","v":""},null,null,{"$f":"IF(GK13=\"\",\"\",VLOOKUP(GK13,Teilnehmer!$A$3:$C$102,2))","v":""},null,null,null,{"$f":"IF(GO13=\"\",\"\",VLOOKUP(GO13,Teilnehmer!$A$3:$C$102,2))","v":""},null,null,{"$f":"IF(GR13=\"\",\"\",VLOOKUP(GR13,Teilnehmer!$A$3:$C$102,2))","v":""},null,null,null,{"$f":"IF(GV13=\"\",\"\",VLOOKUP(GV13,Teilnehmer!$A$3:$C$102,2))","v":""},null,null,{"$f":"IF(GY13=\"\",\"\",VLOOKUP(GY13,Teilnehmer!$A$3:$C$102,2))","v":""},null,null,null,{"$f":"IF(HC13=\"\",\"\",VLOOKUP(HC13,Teilnehmer!$A$3:$C$102,2))","v":""},null,null,{"$f":"IF(HF13=\"\",\"\",VLOOKUP(HF13,Teilnehmer!$A$3:$C$102,2))","v":""},null,null,null,{"$f":"IF(HJ13=\"\",\"\",VLOOKUP(HJ13,Teilnehmer!$A$3:$C$102,2))","v":""},null,null,{"$f":"IF(HM13=\"\",\"\",VLOOKUP(HM13,Teilnehmer!$A$3:$C$102,2))","v":""},null,null,null,{"$f":"IF(HQ13=\"\",\"\",VLOOKUP(HQ13,Teilnehmer!$A$3:$C$102,2))","v":""},null,null,{"$f":"IF(HT13=\"\",\"\",VLOOKUP(HT13,Teilnehmer!$A$3:$C$102,2))","v":""},null,null,null,{"$f":"IF(HX13=\"\",\"\",VLOOKUP(HX13,Teilnehmer!$A$3:$C$102,2))","v":""},null,null,{"$f":"IF(IA13=\"\",\"\",VLOOKUP(IA13,Teilnehmer!$A$3:$C$102,2))","v":""},null,null,null,{"$f":"IF(IE13=\"\",\"\",VLOOKUP(IE13,Teilnehmer!$A$3:$C$102,2))","v":""},null,null,{"$f":"IF(IH13=\"\",\"\",VLOOKUP(IH13,Teilnehmer!$A$3:$C$102,2))","v":""},null,null,null,{"$f":"IF(IL13=\"\",\"\",VLOOKUP(IL13,Teilnehmer!$A$3:$C$102,2))","v":""},null,null,{"$f":"IF(IO13=\"\",\"\",VLOOKUP(IO13,Teilnehmer!$A$3:$C$102,2))","v":""},null,null,null,{"$f":"IF(IS13=\"\",\"\",VLOOKUP(IS13,Teilnehmer!$A$3:$C$102,2))","v":""},null,null,{"$f":"IF(IV13=\"\",\"\",VLOOKUP(IV13,Teilnehmer!$A$3:$C$102,2))","v":""},null,null,null,{"$f":"IF(IZ13=\"\",\"\",VLOOKUP(IZ13,Teilnehmer!$A$3:$C$102,2))","v":""},null,null,{"$f":"IF(JC13=\"\",\"\",VLOOKUP(JC13,Teilnehmer!$A$3:$C$102,2))","v":""},null,null,null,{"$f":"IF(JG13=\"\",\"\",VLOOKUP(JG13,Teilnehmer!$A$3:$C$102,2))","v":""},null,null,{"$f":"IF(JJ13=\"\",\"\",VLOOKUP(JJ13,Teilnehmer!$A$3:$C$102,2))","v":""},null,null,null,{"$f":"IF(JN13=\"\",\"\",VLOOKUP(JN13,Teilnehmer!$A$3:$C$102,2))","v":""},null,null,{"$f":"IF(JQ13=\"\",\"\",VLOOKUP(JQ13,Teilnehmer!$A$3:$C$102,2))","v":""},null,null,null,{"$f":"IF(JU13=\"\",\"\",VLOOKUP(JU13,Teilnehmer!$A$3:$C$102,2))","v":""},null,null,{"$f":"IF(JX13=\"\",\"\",VLOOKUP(JX13,Teilnehmer!$A$3:$C$102,2))","v":""},null,null,null,{"$f":"IF(KB13=\"\",\"\",VLOOKUP(KB13,Teilnehmer!$A$3:$C$102,2))","v":""},null,null,{"$f":"IF(KE13=\"\",\"\",VLOOKUP(KE13,Teilnehmer!$A$3:$C$102,2))","v":""},null,null,null,{"$f":"IF(KI13=\"\",\"\",VLOOKUP(KI13,Teilnehmer!$A$3:$C$102,2))","v":""},null,null,{"$f":"IF(KL13=\"\",\"\",VLOOKUP(KL13,Teilnehmer!$A$3:$C$102,2))","v":""},null,null,null,{"$f":"IF(KP13=\"\",\"\",VLOOKUP(KP13,Teilnehmer!$A$3:$C$102,2))","v":""},null,null,{"$f":"IF(KS13=\"\",\"\",VLOOKUP(KS13,Teilnehmer!$A$3:$C$102,2))","v":""}]
[null,{"$f":"IF(A14=\"\",\"\",VLOOKUP(A14,Teilnehmer!$A$3:$C$102,2))","v":""},null,null,{"$f":"IF(D14=\"\",\"\",VLOOKUP(D14,Teilnehmer!$A$3:$C$102,2))","v":""},null,null,null,{"$f":"IF(H14=\"\",\"\",VLOOKUP(H14,Teilnehmer!$A$3:$C$102,2))","v":""},null,null,{"$f":"IF(K14=\"\",\"\",VLOOKUP(K14,Teilnehmer!$A$3:$C$102,2))","v":""},null,null,null,{"$f":"IF(O14=\"\",\"\",VLOOKUP(O14,Teilnehmer!$A$3:$C$102,2))","v":""},null,null,{"$f":"IF(R14=\"\",\"\",VLOOKUP(R14,Teilnehmer!$A$3:$C$102,2))","v":""},null,null,null,{"$f":"IF(V14=\"\",\"\",VLOOKUP(V14,Teilnehmer!$A$3:$C$102,2))","v":""},null,null,{"$f":"IF(Y14=\"\",\"\",VLOOKUP(Y14,Teilnehmer!$A$3:$C$102,2))","v":""},null,null,null,{"$f":"IF(AC14=\"\",\"\",VLOOKUP(AC14,Teilnehmer!$A$3:$C$102,2))","v":""},null,null,{"$f":"IF(AF14=\"\",\"\",VLOOKUP(AF14,Teilnehmer!$A$3:$C$102,2))","v":""},null,null,null,{"$f":"IF(AJ14=\"\",\"\",VLOOKUP(AJ14,Teilnehmer!$A$3:$C$102,2))","v":""},null,null,{"$f":"IF(AM14=\"\",\"\",VLOOKUP(AM14,Teilnehmer!$A$3:$C$102,2))","v":""},null,null,null,{"$f":"IF(AQ14=\"\",\"\",VLOOKUP(AQ14,Teilnehmer!$A$3:$C$102,2))","v":""},null,null,{"$f":"IF(AT14=\"\",\"\",VLOOKUP(AT14,Teilnehmer!$A$3:$C$102,2))","v":""},null,null,null,{"$f":"IF(AX14=\"\",\"\",VLOOKUP(AX14,Teilnehmer!$A$3:$C$102,2))","v":""},null,null,{"$f":"IF(BA14=\"\",\"\",VLOOKUP(BA14,Teilnehmer!$A$3:$C$102,2))","v":""},null,null,null,{"$f":"IF(BE14=\"\",\"\",VLOOKUP(BE14,Teilnehmer!$A$3:$C$102,2))","v":""},null,null,{"$f":"IF(BH14=\"\",\"\",VLOOKUP(BH14,Teilnehmer!$A$3:$C$102,2))","v":""},null,null,null,{"$f":"IF(BL14=\"\",\"\",VLOOKUP(BL14,Teilnehmer!$A$3:$C$102,2))","v":""},null,null,{"$f":"IF(BO14=\"\",\"\",VLOOKUP(BO14,Teilnehmer!$A$3:$C$102,2))","v":""},null,null,null,{"$f":"IF(BS14=\"\",\"\",VLOOKUP(BS14,Teilnehmer!$A$3:$C$102,2))","v":""},null,null,{"$f":"IF(BV14=\"\",\"\",VLOOKUP(BV14,Teilnehmer!$A$3:$C$102,2))","v":""},null,null,null,{"$f":"IF(BZ14=\"\",\"\",VLOOKUP(BZ14,Teilnehmer!$A$3:$C$102,2))","v":""},null,null,{"$f":"IF(CC14=\"\",\"\",VLOOKUP(CC14,Teilnehmer!$A$3:$C$102,2))","v":""},null,null,null,{"$f":"IF(CG14=\"\",\"\",VLOOKUP(CG14,Teilnehmer!$A$3:$C$102,2))","v":""},null,null,{"$f":"IF(CJ14=\"\",\"\",VLOOKUP(CJ14,Teilnehmer!$A$3:$C$102,2))","v":""},null,null,null,{"$f":"IF(CN14=\"\",\"\",VLOOKUP(CN14,Teilnehmer!$A$3:$C$102,2))","v":""},null,null,{"$f":"IF(CQ14=\"\",\"\",VLOOKUP(CQ14,Teilnehmer!$A$3:$C$102,2))","v":""},null,null,null,{"$f":"IF(CU14=\"\",\"\",VLOOKUP(CU14,Teilnehmer!$A$3:$C$102,2))","v":""},null,null,{"$f":"IF(CX14=\"\",\"\",VLOOKUP(CX14,Teilnehmer!$A$3:$C$102,2))","v":""},null,null,null,{"$f":"IF(DB14=\"\",\"\",VLOOKUP(DB14,Teilnehmer!$A$3:$C$102,2))","v":""},null,null,{"$f":"IF(DE14=\"\",\"\",VLOOKUP(DE14,Teilnehmer!$A$3:$C$102,2))","v":""},null,null,null,{"$f":"IF(DI14=\"\",\"\",VLOOKUP(DI14,Teilnehmer!$A$3:$C$102,2))","v":""},null,null,{"$f":"IF(DL14=\"\",\"\",VLOOKUP(DL14,Teilnehmer!$A$3:$C$102,2))","v":""},null,null,null,{"$f":"IF(DP14=\"\",\"\",VLOOKUP(DP14,Teilnehmer!$A$3:$C$102,2))","v":""},null,null,{"$f":"IF(DS14=\"\",\"\",VLOOKUP(DS14,Teilnehmer!$A$3:$C$102,2))","v":""},null,null,null,{"$f":"IF(DW14=\"\",\"\",VLOOKUP(DW14,Teilnehmer!$A$3:$C$102,2))","v":""},null,null,{"$f":"IF(DZ14=\"\",\"\",VLOOKUP(DZ14,Teilnehmer!$A$3:$C$102,2))","v":""},null,null,null,{"$f":"IF(ED14=\"\",\"\",VLOOKUP(ED14,Teilnehmer!$A$3:$C$102,2))","v":""},null,null,{"$f":"IF(EG14=\"\",\"\",VLOOKUP(EG14,Teilnehmer!$A$3:$C$102,2))","v":""},null,null,null,{"$f":"IF(EK14=\"\",\"\",VLOOKUP(EK14,Teilnehmer!$A$3:$C$102,2))","v":""},null,null,{"$f":"IF(EN14=\"\",\"\",VLOOKUP(EN14,Teilnehmer!$A$3:$C$102,2))","v":""},null,null,null,{"$f":"IF(ER14=\"\",\"\",VLOOKUP(ER14,Teilnehmer!$A$3:$C$102,2))","v":""},null,null,{"$f":"IF(EU14=\"\",\"\",VLOOKUP(EU14,Teilnehmer!$A$3:$C$102,2))","v":""},null,null,null,{"$f":"IF(EY14=\"\",\"\",VLOOKUP(EY14,Teilnehmer!$A$3:$C$102,2))","v":""},null,null,{"$f":"IF(FB14=\"\",\"\",VLOOKUP(FB14,Teilnehmer!$A$3:$C$102,2))","v":""},null,null,null,{"$f":"IF(FF14=\"\",\"\",VLOOKUP(FF14,Teilnehmer!$A$3:$C$102,2))","v":""},null,null,{"$f":"IF(FI14=\"\",\"\",VLOOKUP(FI14,Teilnehmer!$A$3:$C$102,2))","v":""},null,null,null,{"$f":"IF(FM14=\"\",\"\",VLOOKUP(FM14,Teilnehmer!$A$3:$C$102,2))","v":""},null,null,{"$f":"IF(FP14=\"\",\"\",VLOOKUP(FP14,Teilnehmer!$A$3:$C$102,2))","v":""},null,null,null,{"$f":"IF(FT14=\"\",\"\",VLOOKUP(FT14,Teilnehmer!$A$3:$C$102,2))","v":""},null,null,{"$f":"IF(FW14=\"\",\"\",VLOOKUP(FW14,Teilnehmer!$A$3:$C$102,2))","v":""},null,null,null,{"$f":"IF(GA14=\"\",\"\",VLOOKUP(GA14,Teilnehmer!$A$3:$C$102,2))","v":""},null,null,{"$f":"IF(GD14=\"\",\"\",VLOOKUP(GD14,Teilnehmer!$A$3:$C$102,2))","v":""},null,null,null,{"$f":"IF(GH14=\"\",\"\",VLOOKUP(GH14,Teilnehmer!$A$3:$C$102,2))","v":""},null,null,{"$f":"IF(GK14=\"\",\"\",VLOOKUP(GK14,Teilnehmer!$A$3:$C$102,2))","v":""},null,null,null,{"$f":"IF(GO14=\"\",\"\",VLOOKUP(GO14,Teilnehmer!$A$3:$C$102,2))","v":""},null,null,{"$f":"IF(GR14=\"\",\"\",VLOOKUP(GR14,Teilnehmer!$A$3:$C$102,2))","v":""},null,null,null,{"$f":"IF(GV14=\"\",\"\",VLOOKUP(GV14,Teilnehmer!$A$3:$C$102,2))","v":""},null,null,{"$f":"IF(GY14=\"\",\"\",VLOOKUP(GY14,Teilnehmer!$A$3:$C$102,2))","v":""},null,null,null,{"$f":"IF(HC14=\"\",\"\",VLOOKUP(HC14,Teilnehmer!$A$3:$C$102,2))","v":""},null,null,{"$f":"IF(HF14=\"\",\"\",VLOOKUP(HF14,Teilnehmer!$A$3:$C$102,2))","v":""},null,null,null,{"$f":"IF(HJ14=\"\",\"\",VLOOKUP(HJ14,Teilnehmer!$A$3:$C$102,2))","v":""},null,null,{"$f":"IF(HM14=\"\",\"\",VLOOKUP(HM14,Teilnehmer!$A$3:$C$102,2))","v":""},null,null,null,{"$f":"IF(HQ14=\"\",\"\",VLOOKUP(HQ14,Teilnehmer!$A$3:$C$102,2))","v":""},null,null,{"$f":"IF(HT14=\"\",\"\",VLOOKUP(HT14,Teilnehmer!$A$3:$C$102,2))","v":""},null,null,null,{"$f":"IF(HX14=\"\",\"\",VLOOKUP(HX14,Teilnehmer!$A$3:$C$102,2))","v":""},null,null,{"$f":"IF(IA14=\"\",\"\",VLOOKUP(IA14,Teilnehmer!$A$3:$C$102,2))","v":""},null,null,null,{"$f":"IF(IE14=\"\",\"\",VLOOKUP(IE14,Teilnehmer!$A$3:$C$102,2))","v":""},null,null,{"$f":"IF(IH14=\"\",\"\",VLOOKUP(IH14,Teilnehmer!$A$3:$C$102,2))","v":""},null,null,null,{"$f":"IF(IL14=\"\",\"\",VLOOKUP(IL14,Teilnehmer!$A$3:$C$102,2))","v":""},null,null,{"$f":"IF(IO14=\"\",\"\",VLOOKUP(IO14,Teilnehmer!$A$3:$C$102,2))","v":""},null,null,null,{"$f":"IF(IS14=\"\",\"\",VLOOKUP(IS14,Teilnehmer!$A$3:$C$102,2))","v":""},null,null,{"$f":"IF(IV14=\"\",\"\",VLOOKUP(IV14,Teilnehmer!$A$3:$C$102,2))","v":""},null,null,null,{"$f":"IF(IZ14=\"\",\"\",VLOOKUP(IZ14,Teilnehmer!$A$3:$C$102,2))","v":""},null,null,{"$f":"IF(JC14=\"\",\"\",VLOOKUP(JC14,Teilnehmer!$A$3:$C$102,2))","v":""},null,null,null,{"$f":"IF(JG14=\"\",\"\",VLOOKUP(JG14,Teilnehmer!$A$3:$C$102,2))","v":""},null,null,{"$f":"IF(JJ14=\"\",\"\",VLOOKUP(JJ14,Teilnehmer!$A$3:$C$102,2))","v":""},null,null,null,{"$f":"IF(JN14=\"\",\"\",VLOOKUP(JN14,Teilnehmer!$A$3:$C$102,2))","v":""},null,null,{"$f":"IF(JQ14=\"\",\"\",VLOOKUP(JQ14,Teilnehmer!$A$3:$C$102,2))","v":""},null,null,null,{"$f":"IF(JU14=\"\",\"\",VLOOKUP(JU14,Teilnehmer!$A$3:$C$102,2))","v":""},null,null,{"$f":"IF(JX14=\"\",\"\",VLOOKUP(JX14,Teilnehmer!$A$3:$C$102,2))","v":""},null,null,null,{"$f":"IF(KB14=\"\",\"\",VLOOKUP(KB14,Teilnehmer!$A$3:$C$102,2))","v":""},null,null,{"$f":"IF(KE14=\"\",\"\",VLOOKUP(KE14,Teilnehmer!$A$3:$C$102,2))","v":""},null,null,null,{"$f":"IF(KI14=\"\",\"\",VLOOKUP(KI14,Teilnehmer!$A$3:$C$102,2))","v":""},null,null,{"$f":"IF(KL14=\"\",\"\",VLOOKUP(KL14,Teilnehmer!$A$3:$C$102,2))","v":""},null,null,null,{"$f":"IF(KP14=\"\",\"\",VLOOKUP(KP14,Teilnehmer!$A$3:$C$102,2))","v":""},null,null,{"$f":"IF(KS14=\"\",\"\",VLOOKUP(KS14,Teilnehmer!$A$3:$C$102,2))","v":""}]
[null,{"$f":"IF(A15=\"\",\"\",VLOOKUP(A15,Teilnehmer!$A$3:$C$102,2))","v":""},null,null,{"$f":"IF(D15=\"\",\"\",VLOOKUP(D15,Teilnehmer!$A$3:$C$102,2))","v":""},null,null,null,{"$f":"IF(H15=\"\",\"\",VLOOKUP(H15,Teilnehmer!$A$3:$C$102,2))","v":""},null,null,{"$f":"IF(K15=\"\",\"\",VLOOKUP(K15,Teilnehmer!$A$3:$C$102,2))","v":""},null,null,null,{"$f":"IF(O15=\"\",\"\",VLOOKUP(O15,Teilnehmer!$A$3:$C$102,2))","v":""},null,null,{"$f":"IF(R15=\"\",\"\",VLOOKUP(R15,Teilnehmer!$A$3:$C$102,2))","v":""},null,null,null,{"$f":"IF(V15=\"\",\"\",VLOOKUP(V15,Teilnehmer!$A$3:$C$102,2))","v":""},null,null,{"$f":"IF(Y15=\"\",\"\",VLOOKUP(Y15,Teilnehmer!$A$3:$C$102,2))","v":""},null,null,null,{"$f":"IF(AC15=\"\",\"\",VLOOKUP(AC15,Teilnehmer!$A$3:$C$102,2))","v":""},null,null,{"$f":"IF(AF15=\"\",\"\",VLOOKUP(AF15,Teilnehmer!$A$3:$C$102,2))","v":""},null,null,null,{"$f":"IF(AJ15=\"\",\"\",VLOOKUP(AJ15,Teilnehmer!$A$3:$C$102,2))","v":""},null,null,{"$f":"IF(AM15=\"\",\"\",VLOOKUP(AM15,Teilnehmer!$A$3:$C$102,2))","v":""},null,null,null,{"$f":"IF(AQ15=\"\",\"\",VLOOKUP(AQ15,Teilnehmer!$A$3:$C$102,2))","v":""},null,null,{"$f":"IF(AT15=\"\",\"\",VLOOKUP(AT15,Teilnehmer!$A$3:$C$102,2))","v":""},null,null,null,{"$f":"IF(AX15=\"\",\"\",VLOOKUP(AX15,Teilnehmer!$A$3:$C$102,2))","v":""},null,null,{"$f":"IF(BA15=\"\",\"\",VLOOKUP(BA15,Teilnehmer!$A$3:$C$102,2))","v":""},null,null,null,{"$f":"IF(BE15=\"\",\"\",VLOOKUP(BE15,Teilnehmer!$A$3:$C$102,2))","v":""},null,null,{"$f":"IF(BH15=\"\",\"\",VLOOKUP(BH15,Teilnehmer!$A$3:$C$102,2))","v":""},null,null,null,{"$f":"IF(BL15=\"\",\"\",VLOOKUP(BL15,Teilnehmer!$A$3:$C$102,2))","v":""},null,null,{"$f":"IF(BO15=\"\",\"\",VLOOKUP(BO15,Teilnehmer!$A$3:$C$102,2))","v":""},null,null,null,{"$f":"IF(BS15=\"\",\"\",VLOOKUP(BS15,Teilnehmer!$A$3:$C$102,2))","v":""},null,null,{"$f":"IF(BV15=\"\",\"\",VLOOKUP(BV15,Teilnehmer!$A$3:$C$102,2))","v":""},null,null,null,{"$f":"IF(BZ15=\"\",\"\",VLOOKUP(BZ15,Teilnehmer!$A$3:$C$102,2))","v":""},null,null,{"$f":"IF(CC15=\"\",\"\",VLOOKUP(CC15,Teilnehmer!$A$3:$C$102,2))","v":""},null,null,null,{"$f":"IF(CG15=\"\",\"\",VLOOKUP(CG15,Teilnehmer!$A$3:$C$102,2))","v":""},null,null,{"$f":"IF(CJ15=\"\",\"\",VLOOKUP(CJ15,Teilnehmer!$A$3:$C$102,2))","v":""},null,null,null,{"$f":"IF(CN15=\"\",\"\",VLOOKUP(CN15,Teilnehmer!$A$3:$C$102,2))","v":""},null,null,{"$f":"IF(CQ15=\"\",\"\",VLOOKUP(CQ15,Teilnehmer!$A$3:$C$102,2))","v":""},null,null,null,{"$f":"IF(CU15=\"\",\"\",VLOOKUP(CU15,Teilnehmer!$A$3:$C$102,2))","v":""},null,null,{"$f":"IF(CX15=\"\",\"\",VLOOKUP(CX15,Teilnehmer!$A$3:$C$102,2))","v":""},null,null,null,{"$f":"IF(DB15=\"\",\"\",VLOOKUP(DB15,Teilnehmer!$A$3:$C$102,2))","v":""},null,null,{"$f":"IF(DE15=\"\",\"\",VLOOKUP(DE15,Teilnehmer!$A$3:$C$102,2))","v":""},null,null,null,{"$f":"IF(DI15=\"\",\"\",VLOOKUP(DI15,Teilnehmer!$A$3:$C$102,2))","v":""},null,null,{"$f":"IF(DL15=\"\",\"\",VLOOKUP(DL15,Teilnehmer!$A$3:$C$102,2))","v":""},null,null,null,{"$f":"IF(DP15=\"\",\"\",VLOOKUP(DP15,Teilnehmer!$A$3:$C$102,2))","v":""},null,null,{"$f":"IF(DS15=\"\",\"\",VLOOKUP(DS15,Teilnehmer!$A$3:$C$102,2))","v":""},null,null,null,{"$f":"IF(DW15=\"\",\"\",VLOOKUP(DW15,Teilnehmer!$A$3:$C$102,2))","v":""},null,null,{"$f":"IF(DZ15=\"\",\"\",VLOOKUP(DZ15,Teilnehmer!$A$3:$C$102,2))","v":""},null,null,null,{"$f":"IF(ED15=\"\",\"\",VLOOKUP(ED15,Teilnehmer!$A$3:$C$102,2))","v":""},null,null,{"$f":"IF(EG15=\"\",\"\",VLOOKUP(EG15,Teilnehmer!$A$3:$C$102,2))","v":""},null,null,null,{"$f":"IF(EK15=\"\",\"\",VLOOKUP(EK15,Teilnehmer!$A$3:$C$102,2))","v":""},null,null,{"$f":"IF(EN15=\"\",\"\",VLOOKUP(EN15,Teilnehmer!$A$3:$C$102,2))","v":""},null,null,null,{"$f":"IF(ER15=\"\",\"\",VLOOKUP(ER15,Teilnehmer!$A$3:$C$102,2))","v":""},null,null,{"$f":"IF(EU15=\"\",\"\",VLOOKUP(EU15,Teilnehmer!$A$3:$C$102,2))","v":""},null,null,null,{"$f":"IF(EY15=\"\",\"\",VLOOKUP(EY15,Teilnehmer!$A$3:$C$102,2))","v":""},null,null,{"$f":"IF(FB15=\"\",\"\",VLOOKUP(FB15,Teilnehmer!$A$3:$C$102,2))","v":""},null,null,null,{"$f":"IF(FF15=\"\",\"\",VLOOKUP(FF15,Teilnehmer!$A$3:$C$102,2))","v":""},null,null,{"$f":"IF(FI15=\"\",\"\",VLOOKUP(FI15,Teilnehmer!$A$3:$C$102,2))","v":""},null,null,null,{"$f":"IF(FM15=\"\",\"\",VLOOKUP(FM15,Teilnehmer!$A$3:$C$102,2))","v":""},null,null,{"$f":"IF(FP15=\"\",\"\",VLOOKUP(FP15,Teilnehmer!$A$3:$C$102,2))","v":""},null,null,null,{"$f":"IF(FT15=\"\",\"\",VLOOKUP(FT15,Teilnehmer!$A$3:$C$102,2))","v":""},null,null,{"$f":"IF(FW15=\"\",\"\",VLOOKUP(FW15,Teilnehmer!$A$3:$C$102,2))","v":""},null,null,null,{"$f":"IF(GA15=\"\",\"\",VLOOKUP(GA15,Teilnehmer!$A$3:$C$102,2))","v":""},null,null,{"$f":"IF(GD15=\"\",\"\",VLOOKUP(GD15,Teilnehmer!$A$3:$C$102,2))","v":""},null,null,null,{"$f":"IF(GH15=\"\",\"\",VLOOKUP(GH15,Teilnehmer!$A$3:$C$102,2))","v":""},null,null,{"$f":"IF(GK15=\"\",\"\",VLOOKUP(GK15,Teilnehmer!$A$3:$C$102,2))","v":""},null,null,null,{"$f":"IF(GO15=\"\",\"\",VLOOKUP(GO15,Teilnehmer!$A$3:$C$102,2))","v":""},null,null,{"$f":"IF(GR15=\"\",\"\",VLOOKUP(GR15,Teilnehmer!$A$3:$C$102,2))","v":""},null,null,null,{"$f":"IF(GV15=\"\",\"\",VLOOKUP(GV15,Teilnehmer!$A$3:$C$102,2))","v":""},null,null,{"$f":"IF(GY15=\"\",\"\",VLOOKUP(GY15,Teilnehmer!$A$3:$C$102,2))","v":""},null,null,null,{"$f":"IF(HC15=\"\",\"\",VLOOKUP(HC15,Teilnehmer!$A$3:$C$102,2))","v":""},null,null,{"$f":"IF(HF15=\"\",\"\",VLOOKUP(HF15,Teilnehmer!$A$3:$C$102,2))","v":""},null,null,null,{"$f":"IF(HJ15=\"\",\"\",VLOOKUP(HJ15,Teilnehmer!$A$3:$C$102,2))","v":""},null,null,{"$f":"IF(HM15=\"\",\"\",VLOOKUP(HM15,Teilnehmer!$A$3:$C$102,2))","v":""},null,null,null,{"$f":"IF(HQ15=\"\",\"\",VLOOKUP(HQ15,Teilnehmer!$A$3:$C$102,2))","v":""},null,null,{"$f":"IF(HT15=\"\",\"\",VLOOKUP(HT15,Teilnehmer!$A$3:$C$102,2))","v":""},null,null,null,{"$f":"IF(HX15=\"\",\"\",VLOOKUP(HX15,Teilnehmer!$A$3:$C$102,2))","v":""},null,null,{"$f":"IF(IA15=\"\",\"\",VLOOKUP(IA15,Teilnehmer!$A$3:$C$102,2))","v":""},null,null,null,{"$f":"IF(IE15=\"\",\"\",VLOOKUP(IE15,Teilnehmer!$A$3:$C$102,2))","v":""},null,null,{"$f":"IF(IH15=\"\",\"\",VLOOKUP(IH15,Teilnehmer!$A$3:$C$102,2))","v":""},null,null,null,{"$f":"IF(IL15=\"\",\"\",VLOOKUP(IL15,Teilnehmer!$A$3:$C$102,2))","v":""},null,null,{"$f":"IF(IO15=\"\",\"\",VLOOKUP(IO15,Teilnehmer!$A$3:$C$102,2))","v":""},null,null,null,{"$f":"IF(IS15=\"\",\"\",VLOOKUP(IS15,Teilnehmer!$A$3:$C$102,2))","v":""},null,null,{"$f":"IF(IV15=\"\",\"\",VLOOKUP(IV15,Teilnehmer!$A$3:$C$102,2))","v":""},null,null,null,{"$f":"IF(IZ15=\"\",\"\",VLOOKUP(IZ15,Teilnehmer!$A$3:$C$102,2))","v":""},null,null,{"$f":"IF(JC15=\"\",\"\",VLOOKUP(JC15,Teilnehmer!$A$3:$C$102,2))","v":""},null,null,null,{"$f":"IF(JG15=\"\",\"\",VLOOKUP(JG15,Teilnehmer!$A$3:$C$102,2))","v":""},null,null,{"$f":"IF(JJ15=\"\",\"\",VLOOKUP(JJ15,Teilnehmer!$A$3:$C$102,2))","v":""},null,null,null,{"$f":"IF(JN15=\"\",\"\",VLOOKUP(JN15,Teilnehmer!$A$3:$C$102,2))","v":""},null,null,{"$f":"IF(JQ15=\"\",\"\",VLOOKUP(JQ15,Teilnehmer!$A$3:$C$102,2))","v":""},null,null,null,{"$f":"IF(JU15=\"\",\"\",VLOOKUP(JU15,Teilnehmer!$A$3:$C$102,2))","v":""},null,null,{"$f":"IF(JX15=\"\",\"\",VLOOKUP(JX15,Teilnehmer!$A$3:$C$102,2))","v":""},null,null,null,{"$f":"IF(KB15=\"\",\"\",VLOOKUP(KB15,Teilnehmer!$A$3:$C$102,2))","v":""},null,null,{"$f":"IF(KE15=\"\",\"\",VLOOKUP(KE15,Teilnehmer!$A$3:$C$102,2))","v":""},null,null,null,{"$f":"IF(KI15=\"\",\"\",VLOOKUP(KI15,Teilnehmer!$A$3:$C$102,2))","v":""},null,null,{"$f":"IF(KL15=\"\",\"\",VLOOKUP(KL15,Teilnehmer!$A$3:$C$102,2))","v":""},null,null,null,{"$f":"IF(KP15=\"\",\"\",VLOOKUP(KP15,Teilnehmer!$A$3:$C$102,2))","v":""},null,null,{"$f":"IF(KS15=\"\",\"\",VLOOKUP(KS15,Teilnehmer!$A$3:$C$102,2))","v":""}]
[null,{"$f":"IF(A16=\"\",\"\",VLOOKUP(A16,Teilnehmer!$A$3:$C$102,2))","v":""},null,null,{"$f":"IF(D16=\"\",\"\",VLOOKUP(D16,Teilnehmer!$A$3:$C$102,2))","v":""},null,null,null,{"$f":"IF(H16=\"\",\"\",VLOOKUP(H16,Teilnehmer!$A$3:$C$102,2))","v":""},null,null,{"$f":"IF(K16=\"\",\"\",VLOOKUP(K16,Teilnehmer!$A$3:$C$102,2))","v":""},null,null,null,{"$f":"IF(O16=\"\",\"\",VLOOKUP(O16,Teilnehmer!$A$3:$C$102,2))","v":""},null,null,{"$f":"IF(R16=\"\",\"\",VLOOKUP(R16,Teilnehmer!$A$3:$C$102,2))","v":""},null,null,null,{"$f":"IF(V16=\"\",\"\",VLOOKUP(V16,Teilnehmer!$A$3:$C$102,2))","v":""},null,null,{"$f":"IF(Y16=\"\",\"\",VLOOKUP(Y16,Teilnehmer!$A$3:$C$102,2))","v":""},null,null,null,{"$f":"IF(AC16=\"\",\"\",VLOOKUP(AC16,Teilnehmer!$A$3:$C$102,2))","v":""},null,null,{"$f":"IF(AF16=\"\",\"\",VLOOKUP(AF16,Teilnehmer!$A$3:$C$102,2))","v":""},null,null,null,{"$f":"IF(AJ16=\"\",\"\",VLOOKUP(AJ16,Teilnehmer!$A$3:$C$102,2))","v":""},null,null,{"$f":"IF(AM16=\"\",\"\",VLOOKUP(AM16,Teilnehmer!$A$3:$C$102,2))","v":""},null,null,null,{"$f":"IF(AQ16=\"\",\"\",VLOOKUP(AQ16,Teilnehmer!$A$3:$C$102,2))","v":""},null,null,{"$f":"IF(AT16=\"\",\"\",VLOOKUP(AT16,Teilnehmer!$A$3:$C$102,2))","v":""},null,null,null,{"$f":"IF(AX16=\"\",\"\",VLOOKUP(AX16,Teilnehmer!$A$3:$C$102,2))","v":""},null,null,{"$f":"IF(BA16=\"\",\"\",VLOOKUP(BA16,Teilnehmer!$A$3:$C$102,2))","v":""},null,null,null,{"$f":"IF(BE16=\"\",\"\",VLOOKUP(BE16,Teilnehmer!$A$3:$C$102,2))","v":""},null,null,{"$f":"IF(BH16=\"\",\"\",VLOOKUP(BH16,Teilnehmer!$A$3:$C$102,2))","v":""},null,null,null,{"$f":"IF(BL16=\"\",\"\",VLOOKUP(BL16,Teilnehmer!$A$3:$C$102,2))","v":""},null,null,{"$f":"IF(BO16=\"\",\"\",VLOOKUP(BO16,Teilnehmer!$A$3:$C$102,2))","v":""},null,null,null,{"$f":"IF(BS16=\"\",\"\",VLOOKUP(BS16,Teilnehmer!$A$3:$C$102,2))","v":""},null,null,{"$f":"IF(BV16=\"\",\"\",VLOOKUP(BV16,Teilnehmer!$A$3:$C$102,2))","v":""},null,null,null,{"$f":"IF(BZ16=\"\",\"\",VLOOKUP(BZ16,Teilnehmer!$A$3:$C$102,2))","v":""},null,null,{"$f":"IF(CC16=\"\",\"\",VLOOKUP(CC16,Teilnehmer!$A$3:$C$102,2))","v":""},null,null,null,{"$f":"IF(CG16=\"\",\"\",VLOOKUP(CG16,Teilnehmer!$A$3:$C$102,2))","v":""},null,null,{"$f":"IF(CJ16=\"\",\"\",VLOOKUP(CJ16,Teilnehmer!$A$3:$C$102,2))","v":""},null,null,null,{"$f":"IF(CN16=\"\",\"\",VLOOKUP(CN16,Teilnehmer!$A$3:$C$102,2))","v":""},null,null,{"$f":"IF(CQ16=\"\",\"\",VLOOKUP(CQ16,Teilnehmer!$A$3:$C$102,2))","v":""},null,null,null,{"$f":"IF(CU16=\"\",\"\",VLOOKUP(CU16,Teilnehmer!$A$3:$C$102,2))","v":""},null,null,{"$f":"IF(CX16=\"\",\"\",VLOOKUP(CX16,Teilnehmer!$A$3:$C$102,2))","v":""},null,null,null,{"$f":"IF(DB16=\"\",\"\",VLOOKUP(DB16,Teilnehmer!$A$3:$C$102,2))","v":""},null,null,{"$f":"IF(DE16=\"\",\"\",VLOOKUP(DE16,Teilnehmer!$A$3:$C$102,2))","v":""},null,null,null,{"$f":"IF(DI16=\"\",\"\",VLOOKUP(DI16,Teilnehmer!$A$3:$C$102,2))","v":""},null,null,{"$f":"IF(DL16=\"\",\"\",VLOOKUP(DL16,Teilnehmer!$A$3:$C$102,2))","v":""},null,null,null,{"$f":"IF(DP16=\"\",\"\",VLOOKUP(DP16,Teilnehmer!$A$3:$C$102,2))","v":""},null,null,{"$f":"IF(DS16=\"\",\"\",VLOOKUP(DS16,Teilnehmer!$A$3:$C$102,2))","v":""},null,null,null,{"$f":"IF(DW16=\"\",\"\",VLOOKUP(DW16,Teilnehmer!$A$3:$C$102,2))","v":""},null,null,{"$f":"IF(DZ16=\"\",\"\",VLOOKUP(DZ16,Teilnehmer!$A$3:$C$102,2))","v":""},null,null,null,{"$f":"IF(ED16=\"\",\"\",VLOOKUP(ED16,Teilnehmer!$A$3:$C$102,2))","v":""},null,null,{"$f":"IF(EG16=\"\",\"\",VLOOKUP(EG16,Teilnehmer!$A$3:$C$102,2))","v":""},null,null,null,{"$f":"IF(EK16=\"\",\"\",VLOOKUP(EK16,Teilnehmer!$A$3:$C$102,2))","v":""},null,null,{"$f":"IF(EN16=\"\",\"\",VLOOKUP(EN16,Teilnehmer!$A$3:$C$102,2))","v":""},null,null,null,{"$f":"IF(ER16=\"\",\"\",VLOOKUP(ER16,Teilnehmer!$A$3:$C$102,2))","v":""},null,null,{"$f":"IF(EU16=\"\",\"\",VLOOKUP(EU16,Teilnehmer!$A$3:$C$102,2))","v":""},null,null,null,{"$f":"IF(EY16=\"\",\"\",VLOOKUP(EY16,Teilnehmer!$A$3:$C$102,2))","v":""},null,null,{"$f":"IF(FB16=\"\",\"\",VLOOKUP(FB16,Teilnehmer!$A$3:$C$102,2))","v":""},null,null,null,{"$f":"IF(FF16=\"\",\"\",VLOOKUP(FF16,Teilnehmer!$A$3:$C$102,2))","v":""},null,null,{"$f":"IF(FI16=\"\",\"\",VLOOKUP(FI16,Teilnehmer!$A$3:$C$102,2))","v":""},null,null,null,{"$f":"IF(FM16=\"\",\"\",VLOOKUP(FM16,Teilnehmer!$A$3:$C$102,2))","v":""},null,null,{"$f":"IF(FP16=\"\",\"\",VLOOKUP(FP16,Teilnehmer!$A$3:$C$102,2))","v":""},null,null,null,{"$f":"IF(FT16=\"\",\"\",VLOOKUP(FT16,Teilnehmer!$A$3:$C$102,2))","v":""},null,null,{"$f":"IF(FW16=\"\",\"\",VLOOKUP(FW16,Teilnehmer!$A$3:$C$102,2))","v":""},null,null,null,{"$f":"IF(GA16=\"\",\"\",VLOOKUP(GA16,Teilnehmer!$A$3:$C$102,2))","v":""},null,null,{"$f":"IF(GD16=\"\",\"\",VLOOKUP(GD16,Teilnehmer!$A$3:$C$102,2))","v":""},null,null,null,{"$f":"IF(GH16=\"\",\"\",VLOOKUP(GH16,Teilnehmer!$A$3:$C$102,2))","v":""},null,null,{"$f":"IF(GK16=\"\",\"\",VLOOKUP(GK16,Teilnehmer!$A$3:$C$102,2))","v":""},null,null,null,{"$f":"IF(GO16=\"\",\"\",VLOOKUP(GO16,Teilnehmer!$A$3:$C$102,2))","v":""},null,null,{"$f":"IF(GR16=\"\",\"\",VLOOKUP(GR16,Teilnehmer!$A$3:$C$102,2))","v":""},null,null,null,{"$f":"IF(GV16=\"\",\"\",VLOOKUP(GV16,Teilnehmer!$A$3:$C$102,2))","v":""},null,null,{"$f":"IF(GY16=\"\",\"\",VLOOKUP(GY16,Teilnehmer!$A$3:$C$102,2))","v":""},null,null,null,{"$f":"IF(HC16=\"\",\"\",VLOOKUP(HC16,Teilnehmer!$A$3:$C$102,2))","v":""},null,null,{"$f":"IF(HF16=\"\",\"\",VLOOKUP(HF16,Teilnehmer!$A$3:$C$102,2))","v":""},null,null,null,{"$f":"IF(HJ16=\"\",\"\",VLOOKUP(HJ16,Teilnehmer!$A$3:$C$102,2))","v":""},null,null,{"$f":"IF(HM16=\"\",\"\",VLOOKUP(HM16,Teilnehmer!$A$3:$C$102,2))","v":""},null,null,null,{"$f":"IF(HQ16=\"\",\"\",VLOOKUP(HQ16,Teilnehmer!$A$3:$C$102,2))","v":""},null,null,{"$f":"IF(HT16=\"\",\"\",VLOOKUP(HT16,Teilnehmer!$A$3:$C$102,2))","v":""},null,null,null,{"$f":"IF(HX16=\"\",\"\",VLOOKUP(HX16,Teilnehmer!$A$3:$C$102,2))","v":""},null,null,{"$f":"IF(IA16=\"\",\"\",VLOOKUP(IA16,Teilnehmer!$A$3:$C$102,2))","v":""},null,null,null,{"$f":"IF(IE16=\"\",\"\",VLOOKUP(IE16,Teilnehmer!$A$3:$C$102,2))","v":""},null,null,{"$f":"IF(IH16=\"\",\"\",VLOOKUP(IH16,Teilnehmer!$A$3:$C$102,2))","v":""},null,null,null,{"$f":"IF(IL16=\"\",\"\",VLOOKUP(IL16,Teilnehmer!$A$3:$C$102,2))","v":""},null,null,{"$f":"IF(IO16=\"\",\"\",VLOOKUP(IO16,Teilnehmer!$A$3:$C$102,2))","v":""},null,null,null,{"$f":"IF(IS16=\"\",\"\",VLOOKUP(IS16,Teilnehmer!$A$3:$C$102,2))","v":""},null,null,{"$f":"IF(IV16=\"\",\"\",VLOOKUP(IV16,Teilnehmer!$A$3:$C$102,2))","v":""},null,null,null,{"$f":"IF(IZ16=\"\",\"\",VLOOKUP(IZ16,Teilnehmer!$A$3:$C$102,2))","v":""},null,null,{"$f":"IF(JC16=\"\",\"\",VLOOKUP(JC16,Teilnehmer!$A$3:$C$102,2))","v":""},null,null,null,{"$f":"IF(JG16=\"\",\"\",VLOOKUP(JG16,Teilnehmer!$A$3:$C$102,2))","v":""},null,null,{"$f":"IF(JJ16=\"\",\"\",VLOOKUP(JJ16,Teilnehmer!$A$3:$C$102,2))","v":""},null,null,null,{"$f":"IF(JN16=\"\",\"\",VLOOKUP(JN16,Teilnehmer!$A$3:$C$102,2))","v":""},null,null,{"$f":"IF(JQ16=\"\",\"\",VLOOKUP(JQ16,Teilnehmer!$A$3:$C$102,2))","v":""},null,null,null,{"$f":"IF(JU16=\"\",\"\",VLOOKUP(JU16,Teilnehmer!$A$3:$C$102,2))","v":""},null,null,{"$f":"IF(JX16=\"\",\"\",VLOOKUP(JX16,Teilnehmer!$A$3:$C$102,2))","v":""},null,null,null,{"$f":"IF(KB16=\"\",\"\",VLOOKUP(KB16,Teilnehmer!$A$3:$C$102,2))","v":""},null,null,{"$f":"IF(KE16=\"\",\"\",VLOOKUP(KE16,Teilnehmer!$A$3:$C$102,2))","v":""},null,null,null,{"$f":"IF(KI16=\"\",\"\",VLOOKUP(KI16,Teilnehmer!$A$3:$C$102,2))","v":""},null,null,{"$f":"IF(KL16=\"\",\"\",VLOOKUP(KL16,Teilnehmer!$A$3:$C$102,2))","v":""},null,null,null,{"$f":"IF(KP16=\"\",\"\",VLOOKUP(KP16,Teilnehmer!$A$3:$C$102,2))","v":""},null,null,{"$f":"IF(KS16=\"\",\"\",VLOOKUP(KS16,Teilnehmer!$A$3:$C$102,2))","v":""}]
[null,{"$f":"IF(A17=\"\",\"\",VLOOKUP(A17,Teilnehmer!$A$3:$C$102,2))","v":""},null,null,{"$f":"IF(D17=\"\",\"\",VLOOKUP(D17,Teilnehmer!$A$3:$C$102,2))","v":""},null,null,null,{"$f":"IF(H17=\"\",\"\",VLOOKUP(H17,Teilnehmer!$A$3:$C$102,2))","v":""},null,null,{"$f":"IF(K17=\"\",\"\",VLOOKUP(K17,Teilnehmer!$A$3:$C$102,2))","v":""},null,null,null,{"$f":"IF(O17=\"\",\"\",VLOOKUP(O17,Teilnehmer!$A$3:$C$102,2))","v":""},null,null,{"$f":"IF(R17=\"\",\"\",VLOOKUP(R17,Teilnehmer!$A$3:$C$102,2))","v":""},null,null,null,{"$f":"IF(V17=\"\",\"\",VLOOKUP(V17,Teilnehmer!$A$3:$C$102,2))","v":""},null,null,{"$f":"IF(Y17=\"\",\"\",VLOOKUP(Y17,Teilnehmer!$A$3:$C$102,2))","v":""},null,null,null,{"$f":"IF(AC17=\"\",\"\",VLOOKUP(AC17,Teilnehmer!$A$3:$C$102,2))","v":""},null,null,{"$f":"IF(AF17=\"\",\"\",VLOOKUP(AF17,Teilnehmer!$A$3:$C$102,2))","v":""},null,null,null,{"$f":"IF(AJ17=\"\",\"\",VLOOKUP(AJ17,Teilnehmer!$A$3:$C$102,2))","v":""},null,null,{"$f":"IF(AM17=\"\",\"\",VLOOKUP(AM17,Teilnehmer!$A$3:$C$102,2))","v":""},null,null,null,{"$f":"IF(AQ17=\"\",\"\",VLOOKUP(AQ17,Teilnehmer!$A$3:$C$102,2))","v":""},null,null,{"$f":"IF(AT17=\"\",\"\",VLOOKUP(AT17,Teilnehmer!$A$3:$C$102,2))","v":""},null,null,null,{"$f":"IF(AX17=\"\",\"\",VLOOKUP(AX17,Teilnehmer!$A$3:$C$102,2))","v":""},null,null,{"$f":"IF(BA17=\"\",\"\",VLOOKUP(BA17,Teilnehmer!$A$3:$C$102,2))","v":""},null,null,null,{"$f":"IF(BE17=\"\",\"\",VLOOKUP(BE17,Teilnehmer!$A$3:$C$102,2))","v":""},null,null,{"$f":"IF(BH17=\"\",\"\",VLOOKUP(BH17,Teilnehmer!$A$3:$C$102,2))","v":""},null,null,null,{"$f":"IF(BL17=\"\",\"\",VLOOKUP(BL17,Teilnehmer!$A$3:$C$102,2))","v":""},null,null,{"$f":"IF(BO17=\"\",\"\",VLOOKUP(BO17,Teilnehmer!$A$3:$C$102,2))","v":""},null,null,null,{"$f":"IF(BS17=\"\",\"\",VLOOKUP(BS17,Teilnehmer!$A$3:$C$102,2))","v":""},null,null,{"$f":"IF(BV17=\"\",\"\",VLOOKUP(BV17,Teilnehmer!$A$3:$C$102,2))","v":""},null,null,null,{"$f":"IF(BZ17=\"\",\"\",VLOOKUP(BZ17,Teilnehmer!$A$3:$C$102,2))","v":""},null,null,{"$f":"IF(CC17=\"\",\"\",VLOOKUP(CC17,Teilnehmer!$A$3:$C$102,2))","v":""},null,null,null,{"$f":"IF(CG17=\"\",\"\",VLOOKUP(CG17,Teilnehmer!$A$3:$C$102,2))","v":""},null,null,{"$f":"IF(CJ17=\"\",\"\",VLOOKUP(CJ17,Teilnehmer!$A$3:$C$102,2))","v":""},null,null,null,{"$f":"IF(CN17=\"\",\"\",VLOOKUP(CN17,Teilnehmer!$A$3:$C$102,2))","v":""},null,null,{"$f":"IF(CQ17=\"\",\"\",VLOOKUP(CQ17,Teilnehmer!$A$3:$C$102,2))","v":""},null,null,null,{"$f":"IF(CU17=\"\",\"\",VLOOKUP(CU17,Teilnehmer!$A$3:$C$102,2))","v":""},null,null,{"$f":"IF(CX17=\"\",\"\",VLOOKUP(CX17,Teilnehmer!$A$3:$C$102,2))","v":""},null,null,null,{"$f":"IF(DB17=\"\",\"\",VLOOKUP(DB17,Teilnehmer!$A$3:$C$102,2))","v":""},null,null,{"$f":"IF(DE17=\"\",\"\",VLOOKUP(DE17,Teilnehmer!$A$3:$C$102,2))","v":""},null,null,null,{"$f":"IF(DI17=\"\",\"\",VLOOKUP(DI17,Teilnehmer!$A$3:$C$102,2))","v":""},null,null,{"$f":"IF(DL17=\"\",\"\",VLOOKUP(DL17,Teilnehmer!$A$3:$C$102,2))","v":""},null,null,null,{"$f":"IF(DP17=\"\",\"\",VLOOKUP(DP17,Teilnehmer!$A$3:$C$102,2))","v":""},null,null,{"$f":"IF(DS17=\"\",\"\",VLOOKUP(DS17,Teilnehmer!$A$3:$C$102,2))","v":""},null,null,null,{"$f":"IF(DW17=\"\",\"\",VLOOKUP(DW17,Teilnehmer!$A$3:$C$102,2))","v":""},null,null,{"$f":"IF(DZ17=\"\",\"\",VLOOKUP(DZ17,Teilnehmer!$A$3:$C$102,2))","v":""},null,null,null,{"$f":"IF(ED17=\"\",\"\",VLOOKUP(ED17,Teilnehmer!$A$3:$C$102,2))","v":""},null,null,{"$f":"IF(EG17=\"\",\"\",VLOOKUP(EG17,Teilnehmer!$A$3:$C$102,2))","v":""},null,null,null,{"$f":"IF(EK17=\"\",\"\",VLOOKUP(EK17,Teilnehmer!$A$3:$C$102,2))","v":""},null,null,{"$f":"IF(EN17=\"\",\"\",VLOOKUP(EN17,Teilnehmer!$A$3:$C$102,2))","v":""},null,null,null,{"$f":"IF(ER17=\"\",\"\",VLOOKUP(ER17,Teilnehmer!$A$3:$C$102,2))","v":""},null,null,{"$f":"IF(EU17=\"\",\"\",VLOOKUP(EU17,Teilnehmer!$A$3:$C$102,2))","v":""},null,null,null,{"$f":"IF(EY17=\"\",\"\",VLOOKUP(EY17,Teilnehmer!$A$3:$C$102,2))","v":""},null,null,{"$f":"IF(FB17=\"\",\"\",VLOOKUP(FB17,Teilnehmer!$A$3:$C$102,2))","v":""},null,null,null,{"$f":"IF(FF17=\"\",\"\",VLOOKUP(FF17,Teilnehmer!$A$3:$C$102,2))","v":""},null,null,{"$f":"IF(FI17=\"\",\"\",VLOOKUP(FI17,Teilnehmer!$A$3:$C$102,2))","v":""},null,null,null,{"$f":"IF(FM17=\"\",\"\",VLOOKUP(FM17,Teilnehmer!$A$3:$C$102,2))","v":""},null,null,{"$f":"IF(FP17=\"\",\"\",VLOOKUP(FP17,Teilnehmer!$A$3:$C$102,2))","v":""},null,null,null,{"$f":"IF(FT17=\"\",\"\",VLOOKUP(FT17,Teilnehmer!$A$3:$C$102,2))","v":""},null,null,{"$f":"IF(FW17=\"\",\"\",VLOOKUP(FW17,Teilnehmer!$A$3:$C$102,2))","v":""},null,null,null,{"$f":"IF(GA17=\"\",\"\",VLOOKUP(GA17,Teilnehmer!$A$3:$C$102,2))","v":""},null,null,{"$f":"IF(GD17=\"\",\"\",VLOOKUP(GD17,Teilnehmer!$A$3:$C$102,2))","v":""},null,null,null,{"$f":"IF(GH17=\"\",\"\",VLOOKUP(GH17,Teilnehmer!$A$3:$C$102,2))","v":""},null,null,{"$f":"IF(GK17=\"\",\"\",VLOOKUP(GK17,Teilnehmer!$A$3:$C$102,2))","v":""},null,null,null,{"$f":"IF(GO17=\"\",\"\",VLOOKUP(GO17,Teilnehmer!$A$3:$C$102,2))","v":""},null,null,{"$f":"IF(GR17=\"\",\"\",VLOOKUP(GR17,Teilnehmer!$A$3:$C$102,2))","v":""},null,null,null,{"$f":"IF(GV17=\"\",\"\",VLOOKUP(GV17,Teilnehmer!$A$3:$C$102,2))","v":""},null,null,{"$f":"IF(GY17=\"\",\"\",VLOOKUP(GY17,Teilnehmer!$A$3:$C$102,2))","v":""},null,null,null,{"$f":"IF(HC17=\"\",\"\",VLOOKUP(HC17,Teilnehmer!$A$3:$C$102,2))","v":""},null,null,{"$f":"IF(HF17=\"\",\"\",VLOOKUP(HF17,Teilnehmer!$A$3:$C$102,2))","v":""},null,null,null,{"$f":"IF(HJ17=\"\",\"\",VLOOKUP(HJ17,Teilnehmer!$A$3:$C$102,2))","v":""},null,null,{"$f":"IF(HM17=\"\",\"\",VLOOKUP(HM17,Teilnehmer!$A$3:$C$102,2))","v":""},null,null,null,{"$f":"IF(HQ17=\"\",\"\",VLOOKUP(HQ17,Teilnehmer!$A$3:$C$102,2))","v":""},null,null,{"$f":"IF(HT17=\"\",\"\",VLOOKUP(HT17,Teilnehmer!$A$3:$C$102,2))","v":""},null,null,null,{"$f":"IF(HX17=\"\",\"\",VLOOKUP(HX17,Teilnehmer!$A$3:$C$102,2))","v":""},null,null,{"$f":"IF(IA17=\"\",\"\",VLOOKUP(IA17,Teilnehmer!$A$3:$C$102,2))","v":""},null,null,null,{"$f":"IF(IE17=\"\",\"\",VLOOKUP(IE17,Teilnehmer!$A$3:$C$102,2))","v":""},null,null,{"$f":"IF(IH17=\"\",\"\",VLOOKUP(IH17,Teilnehmer!$A$3:$C$102,2))","v":""},null,null,null,{"$f":"IF(IL17=\"\",\"\",VLOOKUP(IL17,Teilnehmer!$A$3:$C$102,2))","v":""},null,null,{"$f":"IF(IO17=\"\",\"\",VLOOKUP(IO17,Teilnehmer!$A$3:$C$102,2))","v":""},null,null,null,{"$f":"IF(IS17=\"\",\"\",VLOOKUP(IS17,Teilnehmer!$A$3:$C$102,2))","v":""},null,null,{"$f":"IF(IV17=\"\",\"\",VLOOKUP(IV17,Teilnehmer!$A$3:$C$102,2))","v":""},null,null,null,{"$f":"IF(IZ17=\"\",\"\",VLOOKUP(IZ17,Teilnehmer!$A$3:$C$102,2))","v":""},null,null,{"$f":"IF(JC17=\"\",\"\",VLOOKUP(JC17,Teilnehmer!$A$3:$C$102,2))","v":""},null,null,null,{"$f":"IF(JG17=\"\",\"\",VLOOKUP(JG17,Teilnehmer!$A$3:$C$102,2))","v":""},null,null,{"$f":"IF(JJ17=\"\",\"\",VLOOKUP(JJ17,Teilnehmer!$A$3:$C$102,2))","v":""},null,null,null,{"$f":"IF(JN17=\"\",\"\",VLOOKUP(JN17,Teilnehmer!$A$3:$C$102,2))","v":""},null,null,{"$f":"IF(JQ17=\"\",\"\",VLOOKUP(JQ17,Teilnehmer!$A$3:$C$102,2))","v":""},null,null,null,{"$f":"IF(JU17=\"\",\"\",VLOOKUP(JU17,Teilnehmer!$A$3:$C$102,2))","v":""},null,null,{"$f":"IF(JX17=\"\",\"\",VLOOKUP(JX17,Teilnehmer!$A$3:$C$102,2))","v":""},null,null,null,{"$f":"IF(KB17=\"\",\"\",VLOOKUP(KB17,Teilnehmer!$A$3:$C$102,2))","v":""},null,null,{"$f":"IF(KE17=\"\",\"\",VLOOKUP(KE17,Teilnehmer!$A$3:$C$102,2))","v":""},null,null,null,{"$f":"IF(KI17=\"\",\"\",VLOOKUP(KI17,Teilnehmer!$A$3:$C$102,2))","v":""},null,null,{"$f":"IF(KL17=\"\",\"\",VLOOKUP(KL17,Teilnehmer!$A$3:$C$102,2))","v":""},null,null,null,{"$f":"IF(KP17=\"\",\"\",VLOOKUP(KP17,Teilnehmer!$A$3:$C$102,2))","v":""},null,null,{"$f":"IF(KS17=\"\",\"\",VLOOKUP(KS17,Teilnehmer!$A$3:$C$102,2))","v":""}]
[null,{"$f":"IF(A18=\"\",\"\",VLOOKUP(A18,Teilnehmer!$A$3:$C$102,2))","v":""},null,null,{"$f":"IF(D18=\"\",\"\",VLOOKUP(D18,Teilnehmer!$A$3:$C$102,2))","v":""},null,null,null,{"$f":"IF(H18=\"\",\"\",VLOOKUP(H18,Teilnehmer!$A$3:$C$102,2))","v":""},null,null,{"$f":"IF(K18=\"\",\"\",VLOOKUP(K18,Teilnehmer!$A$3:$C$102,2))","v":""},null,null,null,{"$f":"IF(O18=\"\",\"\",VLOOKUP(O18,Teilnehmer!$A$3:$C$102,2))","v":""},null,null,{"$f":"IF(R18=\"\",\"\",VLOOKUP(R18,Teilnehmer!$A$3:$C$102,2))","v":""},null,null,null,{"$f":"IF(V18=\"\",\"\",VLOOKUP(V18,Teilnehmer!$A$3:$C$102,2))","v":""},null,null,{"$f":"IF(Y18=\"\",\"\",VLOOKUP(Y18,Teilnehmer!$A$3:$C$102,2))","v":""},null,null,null,{"$f":"IF(AC18=\"\",\"\",VLOOKUP(AC18,Teilnehmer!$A$3:$C$102,2))","v":""},null,null,{"$f":"IF(AF18=\"\",\"\",VLOOKUP(AF18,Teilnehmer!$A$3:$C$102,2))","v":""},null,null,null,{"$f":"IF(AJ18=\"\",\"\",VLOOKUP(AJ18,Teilnehmer!$A$3:$C$102,2))","v":""},null,null,{"$f":"IF(AM18=\"\",\"\",VLOOKUP(AM18,Teilnehmer!$A$3:$C$102,2))","v":""},null,null,null,{"$f":"IF(AQ18=\"\",\"\",VLOOKUP(AQ18,Teilnehmer!$A$3:$C$102,2))","v":""},null,null,{"$f":"IF(AT18=\"\",\"\",VLOOKUP(AT18,Teilnehmer!$A$3:$C$102,2))","v":""},null,null,null,{"$f":"IF(AX18=\"\",\"\",VLOOKUP(AX18,Teilnehmer!$A$3:$C$102,2))","v":""},null,null,{"$f":"IF(BA18=\"\",\"\",VLOOKUP(BA18,Teilnehmer!$A$3:$C$102,2))","v":""},null,null,null,{"$f":"IF(BE18=\"\",\"\",VLOOKUP(BE18,Teilnehmer!$A$3:$C$102,2))","v":""},null,null,{"$f":"IF(BH18=\"\",\"\",VLOOKUP(BH18,Teilnehmer!$A$3:$C$102,2))","v":""},null,null,null,{"$f":"IF(BL18=\"\",\"\",VLOOKUP(BL18,Teilnehmer!$A$3:$C$102,2))","v":""},null,null,{"$f":"IF(BO18=\"\",\"\",VLOOKUP(BO18,Teilnehmer!$A$3:$C$102,2))","v":""},null,null,null,{"$f":"IF(BS18=\"\",\"\",VLOOKUP(BS18,Teilnehmer!$A$3:$C$102,2))","v":""},null,null,{"$f":"IF(BV18=\"\",\"\",VLOOKUP(BV18,Teilnehmer!$A$3:$C$102,2))","v":""},null,null,null,{"$f":"IF(BZ18=\"\",\"\",VLOOKUP(BZ18,Teilnehmer!$A$3:$C$102,2))","v":""},null,null,{"$f":"IF(CC18=\"\",\"\",VLOOKUP(CC18,Teilnehmer!$A$3:$C$102,2))","v":""},null,null,null,{"$f":"IF(CG18=\"\",\"\",VLOOKUP(CG18,Teilnehmer!$A$3:$C$102,2))","v":""},null,null,{"$f":"IF(CJ18=\"\",\"\",VLOOKUP(CJ18,Teilnehmer!$A$3:$C$102,2))","v":""},null,null,null,{"$f":"IF(CN18=\"\",\"\",VLOOKUP(CN18,Teilnehmer!$A$3:$C$102,2))","v":""},null,null,{"$f":"IF(CQ18=\"\",\"\",VLOOKUP(CQ18,Teilnehmer!$A$3:$C$102,2))","v":""},null,null,null,{"$f":"IF(CU18=\"\",\"\",VLOOKUP(CU18,Teilnehmer!$A$3:$C$102,2))","v":""},null,null,{"$f":"IF(CX18=\"\",\"\",VLOOKUP(CX18,Teilnehmer!$A$3:$C$102,2))","v":""},null,null,null,{"$f":"IF(DB18=\"\",\"\",VLOOKUP(DB18,Teilnehmer!$A$3:$C$102,2))","v":""},null,null,{"$f":"IF(DE18=\"\",\"\",VLOOKUP(DE18,Teilnehmer!$A$3:$C$102,2))","v":""},null,null,null,{"$f":"IF(DI18=\"\",\"\",VLOOKUP(DI18,Teilnehmer!$A$3:$C$102,2))","v":""},null,null,{"$f":"IF(DL18=\"\",\"\",VLOOKUP(DL18,Teilnehmer!$A$3:$C$102,2))","v":""},null,null,null,{"$f":"IF(DP18=\"\",\"\",VLOOKUP(DP18,Teilnehmer!$A$3:$C$102,2))","v":""},null,null,{"$f":"IF(DS18=\"\",\"\",VLOOKUP(DS18,Teilnehmer!$A$3:$C$102,2))","v":""},null,null,null,{"$f":"IF(DW18=\"\",\"\",VLOOKUP(DW18,Teilnehmer!$A$3:$C$102,2))","v":""},null,null,{"$f":"IF(DZ18=\"\",\"\",VLOOKUP(DZ18,Teilnehmer!$A$3:$C$102,2))","v":""},null,null,null,{"$f":"IF(ED18=\"\",\"\",VLOOKUP(ED18,Teilnehmer!$A$3:$C$102,2))","v":""},null,null,{"$f":"IF(EG18=\"\",\"\",VLOOKUP(EG18,Teilnehmer!$A$3:$C$102,2))","v":""},null,null,null,{"$f":"IF(EK18=\"\",\"\",VLOOKUP(EK18,Teilnehmer!$A$3:$C$102,2))","v":""},null,null,{"$f":"IF(EN18=\"\",\"\",VLOOKUP(EN18,Teilnehmer!$A$3:$C$102,2))","v":""},null,null,null,{"$f":"IF(ER18=\"\",\"\",VLOOKUP(ER18,Teilnehmer!$A$3:$C$102,2))","v":""},null,null,{"$f":"IF(EU18=\"\",\"\",VLOOKUP(EU18,Teilnehmer!$A$3:$C$102,2))","v":""},null,null,null,{"$f":"IF(EY18=\"\",\"\",VLOOKUP(EY18,Teilnehmer!$A$3:$C$102,2))","v":""},null,null,{"$f":"IF(FB18=\"\",\"\",VLOOKUP(FB18,Teilnehmer!$A$3:$C$102,2))","v":""},null,null,null,{"$f":"IF(FF18=\"\",\"\",VLOOKUP(FF18,Teilnehmer!$A$3:$C$102,2))","v":""},null,null,{"$f":"IF(FI18=\"\",\"\",VLOOKUP(FI18,Teilnehmer!$A$3:$C$102,2))","v":""},null,null,null,{"$f":"IF(FM18=\"\",\"\",VLOOKUP(FM18,Teilnehmer!$A$3:$C$102,2))","v":""},null,null,{"$f":"IF(FP18=\"\",\"\",VLOOKUP(FP18,Teilnehmer!$A$3:$C$102,2))","v":""},null,null,null,{"$f":"IF(FT18=\"\",\"\",VLOOKUP(FT18,Teilnehmer!$A$3:$C$102,2))","v":""},null,null,{"$f":"IF(FW18=\"\",\"\",VLOOKUP(FW18,Teilnehmer!$A$3:$C$102,2))","v":""},null,null,null,{"$f":"IF(GA18=\"\",\"\",VLOOKUP(GA18,Teilnehmer!$A$3:$C$102,2))","v":""},null,null,{"$f":"IF(GD18=\"\",\"\",VLOOKUP(GD18,Teilnehmer!$A$3:$C$102,2))","v":""},null,null,null,{"$f":"IF(GH18=\"\",\"\",VLOOKUP(GH18,Teilnehmer!$A$3:$C$102,2))","v":""},null,null,{"$f":"IF(GK18=\"\",\"\",VLOOKUP(GK18,Teilnehmer!$A$3:$C$102,2))","v":""},null,null,null,{"$f":"IF(GO18=\"\",\"\",VLOOKUP(GO18,Teilnehmer!$A$3:$C$102,2))","v":""},null,null,{"$f":"IF(GR18=\"\",\"\",VLOOKUP(GR18,Teilnehmer!$A$3:$C$102,2))","v":""},null,null,null,{"$f":"IF(GV18=\"\",\"\",VLOOKUP(GV18,Teilnehmer!$A$3:$C$102,2))","v":""},null,null,{"$f":"IF(GY18=\"\",\"\",VLOOKUP(GY18,Teilnehmer!$A$3:$C$102,2))","v":""},null,null,null,{"$f":"IF(HC18=\"\",\"\",VLOOKUP(HC18,Teilnehmer!$A$3:$C$102,2))","v":""},null,null,{"$f":"IF(HF18=\"\",\"\",VLOOKUP(HF18,Teilnehmer!$A$3:$C$102,2))","v":""},null,null,null,{"$f":"IF(HJ18=\"\",\"\",VLOOKUP(HJ18,Teilnehmer!$A$3:$C$102,2))","v":""},null,null,{"$f":"IF(HM18=\"\",\"\",VLOOKUP(HM18,Teilnehmer!$A$3:$C$102,2))","v":""},null,null,null,{"$f":"IF(HQ18=\"\",\"\",VLOOKUP(HQ18,Teilnehmer!$A$3:$C$102,2))","v":""},null,null,{"$f":"IF(HT18=\"\",\"\",VLOOKUP(HT18,Teilnehmer!$A$3:$C$102,2))","v":""},null,null,null,{"$f":"IF(HX18=\"\",\"\",VLOOKUP(HX18,Teilnehmer!$A$3:$C$102,2))","v":""},null,null,{"$f":"IF(IA18=\"\",\"\",VLOOKUP(IA18,Teilnehmer!$A$3:$C$102,2))","v":""},null,null,null,{"$f":"IF(IE18=\"\",\"\",VLOOKUP(IE18,Teilnehmer!$A$3:$C$102,2))","v":""},null,null,{"$f":"IF(IH18=\"\",\"\",VLOOKUP(IH18,Teilnehmer!$A$3:$C$102,2))","v":""},null,null,null,{"$f":"IF(IL18=\"\",\"\",VLOOKUP(IL18,Teilnehmer!$A$3:$C$102,2))","v":""},null,null,{"$f":"IF(IO18=\"\",\"\",VLOOKUP(IO18,Teilnehmer!$A$3:$C$102,2))","v":""},null,null,null,{"$f":"IF(IS18=\"\",\"\",VLOOKUP(IS18,Teilnehmer!$A$3:$C$102,2))","v":""},null,null,{"$f":"IF(IV18=\"\",\"\",VLOOKUP(IV18,Teilnehmer!$A$3:$C$102,2))","v":""},null,null,null,{"$f":"IF(IZ18=\"\",\"\",VLOOKUP(IZ18,Teilnehmer!$A$3:$C$102,2))","v":""},null,null,{"$f":"IF(JC18=\"\",\"\",VLOOKUP(JC18,Teilnehmer!$A$3:$C$102,2))","v":""},null,null,null,{"$f":"IF(JG18=\"\",\"\",VLOOKUP(JG18,Teilnehmer!$A$3:$C$102,2))","v":""},null,null,{"$f":"IF(JJ18=\"\",\"\",VLOOKUP(JJ18,Teilnehmer!$A$3:$C$102,2))","v":""},null,null,null,{"$f":"IF(JN18=\"\",\"\",VLOOKUP(JN18,Teilnehmer!$A$3:$C$102,2))","v":""},null,null,{"$f":"IF(JQ18=\"\",\"\",VLOOKUP(JQ18,Teilnehmer!$A$3:$C$102,2))","v":""},null,null,null,{"$f":"IF(JU18=\"\",\"\",VLOOKUP(JU18,Teilnehmer!$A$3:$C$102,2))","v":""},null,null,{"$f":"IF(JX18=\"\",\"\",VLOOKUP(JX18,Teilnehmer!$A$3:$C$102,2))","v":""},null,null,null,{"$f":"IF(KB18=\"\",\"\",VLOOKUP(KB18,Teilnehmer!$A$3:$C$102,2))","v":""},null,null,{"$f":"IF(KE18=\"\",\"\",VLOOKUP(KE18,Teilnehmer!$A$3:$C$102,2))","v":""},null,null,null,{"$f":"IF(KI18=\"\",\"\",VLOOKUP(KI18,Teilnehmer!$A$3:$C$102,2))","v":""},null,null,{"$f":"IF(KL18=\"\",\"\",VLOOKUP(KL18,Teilnehmer!$A$3:$C$102,2))","v":""},null,null,null,{"$f":"IF(KP18=\"\",\"\",VLOOKUP(KP18,Teilnehmer!$A$3:$C$102,2))","v":""},null,null,{"$f":"IF(KS18=\"\",\"\",VLOOKUP(KS18,Teilnehmer!$A$3:$C$102,2))","v":""}]
[null,{"$f":"IF(A19=\"\",\"\",VLOOKUP(A19,Teilnehmer!$A$3:$C$102,2))","v":""},null,null,{"$f":"IF(D19=\"\",\"\",VLOOKUP(D19,Teilnehmer!$A$3:$C$102,2))","v":""},null,null,null,{"$f":"IF(H19=\"\",\"\",VLOOKUP(H19,Teilnehmer!$A$3:$C$102,2))","v":""},null,null,{"$f":"IF(K19=\"\",\"\",VLOOKUP(K19,Teilnehmer!$A$3:$C$102,2))","v":""},null,null,null,{"$f":"IF(O19=\"\",\"\",VLOOKUP(O19,Teilnehmer!$A$3:$C$102,2))","v":""},null,null,{"$f":"IF(R19=\"\",\"\",VLOOKUP(R19,Teilnehmer!$A$3:$C$102,2))","v":""},null,null,null,{"$f":"IF(V19=\"\",\"\",VLOOKUP(V19,Teilnehmer!$A$3:$C$102,2))","v":""},null,null,{"$f":"IF(Y19=\"\",\"\",VLOOKUP(Y19,Teilnehmer!$A$3:$C$102,2))","v":""},null,null,null,{"$f":"IF(AC19=\"\",\"\",VLOOKUP(AC19,Teilnehmer!$A$3:$C$102,2))","v":""},null,null,{"$f":"IF(AF19=\"\",\"\",VLOOKUP(AF19,Teilnehmer!$A$3:$C$102,2))","v":""},null,null,null,{"$f":"IF(AJ19=\"\",\"\",VLOOKUP(AJ19,Teilnehmer!$A$3:$C$102,2))","v":""},null,null,{"$f":"IF(AM19=\"\",\"\",VLOOKUP(AM19,Teilnehmer!$A$3:$C$102,2))","v":""},null,null,null,{"$f":"IF(AQ19=\"\",\"\",VLOOKUP(AQ19,Teilnehmer!$A$3:$C$102,2))","v":""},null,null,{"$f":"IF(AT19=\"\",\"\",VLOOKUP(AT19,Teilnehmer!$A$3:$C$102,2))","v":""},null,null,null,{"$f":"IF(AX19=\"\",\"\",VLOOKUP(AX19,Teilnehmer!$A$3:$C$102,2))","v":""},null,null,{"$f":"IF(BA19=\"\",\"\",VLOOKUP(BA19,Teilnehmer!$A$3:$C$102,2))","v":""},null,null,null,{"$f":"IF(BE19=\"\",\"\",VLOOKUP(BE19,Teilnehmer!$A$3:$C$102,2))","v":""},null,null,{"$f":"IF(BH19=\"\",\"\",VLOOKUP(BH19,Teilnehmer!$A$3:$C$102,2))","v":""},null,null,null,{"$f":"IF(BL19=\"\",\"\",VLOOKUP(BL19,Teilnehmer!$A$3:$C$102,2))","v":""},null,null,{"$f":"IF(BO19=\"\",\"\",VLOOKUP(BO19,Teilnehmer!$A$3:$C$102,2))","v":""},null,null,null,{"$f":"IF(BS19=\"\",\"\",VLOOKUP(BS19,Teilnehmer!$A$3:$C$102,2))","v":""},null,null,{"$f":"IF(BV19=\"\",\"\",VLOOKUP(BV19,Teilnehmer!$A$3:$C$102,2))","v":""},null,null,null,{"$f":"IF(BZ19=\"\",\"\",VLOOKUP(BZ19,Teilnehmer!$A$3:$C$102,2))","v":""},null,null,{"$f":"IF(CC19=\"\",\"\",VLOOKUP(CC19,Teilnehmer!$A$3:$C$102,2))","v":""},null,null,null,{"$f":"IF(CG19=\"\",\"\",VLOOKUP(CG19,Teilnehmer!$A$3:$C$102,2))","v":""},null,null,{"$f":"IF(CJ19=\"\",\"\",VLOOKUP(CJ19,Teilnehmer!$A$3:$C$102,2))","v":""},null,null,null,{"$f":"IF(CN19=\"\",\"\",VLOOKUP(CN19,Teilnehmer!$A$3:$C$102,2))","v":""},null,null,{"$f":"IF(CQ19=\"\",\"\",VLOOKUP(CQ19,Teilnehmer!$A$3:$C$102,2))","v":""},null,null,null,{"$f":"IF(CU19=\"\",\"\",VLOOKUP(CU19,Teilnehmer!$A$3:$C$102,2))","v":""},null,null,{"$f":"IF(CX19=\"\",\"\",VLOOKUP(CX19,Teilnehmer!$A$3:$C$102,2))","v":""},null,null,null,{"$f":"IF(DB19=\"\",\"\",VLOOKUP(DB19,Teilnehmer!$A$3:$C$102,2))","v":""},null,null,{"$f":"IF(DE19=\"\",\"\",VLOOKUP(DE19,Teilnehmer!$A$3:$C$102,2))","v":""},null,null,null,{"$f":"IF(DI19=\"\",\"\",VLOOKUP(DI19,Teilnehmer!$A$3:$C$102,2))","v":""},null,null,{"$f":"IF(DL19=\"\",\"\",VLOOKUP(DL19,Teilnehmer!$A$3:$C$102,2))","v":""},null,null,null,{"$f":"IF(DP19=\"\",\"\",VLOOKUP(DP19,Teilnehmer!$A$3:$C$102,2))","v":""},null,null,{"$f":"IF(DS19=\"\",\"\",VLOOKUP(DS19,Teilnehmer!$A$3:$C$102,2))","v":""},null,null,null,{"$f":"IF(DW19=\"\",\"\",VLOOKUP(DW19,Teilnehmer!$A$3:$C$102,2))","v":""},null,null,{"$f":"IF(DZ19=\"\",\"\",VLOOKUP(DZ19,Teilnehmer!$A$3:$C$102,2))","v":""},null,null,null,{"$f":"IF(ED19=\"\",\"\",VLOOKUP(ED19,Teilnehmer!$A$3:$C$102,2))","v":""},null,null,{"$f":"IF(EG19=\"\",\"\",VLOOKUP(EG19,Teilnehmer!$A$3:$C$102,2))","v":""},null,null,null,{"$f":"IF(EK19=\"\",\"\",VLOOKUP(EK19,Teilnehmer!$A$3:$C$102,2))","v":""},null,null,{"$f":"IF(EN19=\"\",\"\",VLOOKUP(EN19,Teilnehmer!$A$3:$C$102,2))","v":""},null,null,null,{"$f":"IF(ER19=\"\",\"\",VLOOKUP(ER19,Teilnehmer!$A$3:$C$102,2))","v":""},null,null,{"$f":"IF(EU19=\"\",\"\",VLOOKUP(EU19,Teilnehmer!$A$3:$C$102,2))","v":""},null,null,null,{"$f":"IF(EY19=\"\",\"\",VLOOKUP(EY19,Teilnehmer!$A$3:$C$102,2))","v":""},null,null,{"$f":"IF(FB19=\"\",\"\",VLOOKUP(FB19,Teilnehmer!$A$3:$C$102,2))","v":""},null,null,null,{"$f":"IF(FF19=\"\",\"\",VLOOKUP(FF19,Teilnehmer!$A$3:$C$102,2))","v":""},null,null,{"$f":"IF(FI19=\"\",\"\",VLOOKUP(FI19,Teilnehmer!$A$3:$C$102,2))","v":""},null,null,null,{"$f":"IF(FM19=\"\",\"\",VLOOKUP(FM19,Teilnehmer!$A$3:$C$102,2))","v":""},null,null,{"$f":"IF(FP19=\"\",\"\",VLOOKUP(FP19,Teilnehmer!$A$3:$C$102,2))","v":""},null,null,null,{"$f":"IF(FT19=\"\",\"\",VLOOKUP(FT19,Teilnehmer!$A$3:$C$102,2))","v":""},null,null,{"$f":"IF(FW19=\"\",\"\",VLOOKUP(FW19,Teilnehmer!$A$3:$C$102,2))","v":""},null,null,null,{"$f":"IF(GA19=\"\",\"\",VLOOKUP(GA19,Teilnehmer!$A$3:$C$102,2))","v":""},null,null,{"$f":"IF(GD19=\"\",\"\",VLOOKUP(GD19,Teilnehmer!$A$3:$C$102,2))","v":""},null,null,null,{"$f":"IF(GH19=\"\",\"\",VLOOKUP(GH19,Teilnehmer!$A$3:$C$102,2))","v":""},null,null,{"$f":"IF(GK19=\"\",\"\",VLOOKUP(GK19,Teilnehmer!$A$3:$C$102,2))","v":""},null,null,null,{"$f":"IF(GO19=\"\",\"\",VLOOKUP(GO19,Teilnehmer!$A$3:$C$102,2))","v":""},null,null,{"$f":"IF(GR19=\"\",\"\",VLOOKUP(GR19,Teilnehmer!$A$3:$C$102,2))","v":""},null,null,null,{"$f":"IF(GV19=\"\",\"\",VLOOKUP(GV19,Teilnehmer!$A$3:$C$102,2))","v":""},null,null,{"$f":"IF(GY19=\"\",\"\",VLOOKUP(GY19,Teilnehmer!$A$3:$C$102,2))","v":""},null,null,null,{"$f":"IF(HC19=\"\",\"\",VLOOKUP(HC19,Teilnehmer!$A$3:$C$102,2))","v":""},null,null,{"$f":"IF(HF19=\"\",\"\",VLOOKUP(HF19,Teilnehmer!$A$3:$C$102,2))","v":""},null,null,null,{"$f":"IF(HJ19=\"\",\"\",VLOOKUP(HJ19,Teilnehmer!$A$3:$C$102,2))","v":""},null,null,{"$f":"IF(HM19=\"\",\"\",VLOOKUP(HM19,Teilnehmer!$A$3:$C$102,2))","v":""},null,null,null,{"$f":"IF(HQ19=\"\",\"\",VLOOKUP(HQ19,Teilnehmer!$A$3:$C$102,2))","v":""},null,null,{"$f":"IF(HT19=\"\",\"\",VLOOKUP(HT19,Teilnehmer!$A$3:$C$102,2))","v":""},null,null,null,{"$f":"IF(HX19=\"\",\"\",VLOOKUP(HX19,Teilnehmer!$A$3:$C$102,2))","v":""},null,null,{"$f":"IF(IA19=\"\",\"\",VLOOKUP(IA19,Teilnehmer!$A$3:$C$102,2))","v":""},null,null,null,{"$f":"IF(IE19=\"\",\"\",VLOOKUP(IE19,Teilnehmer!$A$3:$C$102,2))","v":""},null,null,{"$f":"IF(IH19=\"\",\"\",VLOOKUP(IH19,Teilnehmer!$A$3:$C$102,2))","v":""},null,null,null,{"$f":"IF(IL19=\"\",\"\",VLOOKUP(IL19,Teilnehmer!$A$3:$C$102,2))","v":""},null,null,{"$f":"IF(IO19=\"\",\"\",VLOOKUP(IO19,Teilnehmer!$A$3:$C$102,2))","v":""},null,null,null,{"$f":"IF(IS19=\"\",\"\",VLOOKUP(IS19,Teilnehmer!$A$3:$C$102,2))","v":""},null,null,{"$f":"IF(IV19=\"\",\"\",VLOOKUP(IV19,Teilnehmer!$A$3:$C$102,2))","v":""},null,null,null,{"$f":"IF(IZ19=\"\",\"\",VLOOKUP(IZ19,Teilnehmer!$A$3:$C$102,2))","v":""},null,null,{"$f":"IF(JC19=\"\",\"\",VLOOKUP(JC19,Teilnehmer!$A$3:$C$102,2))","v":""},null,null,null,{"$f":"IF(JG19=\"\",\"\",VLOOKUP(JG19,Teilnehmer!$A$3:$C$102,2))","v":""},null,null,{"$f":"IF(JJ19=\"\",\"\",VLOOKUP(JJ19,Teilnehmer!$A$3:$C$102,2))","v":""},null,null,null,{"$f":"IF(JN19=\"\",\"\",VLOOKUP(JN19,Teilnehmer!$A$3:$C$102,2))","v":""},null,null,{"$f":"IF(JQ19=\"\",\"\",VLOOKUP(JQ19,Teilnehmer!$A$3:$C$102,2))","v":""},null,null,null,{"$f":"IF(JU19=\"\",\"\",VLOOKUP(JU19,Teilnehmer!$A$3:$C$102,2))","v":""},null,null,{"$f":"IF(JX19=\"\",\"\",VLOOKUP(JX19,Teilnehmer!$A$3:$C$102,2))","v":""},null,null,null,{"$f":"IF(KB19=\"\",\"\",VLOOKUP(KB19,Teilnehmer!$A$3:$C$102,2))","v":""},null,null,{"$f":"IF(KE19=\"\",\"\",VLOOKUP(KE19,Teilnehmer!$A$3:$C$102,2))","v":""},null,null,null,{"$f":"IF(KI19=\"\",\"\",VLOOKUP(KI19,Teilnehmer!$A$3:$C$102,2))","v":""},null,null,{"$f":"IF(KL19=\"\",\"\",VLOOKUP(KL19,Teilnehmer!$A$3:$C$102,2))","v":""},null,null,null,{"$f":"IF(KP19=\"\",\"\",VLOOKUP(KP19,Teilnehmer!$A$3:$C$102,2))","v":""},null,null,{"$f":"IF(KS19=\"\",\"\",VLOOKUP(KS19,Teilnehmer!$A$3:$C$102,2))","v":""}]
[null,{"$f":"IF(A20=\"\",\"\",VLOOKUP(A20,Teilnehmer!$A$3:$C$102,2))","v":""},null,null,{"$f":"IF(D20=\"\",\"\",VLOOKUP(D20,Teilnehmer!$A$3:$C$102,2))","v":""},null,null,null,{"$f":"IF(H20=\"\",\"\",VLOOKUP(H20,Teilnehmer!$A$3:$C$102,2))","v":""},null,null,{"$f":"IF(K20=\"\",\"\",VLOOKUP(K20,Teilnehmer!$A$3:$C$102,2))","v":""},null,null,null,{"$f":"IF(O20=\"\",\"\",VLOOKUP(O20,Teilnehmer!$A$3:$C$102,2))","v":""},null,null,{"$f":"IF(R20=\"\",\"\",VLOOKUP(R20,Teilnehmer!$A$3:$C$102,2))","v":""},null,null,null,{"$f":"IF(V20=\"\",\"\",VLOOKUP(V20,Teilnehmer!$A$3:$C$102,2))","v":""},null,null,{"$f":"IF(Y20=\"\",\"\",VLOOKUP(Y20,Teilnehmer!$A$3:$C$102,2))","v":""},null,null,null,{"$f":"IF(AC20=\"\",\"\",VLOOKUP(AC20,Teilnehmer!$A$3:$C$102,2))","v":""},null,null,{"$f":"IF(AF20=\"\",\"\",VLOOKUP(AF20,Teilnehmer!$A$3:$C$102,2))","v":""},null,null,null,{"$f":"IF(AJ20=\"\",\"\",VLOOKUP(AJ20,Teilnehmer!$A$3:$C$102,2))","v":""},null,null,{"$f":"IF(AM20=\"\",\"\",VLOOKUP(AM20,Teilnehmer!$A$3:$C$102,2))","v":""},null,null,null,{"$f":"IF(AQ20=\"\",\"\",VLOOKUP(AQ20,Teilnehmer!$A$3:$C$102,2))","v":""},null,null,{"$f":"IF(AT20=\"\",\"\",VLOOKUP(AT20,Teilnehmer!$A$3:$C$102,2))","v":""},null,null,null,{"$f":"IF(AX20=\"\",\"\",VLOOKUP(AX20,Teilnehmer!$A$3:$C$102,2))","v":""},null,null,{"$f":"IF(BA20=\"\",\"\",VLOOKUP(BA20,Teilnehmer!$A$3:$C$102,2))","v":""},null,null,null,{"$f":"IF(BE20=\"\",\"\",VLOOKUP(BE20,Teilnehmer!$A$3:$C$102,2))","v":""},null,null,{"$f":"IF(BH20=\"\",\"\",VLOOKUP(BH20,Teilnehmer!$A$3:$C$102,2))","v":""},null,null,null,{"$f":"IF(BL20=\"\",\"\",VLOOKUP(BL20,Teilnehmer!$A$3:$C$102,2))","v":""},null,null,{"$f":"IF(BO20=\"\",\"\",VLOOKUP(BO20,Teilnehmer!$A$3:$C$102,2))","v":""},null,null,null,{"$f":"IF(BS20=\"\",\"\",VLOOKUP(BS20,Teilnehmer!$A$3:$C$102,2))","v":""},null,null,{"$f":"IF(BV20=\"\",\"\",VLOOKUP(BV20,Teilnehmer!$A$3:$C$102,2))","v":""},null,null,null,{"$f":"IF(BZ20=\"\",\"\",VLOOKUP(BZ20,Teilnehmer!$A$3:$C$102,2))","v":""},null,null,{"$f":"IF(CC20=\"\",\"\",VLOOKUP(CC20,Teilnehmer!$A$3:$C$102,2))","v":""},null,null,null,{"$f":"IF(CG20=\"\",\"\",VLOOKUP(CG20,Teilnehmer!$A$3:$C$102,2))","v":""},null,null,{"$f":"IF(CJ20=\"\",\"\",VLOOKUP(CJ20,Teilnehmer!$A$3:$C$102,2))","v":""},null,null,null,{"$f":"IF(CN20=\"\",\"\",VLOOKUP(CN20,Teilnehmer!$A$3:$C$102,2))","v":""},null,null,{"$f":"IF(CQ20=\"\",\"\",VLOOKUP(CQ20,Teilnehmer!$A$3:$C$102,2))","v":""},null,null,null,{"$f":"IF(CU20=\"\",\"\",VLOOKUP(CU20,Teilnehmer!$A$3:$C$102,2))","v":""},null,null,{"$f":"IF(CX20=\"\",\"\",VLOOKUP(CX20,Teilnehmer!$A$3:$C$102,2))","v":""},null,null,null,{"$f":"IF(DB20=\"\",\"\",VLOOKUP(DB20,Teilnehmer!$A$3:$C$102,2))","v":""},null,null,{"$f":"IF(DE20=\"\",\"\",VLOOKUP(DE20,Teilnehmer!$A$3:$C$102,2))","v":""},null,null,null,{"$f":"IF(DI20=\"\",\"\",VLOOKUP(DI20,Teilnehmer!$A$3:$C$102,2))","v":""},null,null,{"$f":"IF(DL20=\"\",\"\",VLOOKUP(DL20,Teilnehmer!$A$3:$C$102,2))","v":""},null,null,null,{"$f":"IF(DP20=\"\",\"\",VLOOKUP(DP20,Teilnehmer!$A$3:$C$102,2))","v":""},null,null,{"$f":"IF(DS20=\"\",\"\",VLOOKUP(DS20,Teilnehmer!$A$3:$C$102,2))","v":""},null,null,null,{"$f":"IF(DW20=\"\",\"\",VLOOKUP(DW20,Teilnehmer!$A$3:$C$102,2))","v":""},null,null,{"$f":"IF(DZ20=\"\",\"\",VLOOKUP(DZ20,Teilnehmer!$A$3:$C$102,2))","v":""},null,null,null,{"$f":"IF(ED20=\"\",\"\",VLOOKUP(ED20,Teilnehmer!$A$3:$C$102,2))","v":""},null,null,{"$f":"IF(EG20=\"\",\"\",VLOOKUP(EG20,Teilnehmer!$A$3:$C$102,2))","v":""},null,null,null,{"$f":"IF(EK20=\"\",\"\",VLOOKUP(EK20,Teilnehmer!$A$3:$C$102,2))","v":""},null,null,{"$f":"IF(EN20=\"\",\"\",VLOOKUP(EN20,Teilnehmer!$A$3:$C$102,2))","v":""},null,null,null,{"$f":"IF(ER20=\"\",\"\",VLOOKUP(ER20,Teilnehmer!$A$3:$C$102,2))","v":""},null,null,{"$f":"IF(EU20=\"\",\"\",VLOOKUP(EU20,Teilnehmer!$A$3:$C$102,2))","v":""},null,null,null,{"$f":"IF(EY20=\"\",\"\",VLOOKUP(EY20,Teilnehmer!$A$3:$C$102,2))","v":""},null,null,{"$f":"IF(FB20=\"\",\"\",VLOOKUP(FB20,Teilnehmer!$A$3:$C$102,2))","v":""},null,null,null,{"$f":"IF(FF20=\"\",\"\",VLOOKUP(FF20,Teilnehmer!$A$3:$C$102,2))","v":""},null,null,{"$f":"IF(FI20=\"\",\"\",VLOOKUP(FI20,Teilnehmer!$A$3:$C$102,2))","v":""},null,null,null,{"$f":"IF(FM20=\"\",\"\",VLOOKUP(FM20,Teilnehmer!$A$3:$C$102,2))","v":""},null,null,{"$f":"IF(FP20=\"\",\"\",VLOOKUP(FP20,Teilnehmer!$A$3:$C$102,2))","v":""},null,null,null,{"$f":"IF(FT20=\"\",\"\",VLOOKUP(FT20,Teilnehmer!$A$3:$C$102,2))","v":""},null,null,{"$f":"IF(FW20=\"\",\"\",VLOOKUP(FW20,Teilnehmer!$A$3:$C$102,2))","v":""},null,null,null,{"$f":"IF(GA20=\"\",\"\",VLOOKUP(GA20,Teilnehmer!$A$3:$C$102,2))","v":""},null,null,{"$f":"IF(GD20=\"\",\"\",VLOOKUP(GD20,Teilnehmer!$A$3:$C$102,2))","v":""},null,null,null,{"$f":"IF(GH20=\"\",\"\",VLOOKUP(GH20,Teilnehmer!$A$3:$C$102,2))","v":""},null,null,{"$f":"IF(GK20=\"\",\"\",VLOOKUP(GK20,Teilnehmer!$A$3:$C$102,2))","v":""},null,null,null,{"$f":"IF(GO20=\"\",\"\",VLOOKUP(GO20,Teilnehmer!$A$3:$C$102,2))","v":""},null,null,{"$f":"IF(GR20=\"\",\"\",VLOOKUP(GR20,Teilnehmer!$A$3:$C$102,2))","v":""},null,null,null,{"$f":"IF(GV20=\"\",\"\",VLOOKUP(GV20,Teilnehmer!$A$3:$C$102,2))","v":""},null,null,{"$f":"IF(GY20=\"\",\"\",VLOOKUP(GY20,Teilnehmer!$A$3:$C$102,2))","v":""},null,null,null,{"$f":"IF(HC20=\"\",\"\",VLOOKUP(HC20,Teilnehmer!$A$3:$C$102,2))","v":""},null,null,{"$f":"IF(HF20=\"\",\"\",VLOOKUP(HF20,Teilnehmer!$A$3:$C$102,2))","v":""},null,null,null,{"$f":"IF(HJ20=\"\",\"\",VLOOKUP(HJ20,Teilnehmer!$A$3:$C$102,2))","v":""},null,null,{"$f":"IF(HM20=\"\",\"\",VLOOKUP(HM20,Teilnehmer!$A$3:$C$102,2))","v":""},null,null,null,{"$f":"IF(HQ20=\"\",\"\",VLOOKUP(HQ20,Teilnehmer!$A$3:$C$102,2))","v":""},null,null,{"$f":"IF(HT20=\"\",\"\",VLOOKUP(HT20,Teilnehmer!$A$3:$C$102,2))","v":""},null,null,null,{"$f":"IF(HX20=\"\",\"\",VLOOKUP(HX20,Teilnehmer!$A$3:$C$102,2))","v":""},null,null,{"$f":"IF(IA20=\"\",\"\",VLOOKUP(IA20,Teilnehmer!$A$3:$C$102,2))","v":""},null,null,null,{"$f":"IF(IE20=\"\",\"\",VLOOKUP(IE20,Teilnehmer!$A$3:$C$102,2))","v":""},null,null,{"$f":"IF(IH20=\"\",\"\",VLOOKUP(IH20,Teilnehmer!$A$3:$C$102,2))","v":""},null,null,null,{"$f":"IF(IL20=\"\",\"\",VLOOKUP(IL20,Teilnehmer!$A$3:$C$102,2))","v":""},null,null,{"$f":"IF(IO20=\"\",\"\",VLOOKUP(IO20,Teilnehmer!$A$3:$C$102,2))","v":""},null,null,null,{"$f":"IF(IS20=\"\",\"\",VLOOKUP(IS20,Teilnehmer!$A$3:$C$102,2))","v":""},null,null,{"$f":"IF(IV20=\"\",\"\",VLOOKUP(IV20,Teilnehmer!$A$3:$C$102,2))","v":""},null,null,null,{"$f":"IF(IZ20=\"\",\"\",VLOOKUP(IZ20,Teilnehmer!$A$3:$C$102,2))","v":""},null,null,{"$f":"IF(JC20=\"\",\"\",VLOOKUP(JC20,Teilnehmer!$A$3:$C$102,2))","v":""},null,null,null,{"$f":"IF(JG20=\"\",\"\",VLOOKUP(JG20,Teilnehmer!$A$3:$C$102,2))","v":""},null,null,{"$f":"IF(JJ20=\"\",\"\",VLOOKUP(JJ20,Teilnehmer!$A$3:$C$102,2))","v":""},null,null,null,{"$f":"IF(JN20=\"\",\"\",VLOOKUP(JN20,Teilnehmer!$A$3:$C$102,2))","v":""},null,null,{"$f":"IF(JQ20=\"\",\"\",VLOOKUP(JQ20,Teilnehmer!$A$3:$C$102,2))","v":""},null,null,null,{"$f":"IF(JU20=\"\",\"\",VLOOKUP(JU20,Teilnehmer!$A$3:$C$102,2))","v":""},null,null,{"$f":"IF(JX20=\"\",\"\",VLOOKUP(JX20,Teilnehmer!$A$3:$C$102,2))","v":""},null,null,null,{"$f":"IF(KB20=\"\",\"\",VLOOKUP(KB20,Teilnehmer!$A$3:$C$102,2))","v":""},null,null,{"$f":"IF(KE20=\"\",\"\",VLOOKUP(KE20,Teilnehmer!$A$3:$C$102,2))","v":""},null,null,null,{"$f":"IF(KI20=\"\",\"\",VLOOKUP(KI20,Teilnehmer!$A$3:$C$102,2))","v":""},null,null,{"$f":"IF(KL20=\"\",\"\",VLOOKUP(KL20,Teilnehmer!$A$3:$C$102,2))","v":""},null,null,null,{"$f":"IF(KP20=\"\",\"\",VLOOKUP(KP20,Teilnehmer!$A$3:$C$102,2))","v":""},null,null,{"$f":"IF(KS20=\"\",\"\",VLOOKUP(KS20,Teilnehmer!$A$3:$C$102,2))","v":""}]
[null,{"$f":"IF(A21=\"\",\"\",VLOOKUP(A21,Teilnehmer!$A$3:$C$102,2))","v":""},null,null,{"$f":"IF(D21=\"\",\"\",VLOOKUP(D21,Teilnehmer!$A$3:$C$102,2))","v":""},null,null,null,{"$f":"IF(H21=\"\",\"\",VLOOKUP(H21,Teilnehmer!$A$3:$C$102,2))","v":""},null,null,{"$f":"IF(K21=\"\",\"\",VLOOKUP(K21,Teilnehmer!$A$3:$C$102,2))","v":""},null,null,null,{"$f":"IF(O21=\"\",\"\",VLOOKUP(O21,Teilnehmer!$A$3:$C$102,2))","v":""},null,null,{"$f":"IF(R21=\"\",\"\",VLOOKUP(R21,Teilnehmer!$A$3:$C$102,2))","v":""},null,null,null,{"$f":"IF(V21=\"\",\"\",VLOOKUP(V21,Teilnehmer!$A$3:$C$102,2))","v":""},null,null,{"$f":"IF(Y21=\"\",\"\",VLOOKUP(Y21,Teilnehmer!$A$3:$C$102,2))","v":""},null,null,null,{"$f":"IF(AC21=\"\",\"\",VLOOKUP(AC21,Teilnehmer!$A$3:$C$102,2))","v":""},null,null,{"$f":"IF(AF21=\"\",\"\",VLOOKUP(AF21,Teilnehmer!$A$3:$C$102,2))","v":""},null,null,null,{"$f":"IF(AJ21=\"\",\"\",VLOOKUP(AJ21,Teilnehmer!$A$3:$C$102,2))","v":""},null,null,{"$f":"IF(AM21=\"\",\"\",VLOOKUP(AM21,Teilnehmer!$A$3:$C$102,2))","v":""},null,null,null,{"$f":"IF(AQ21=\"\",\"\",VLOOKUP(AQ21,Teilnehmer!$A$3:$C$102,2))","v":""},null,null,{"$f":"IF(AT21=\"\",\"\",VLOOKUP(AT21,Teilnehmer!$A$3:$C$102,2))","v":""},null,null,null,{"$f":"IF(AX21=\"\",\"\",VLOOKUP(AX21,Teilnehmer!$A$3:$C$102,2))","v":""},null,null,{"$f":"IF(BA21=\"\",\"\",VLOOKUP(BA21,Teilnehmer!$A$3:$C$102,2))","v":""},null,null,null,{"$f":"IF(BE21=\"\",\"\",VLOOKUP(BE21,Teilnehmer!$A$3:$C$102,2))","v":""},null,null,{"$f":"IF(BH21=\"\",\"\",VLOOKUP(BH21,Teilnehmer!$A$3:$C$102,2))","v":""},null,null,null,{"$f":"IF(BL21=\"\",\"\",VLOOKUP(BL21,Teilnehmer!$A$3:$C$102,2))","v":""},null,null,{"$f":"IF(BO21=\"\",\"\",VLOOKUP(BO21,Teilnehmer!$A$3:$C$102,2))","v":""},null,null,null,{"$f":"IF(BS21=\"\",\"\",VLOOKUP(BS21,Teilnehmer!$A$3:$C$102,2))","v":""},null,null,{"$f":"IF(BV21=\"\",\"\",VLOOKUP(BV21,Teilnehmer!$A$3:$C$102,2))","v":""},null,null,null,{"$f":"IF(BZ21=\"\",\"\",VLOOKUP(BZ21,Teilnehmer!$A$3:$C$102,2))","v":""},null,null,{"$f":"IF(CC21=\"\",\"\",VLOOKUP(CC21,Teilnehmer!$A$3:$C$102,2))","v":""},null,null,null,{"$f":"IF(CG21=\"\",\"\",VLOOKUP(CG21,Teilnehmer!$A$3:$C$102,2))","v":""},null,null,{"$f":"IF(CJ21=\"\",\"\",VLOOKUP(CJ21,Teilnehmer!$A$3:$C$102,2))","v":""},null,null,null,{"$f":"IF(CN21=\"\",\"\",VLOOKUP(CN21,Teilnehmer!$A$3:$C$102,2))","v":""},null,null,{"$f":"IF(CQ21=\"\",\"\",VLOOKUP(CQ21,Teilnehmer!$A$3:$C$102,2))","v":""},null,null,null,{"$f":"IF(CU21=\"\",\"\",VLOOKUP(CU21,Teilnehmer!$A$3:$C$102,2))","v":""},null,null,{"$f":"IF(CX21=\"\",\"\",VLOOKUP(CX21,Teilnehmer!$A$3:$C$102,2))","v":""},null,null,null,{"$f":"IF(DB21=\"\",\"\",VLOOKUP(DB21,Teilnehmer!$A$3:$C$102,2))","v":""},null,null,{"$f":"IF(DE21=\"\",\"\",VLOOKUP(DE21,Teilnehmer!$A$3:$C$102,2))","v":""},null,null,null,{"$f":"IF(DI21=\"\",\"\",VLOOKUP(DI21,Teilnehmer!$A$3:$C$102,2))","v":""},null,null,{"$f":"IF(DL21=\"\",\"\",VLOOKUP(DL21,Teilnehmer!$A$3:$C$102,2))","v":""},null,null,null,{"$f":"IF(DP21=\"\",\"\",VLOOKUP(DP21,Teilnehmer!$A$3:$C$102,2))","v":""},null,null,{"$f":"IF(DS21=\"\",\"\",VLOOKUP(DS21,Teilnehmer!$A$3:$C$102,2))","v":""},null,null,null,{"$f":"IF(DW21=\"\",\"\",VLOOKUP(DW21,Teilnehmer!$A$3:$C$102,2))","v":""},null,null,{"$f":"IF(DZ21=\"\",\"\",VLOOKUP(DZ21,Teilnehmer!$A$3:$C$102,2))","v":""},null,null,null,{"$f":"IF(ED21=\"\",\"\",VLOOKUP(ED21,Teilnehmer!$A$3:$C$102,2))","v":""},null,null,{"$f":"IF(EG21=\"\",\"\",VLOOKUP(EG21,Teilnehmer!$A$3:$C$102,2))","v":""},null,null,null,{"$f":"IF(EK21=\"\",\"\",VLOOKUP(EK21,Teilnehmer!$A$3:$C$102,2))","v":""},null,null,{"$f":"IF(EN21=\"\",\"\",VLOOKUP(EN21,Teilnehmer!$A$3:$C$102,2))","v":""},null,null,null,{"$f":"IF(ER21=\"\",\"\",VLOOKUP(ER21,Teilnehmer!$A$3:$C$102,2))","v":""},null,null,{"$f":"IF(EU21=\"\",\"\",VLOOKUP(EU21,Teilnehmer!$A$3:$C$102,2))","v":""},null,null,null,{"$f":"IF(EY21=\"\",\"\",VLOOKUP(EY21,Teilnehmer!$A$3:$C$102,2))","v":""},null,null,{"$f":"IF(FB21=\"\",\"\",VLOOKUP(FB21,Teilnehmer!$A$3:$C$102,2))","v":""},null,null,null,{"$f":"IF(FF21=\"\",\"\",VLOOKUP(FF21,Teilnehmer!$A$3:$C$102,2))","v":""},null,null,{"$f":"IF(FI21=\"\",\"\",VLOOKUP(FI21,Teilnehmer!$A$3:$C$102,2))","v":""},null,null,null,{"$f":"IF(FM21=\"\",\"\",VLOOKUP(FM21,Teilnehmer!$A$3:$C$102,2))","v":""},null,null,{"$f":"IF(FP21=\"\",\"\",VLOOKUP(FP21,Teilnehmer!$A$3:$C$102,2))","v":""},null,null,null,{"$f":"IF(FT21=\"\",\"\",VLOOKUP(FT21,Teilnehmer!$A$3:$C$102,2))","v":""},null,null,{"$f":"IF(FW21=\"\",\"\",VLOOKUP(FW21,Teilnehmer!$A$3:$C$102,2))","v":""},null,null,null,{"$f":"IF(GA21=\"\",\"\",VLOOKUP(GA21,Teilnehmer!$A$3:$C$102,2))","v":""},null,null,{"$f":"IF(GD21=\"\",\"\",VLOOKUP(GD21,Teilnehmer!$A$3:$C$102,2))","v":""},null,null,null,{"$f":"IF(GH21=\"\",\"\",VLOOKUP(GH21,Teilnehmer!$A$3:$C$102,2))","v":""},null,null,{"$f":"IF(GK21=\"\",\"\",VLOOKUP(GK21,Teilnehmer!$A$3:$C$102,2))","v":""},null,null,null,{"$f":"IF(GO21=\"\",\"\",VLOOKUP(GO21,Teilnehmer!$A$3:$C$102,2))","v":""},null,null,{"$f":"IF(GR21=\"\",\"\",VLOOKUP(GR21,Teilnehmer!$A$3:$C$102,2))","v":""},null,null,null,{"$f":"IF(GV21=\"\",\"\",VLOOKUP(GV21,Teilnehmer!$A$3:$C$102,2))","v":""},null,null,{"$f":"IF(GY21=\"\",\"\",VLOOKUP(GY21,Teilnehmer!$A$3:$C$102,2))","v":""},null,null,null,{"$f":"IF(HC21=\"\",\"\",VLOOKUP(HC21,Teilnehmer!$A$3:$C$102,2))","v":""},null,null,{"$f":"IF(HF21=\"\",\"\",VLOOKUP(HF21,Teilnehmer!$A$3:$C$102,2))","v":""},null,null,null,{"$f":"IF(HJ21=\"\",\"\",VLOOKUP(HJ21,Teilnehmer!$A$3:$C$102,2))","v":""},null,null,{"$f":"IF(HM21=\"\",\"\",VLOOKUP(HM21,Teilnehmer!$A$3:$C$102,2))","v":""},null,null,null,{"$f":"IF(HQ21=\"\",\"\",VLOOKUP(HQ21,Teilnehmer!$A$3:$C$102,2))","v":""},null,null,{"$f":"IF(HT21=\"\",\"\",VLOOKUP(HT21,Teilnehmer!$A$3:$C$102,2))","v":""},null,null,null,{"$f":"IF(HX21=\"\",\"\",VLOOKUP(HX21,Teilnehmer!$A$3:$C$102,2))","v":""},null,null,{"$f":"IF(IA21=\"\",\"\",VLOOKUP(IA21,Teilnehmer!$A$3:$C$102,2))","v":""},null,null,null,{"$f":"IF(IE21=\"\",\"\",VLOOKUP(IE21,Teilnehmer!$A$3:$C$102,2))","v":""},null,null,{"$f":"IF(IH21=\"\",\"\",VLOOKUP(IH21,Teilnehmer!$A$3:$C$102,2))","v":""},null,null,null,{"$f":"IF(IL21=\"\",\"\",VLOOKUP(IL21,Teilnehmer!$A$3:$C$102,2))","v":""},null,null,{"$f":"IF(IO21=\"\",\"\",VLOOKUP(IO21,Teilnehmer!$A$3:$C$102,2))","v":""},null,null,null,{"$f":"IF(IS21=\"\",\"\",VLOOKUP(IS21,Teilnehmer!$A$3:$C$102,2))","v":""},null,null,{"$f":"IF(IV21=\"\",\"\",VLOOKUP(IV21,Teilnehmer!$A$3:$C$102,2))","v":""},null,null,null,{"$f":"IF(IZ21=\"\",\"\",VLOOKUP(IZ21,Teilnehmer!$A$3:$C$102,2))","v":""},null,null,{"$f":"IF(JC21=\"\",\"\",VLOOKUP(JC21,Teilnehmer!$A$3:$C$102,2))","v":""},null,null,null,{"$f":"IF(JG21=\"\",\"\",VLOOKUP(JG21,Teilnehmer!$A$3:$C$102,2))","v":""},null,null,{"$f":"IF(JJ21=\"\",\"\",VLOOKUP(JJ21,Teilnehmer!$A$3:$C$102,2))","v":""},null,null,null,{"$f":"IF(JN21=\"\",\"\",VLOOKUP(JN21,Teilnehmer!$A$3:$C$102,2))","v":""},null,null,{"$f":"IF(JQ21=\"\",\"\",VLOOKUP(JQ21,Teilnehmer!$A$3:$C$102,2))","v":""},null,null,null,{"$f":"IF(JU21=\"\",\"\",VLOOKUP(JU21,Teilnehmer!$A$3:$C$102,2))","v":""},null,null,{"$f":"IF(JX21=\"\",\"\",VLOOKUP(JX21,Teilnehmer!$A$3:$C$102,2))","v":""},null,null,null,{"$f":"IF(KB21=\"\",\"\",VLOOKUP(KB21,Teilnehmer!$A$3:$C$102,2))","v":""},null,null,{"$f":"IF(KE21=\"\",\"\",VLOOKUP(KE21,Teilnehmer!$A$3:$C$102,2))","v":""},null,null,null,{"$f":"IF(KI21=\"\",\"\",VLOOKUP(KI21,Teilnehmer!$A$3:$C$102,2))","v":""},null,null,{"$f":"IF(KL21=\"\",\"\",VLOOKUP(KL21,Teilnehmer!$A$3:$C$102,2))","v":""},null,null,null,{"$f":"IF(KP21=\"\",\"\",VLOOKUP(KP21,Teilnehmer!$A$3:$C$102,2))","v":""},null,null,{"$f":"IF(KS21=\"\",\"\",VLOOKUP(KS21,Teilnehmer!$A$3:$C$102,2))","v":""}]
[null,{"$f":"IF(A22=\"\",\"\",VLOOKUP(A22,Teilnehmer!$A$3:$C$102,2))","v":""},null,null,{"$f":"IF(D22=\"\",\"\",VLOOKUP(D22,Teilnehmer!$A$3:$C$102,2))","v":""},null,null,null,{"$f":"IF(H22=\"\",\"\",VLOOKUP(H22,Teilnehmer!$A$3:$C$102,2))","v":""},null,null,{"$f":"IF(K22=\"\",\"\",VLOOKUP(K22,Teilnehmer!$A$3:$C$102,2))","v":""},null,null,null,{"$f":"IF(O22=\"\",\"\",VLOOKUP(O22,Teilnehmer!$A$3:$C$102,2))","v":""},null,null,{"$f":"IF(R22=\"\",\"\",VLOOKUP(R22,Teilnehmer!$A$3:$C$102,2))","v":""},null,null,null,{"$f":"IF(V22=\"\",\"\",VLOOKUP(V22,Teilnehmer!$A$3:$C$102,2))","v":""},null,null,{"$f":"IF(Y22=\"\",\"\",VLOOKUP(Y22,Teilnehmer!$A$3:$C$102,2))","v":""},null,null,null,{"$f":"IF(AC22=\"\",\"\",VLOOKUP(AC22,Teilnehmer!$A$3:$C$102,2))","v":""},null,null,{"$f":"IF(AF22=\"\",\"\",VLOOKUP(AF22,Teilnehmer!$A$3:$C$102,2))","v":""},null,null,null,{"$f":"IF(AJ22=\"\",\"\",VLOOKUP(AJ22,Teilnehmer!$A$3:$C$102,2))","v":""},null,null,{"$f":"IF(AM22=\"\",\"\",VLOOKUP(AM22,Teilnehmer!$A$3:$C$102,2))","v":""},null,null,null,{"$f":"IF(AQ22=\"\",\"\",VLOOKUP(AQ22,Teilnehmer!$A$3:$C$102,2))","v":""},null,null,{"$f":"IF(AT22=\"\",\"\",VLOOKUP(AT22,Teilnehmer!$A$3:$C$102,2))","v":""},null,null,null,{"$f":"IF(AX22=\"\",\"\",VLOOKUP(AX22,Teilnehmer!$A$3:$C$102,2))","v":""},null,null,{"$f":"IF(BA22=\"\",\"\",VLOOKUP(BA22,Teilnehmer!$A$3:$C$102,2))","v":""},null,null,null,{"$f":"IF(BE22=\"\",\"\",VLOOKUP(BE22,Teilnehmer!$A$3:$C$102,2))","v":""},null,null,{"$f":"IF(BH22=\"\",\"\",VLOOKUP(BH22,Teilnehmer!$A$3:$C$102,2))","v":""},null,null,null,{"$f":"IF(BL22=\"\",\"\",VLOOKUP(BL22,Teilnehmer!$A$3:$C$102,2))","v":""},null,null,{"$f":"IF(BO22=\"\",\"\",VLOOKUP(BO22,Teilnehmer!$A$3:$C$102,2))","v":""},null,null,null,{"$f":"IF(BS22=\"\",\"\",VLOOKUP(BS22,Teilnehmer!$A$3:$C$102,2))","v":""},null,null,{"$f":"IF(BV22=\"\",\"\",VLOOKUP(BV22,Teilnehmer!$A$3:$C$102,2))","v":""},null,null,null,{"$f":"IF(BZ22=\"\",\"\",VLOOKUP(BZ22,Teilnehmer!$A$3:$C$102,2))","v":""},null,null,{"$f":"IF(CC22=\"\",\"\",VLOOKUP(CC22,Teilnehmer!$A$3:$C$102,2))","v":""},null,null,null,{"$f":"IF(CG22=\"\",\"\",VLOOKUP(CG22,Teilnehmer!$A$3:$C$102,2))","v":""},null,null,{"$f":"IF(CJ22=\"\",\"\",VLOOKUP(CJ22,Teilnehmer!$A$3:$C$102,2))","v":""},null,null,null,{"$f":"IF(CN22=\"\",\"\",VLOOKUP(CN22,Teilnehmer!$A$3:$C$102,2))","v":""},null,null,{"$f":"IF(CQ22=\"\",\"\",VLOOKUP(CQ22,Teilnehmer!$A$3:$C$102,2))","v":""},null,null,null,{"$f":"IF(CU22=\"\",\"\",VLOOKUP(CU22,Teilnehmer!$A$3:$C$102,2))","v":""},null,null,{"$f":"IF(CX22=\"\",\"\",VLOOKUP(CX22,Teilnehmer!$A$3:$C$102,2))","v":""},null,null,null,{"$f":"IF(DB22=\"\",\"\",VLOOKUP(DB22,Teilnehmer!$A$3:$C$102,2))","v":""},null,null,{"$f":"IF(DE22=\"\",\"\",VLOOKUP(DE22,Teilnehmer!$A$3:$C$102,2))","v":""},null,null,null,{"$f":"IF(DI22=\"\",\"\",VLOOKUP(DI22,Teilnehmer!$A$3:$C$102,2))","v":""},null,null,{"$f":"IF(DL22=\"\",\"\",VLOOKUP(DL22,Teilnehmer!$A$3:$C$102,2))","v":""},null,null,null,{"$f":"IF(DP22=\"\",\"\",VLOOKUP(DP22,Teilnehmer!$A$3:$C$102,2))","v":""},null,null,{"$f":"IF(DS22=\"\",\"\",VLOOKUP(DS22,Teilnehmer!$A$3:$C$102,2))","v":""},null,null,null,{"$f":"IF(DW22=\"\",\"\",VLOOKUP(DW22,Teilnehmer!$A$3:$C$102,2))","v":""},null,null,{"$f":"IF(DZ22=\"\",\"\",VLOOKUP(DZ22,Teilnehmer!$A$3:$C$102,2))","v":""},null,null,null,{"$f":"IF(ED22=\"\",\"\",VLOOKUP(ED22,Teilnehmer!$A$3:$C$102,2))","v":""},null,null,{"$f":"IF(EG22=\"\",\"\",VLOOKUP(EG22,Teilnehmer!$A$3:$C$102,2))","v":""},null,null,null,{"$f":"IF(EK22=\"\",\"\",VLOOKUP(EK22,Teilnehmer!$A$3:$C$102,2))","v":""},null,null,{"$f":"IF(EN22=\"\",\"\",VLOOKUP(EN22,Teilnehmer!$A$3:$C$102,2))","v":""},null,null,null,{"$f":"IF(ER22=\"\",\"\",VLOOKUP(ER22,Teilnehmer!$A$3:$C$102,2))","v":""},null,null,{"$f":"IF(EU22=\"\",\"\",VLOOKUP(EU22,Teilnehmer!$A$3:$C$102,2))","v":""},null,null,null,{"$f":"IF(EY22=\"\",\"\",VLOOKUP(EY22,Teilnehmer!$A$3:$C$102,2))","v":""},null,null,{"$f":"IF(FB22=\"\",\"\",VLOOKUP(FB22,Teilnehmer!$A$3:$C$102,2))","v":""},null,null,null,{"$f":"IF(FF22=\"\",\"\",VLOOKUP(FF22,Teilnehmer!$A$3:$C$102,2))","v":""},null,null,{"$f":"IF(FI22=\"\",\"\",VLOOKUP(FI22,Teilnehmer!$A$3:$C$102,2))","v":""},null,null,null,{"$f":"IF(FM22=\"\",\"\",VLOOKUP(FM22,Teilnehmer!$A$3:$C$102,2))","v":""},null,null,{"$f":"IF(FP22=\"\",\"\",VLOOKUP(FP22,Teilnehmer!$A$3:$C$102,2))","v":""},null,null,null,{"$f":"IF(FT22=\"\",\"\",VLOOKUP(FT22,Teilnehmer!$A$3:$C$102,2))","v":""},null,null,{"$f":"IF(FW22=\"\",\"\",VLOOKUP(FW22,Teilnehmer!$A$3:$C$102,2))","v":""},null,null,null,{"$f":"IF(GA22=\"\",\"\",VLOOKUP(GA22,Teilnehmer!$A$3:$C$102,2))","v":""},null,null,{"$f":"IF(GD22=\"\",\"\",VLOOKUP(GD22,Teilnehmer!$A$3:$C$102,2))","v":""},null,null,null,{"$f":"IF(GH22=\"\",\"\",VLOOKUP(GH22,Teilnehmer!$A$3:$C$102,2))","v":""},null,null,{"$f":"IF(GK22=\"\",\"\",VLOOKUP(GK22,Teilnehmer!$A$3:$C$102,2))","v":""},null,null,null,{"$f":"IF(GO22=\"\",\"\",VLOOKUP(GO22,Teilnehmer!$A$3:$C$102,2))","v":""},null,null,{"$f":"IF(GR22=\"\",\"\",VLOOKUP(GR22,Teilnehmer!$A$3:$C$102,2))","v":""},null,null,null,{"$f":"IF(GV22=\"\",\"\",VLOOKUP(GV22,Teilnehmer!$A$3:$C$102,2))","v":""},null,null,{"$f":"IF(GY22=\"\",\"\",VLOOKUP(GY22,Teilnehmer!$A$3:$C$102,2))","v":""},null,null,null,{"$f":"IF(HC22=\"\",\"\",VLOOKUP(HC22,Teilnehmer!$A$3:$C$102,2))","v":""},null,null,{"$f":"IF(HF22=\"\",\"\",VLOOKUP(HF22,Teilnehmer!$A$3:$C$102,2))","v":""},null,null,null,{"$f":"IF(HJ22=\"\",\"\",VLOOKUP(HJ22,Teilnehmer!$A$3:$C$102,2))","v":""},null,null,{"$f":"IF(HM22=\"\",\"\",VLOOKUP(HM22,Teilnehmer!$A$3:$C$102,2))","v":""},null,null,null,{"$f":"IF(HQ22=\"\",\"\",VLOOKUP(HQ22,Teilnehmer!$A$3:$C$102,2))","v":""},null,null,{"$f":"IF(HT22=\"\",\"\",VLOOKUP(HT22,Teilnehmer!$A$3:$C$102,2))","v":""},null,null,null,{"$f":"IF(HX22=\"\",\"\",VLOOKUP(HX22,Teilnehmer!$A$3:$C$102,2))","v":""},null,null,{"$f":"IF(IA22=\"\",\"\",VLOOKUP(IA22,Teilnehmer!$A$3:$C$102,2))","v":""},null,null,null,{"$f":"IF(IE22=\"\",\"\",VLOOKUP(IE22,Teilnehmer!$A$3:$C$102,2))","v":""},null,null,{"$f":"IF(IH22=\"\",\"\",VLOOKUP(IH22,Teilnehmer!$A$3:$C$102,2))","v":""},null,null,null,{"$f":"IF(IL22=\"\",\"\",VLOOKUP(IL22,Teilnehmer!$A$3:$C$102,2))","v":""},null,null,{"$f":"IF(IO22=\"\",\"\",VLOOKUP(IO22,Teilnehmer!$A$3:$C$102,2))","v":""},null,null,null,{"$f":"IF(IS22=\"\",\"\",VLOOKUP(IS22,Teilnehmer!$A$3:$C$102,2))","v":""},null,null,{"$f":"IF(IV22=\"\",\"\",VLOOKUP(IV22,Teilnehmer!$A$3:$C$102,2))","v":""},null,null,null,{"$f":"IF(IZ22=\"\",\"\",VLOOKUP(IZ22,Teilnehmer!$A$3:$C$102,2))","v":""},null,null,{"$f":"IF(JC22=\"\",\"\",VLOOKUP(JC22,Teilnehmer!$A$3:$C$102,2))","v":""},null,null,null,{"$f":"IF(JG22=\"\",\"\",VLOOKUP(JG22,Teilnehmer!$A$3:$C$102,2))","v":""},null,null,{"$f":"IF(JJ22=\"\",\"\",VLOOKUP(JJ22,Teilnehmer!$A$3:$C$102,2))","v":""},null,null,null,{"$f":"IF(JN22=\"\",\"\",VLOOKUP(JN22,Teilnehmer!$A$3:$C$102,2))","v":""},null,null,{"$f":"IF(JQ22=\"\",\"\",VLOOKUP(JQ22,Teilnehmer!$A$3:$C$102,2))","v":""},null,null,null,{"$f":"IF(JU22=\"\",\"\",VLOOKUP(JU22,Teilnehmer!$A$3:$C$102,2))","v":""},null,null,{"$f":"IF(JX22=\"\",\"\",VLOOKUP(JX22,Teilnehmer!$A$3:$C$102,2))","v":""},null,null,null,{"$f":"IF(KB22=\"\",\"\",VLOOKUP(KB22,Teilnehmer!$A$3:$C$102,2))","v":""},null,null,{"$f":"IF(KE22=\"\",\"\",VLOOKUP(KE22,Teilnehmer!$A$3:$C$102,2))","v":""},null,null,null,{"$f":"IF(KI22=\"\",\"\",VLOOKUP(KI22,Teilnehmer!$A$3:$C$102,2))","v":""},null,null,{"$f":"IF(KL22=\"\",\"\",VLOOKUP(KL22,Teilnehmer!$A$3:$C$102,2))","v":""},null,null,null,{"$f":"IF(KP22=\"\",\"\",VLOOKUP(KP22,Teilnehmer!$A$3:$C$102,2))","v":""},null,null,{"$f":"IF(KS22=\"\",\"\",VLOOKUP(KS22,Teilnehmer!$A$3:$C$102,2))","v":""}]
[null,{"$f":"IF(A23=\"\",\"\",VLOOKUP(A23,Teilnehmer!$A$3:$C$102,2))","v":""},null,null,{"$f":"IF(D23=\"\",\"\",VLOOKUP(D23,Teilnehmer!$A$3:$C$102,2))","v":""},null,null,null,{"$f":"IF(H23=\"\",\"\",VLOOKUP(H23,Teilnehmer!$A$3:$C$102,2))","v":""},null,null,{"$f":"IF(K23=\"\",\"\",VLOOKUP(K23,Teilnehmer!$A$3:$C$102,2))","v":""},null,null,null,{"$f":"IF(O23=\"\",\"\",VLOOKUP(O23,Teilnehmer!$A$3:$C$102,2))","v":""},null,null,{"$f":"IF(R23=\"\",\"\",VLOOKUP(R23,Teilnehmer!$A$3:$C$102,2))","v":""},null,null,null,{"$f":"IF(V23=\"\",\"\",VLOOKUP(V23,Teilnehmer!$A$3:$C$102,2))","v":""},null,null,{"$f":"IF(Y23=\"\",\"\",VLOOKUP(Y23,Teilnehmer!$A$3:$C$102,2))","v":""},null,null,null,{"$f":"IF(AC23=\"\",\"\",VLOOKUP(AC23,Teilnehmer!$A$3:$C$102,2))","v":""},null,null,{"$f":"IF(AF23=\"\",\"\",VLOOKUP(AF23,Teilnehmer!$A$3:$C$102,2))","v":""},null,null,null,{"$f":"IF(AJ23=\"\",\"\",VLOOKUP(AJ23,Teilnehmer!$A$3:$C$102,2))","v":""},null,null,{"$f":"IF(AM23=\"\",\"\",VLOOKUP(AM23,Teilnehmer!$A$3:$C$102,2))","v":""},null,null,null,{"$f":"IF(AQ23=\"\",\"\",VLOOKUP(AQ23,Teilnehmer!$A$3:$C$102,2))","v":""},null,null,{"$f":"IF(AT23=\"\",\"\",VLOOKUP(AT23,Teilnehmer!$A$3:$C$102,2))","v":""},null,null,null,{"$f":"IF(AX23=\"\",\"\",VLOOKUP(AX23,Teilnehmer!$A$3:$C$102,2))","v":""},null,null,{"$f":"IF(BA23=\"\",\"\",VLOOKUP(BA23,Teilnehmer!$A$3:$C$102,2))","v":""},null,null,null,{"$f":"IF(BE23=\"\",\"\",VLOOKUP(BE23,Teilnehmer!$A$3:$C$102,2))","v":""},null,null,{"$f":"IF(BH23=\"\",\"\",VLOOKUP(BH23,Teilnehmer!$A$3:$C$102,2))","v":""},null,null,null,{"$f":"IF(BL23=\"\",\"\",VLOOKUP(BL23,Teilnehmer!$A$3:$C$102,2))","v":""},null,null,{"$f":"IF(BO23=\"\",\"\",VLOOKUP(BO23,Teilnehmer!$A$3:$C$102,2))","v":""},null,null,null,{"$f":"IF(BS23=\"\",\"\",VLOOKUP(BS23,Teilnehmer!$A$3:$C$102,2))","v":""},null,null,{"$f":"IF(BV23=\"\",\"\",VLOOKUP(BV23,Teilnehmer!$A$3:$C$102,2))","v":""},null,null,null,{"$f":"IF(BZ23=\"\",\"\",VLOOKUP(BZ23,Teilnehmer!$A$3:$C$102,2))","v":""},null,null,{"$f":"IF(CC23=\"\",\"\",VLOOKUP(CC23,Teilnehmer!$A$3:$C$102,2))","v":""},null,null,null,{"$f":"IF(CG23=\"\",\"\",VLOOKUP(CG23,Teilnehmer!$A$3:$C$102,2))","v":""},null,null,{"$f":"IF(CJ23=\"\",\"\",VLOOKUP(CJ23,Teilnehmer!$A$3:$C$102,2))","v":""},null,null,null,{"$f":"IF(CN23=\"\",\"\",VLOOKUP(CN23,Teilnehmer!$A$3:$C$102,2))","v":""},null,null,{"$f":"IF(CQ23=\"\",\"\",VLOOKUP(CQ23,Teilnehmer!$A$3:$C$102,2))","v":""},null,null,null,{"$f":"IF(CU23=\"\",\"\",VLOOKUP(CU23,Teilnehmer!$A$3:$C$102,2))","v":""},null,null,{"$f":"IF(CX23=\"\",\"\",VLOOKUP(CX23,Teilnehmer!$A$3:$C$102,2))","v":""},null,null,null,{"$f":"IF(DB23=\"\",\"\",VLOOKUP(DB23,Teilnehmer!$A$3:$C$102,2))","v":""},null,null,{"$f":"IF(DE23=\"\",\"\",VLOOKUP(DE23,Teilnehmer!$A$3:$C$102,2))","v":""},null,null,null,{"$f":"IF(DI23=\"\",\"\",VLOOKUP(DI23,Teilnehmer!$A$3:$C$102,2))","v":""},null,null,{"$f":"IF(DL23=\"\",\"\",VLOOKUP(DL23,Teilnehmer!$A$3:$C$102,2))","v":""},null,null,null,{"$f":"IF(DP23=\"\",\"\",VLOOKUP(DP23,Teilnehmer!$A$3:$C$102,2))","v":""},null,null,{"$f":"IF(DS23=\"\",\"\",VLOOKUP(DS23,Teilnehmer!$A$3:$C$102,2))","v":""},null,null,null,{"$f":"IF(DW23=\"\",\"\",VLOOKUP(DW23,Teilnehmer!$A$3:$C$102,2))","v":""},null,null,{"$f":"IF(DZ23=\"\",\"\",VLOOKUP(DZ23,Teilnehmer!$A$3:$C$102,2))","v":""},null,null,null,{"$f":"IF(ED23=\"\",\"\",VLOOKUP(ED23,Teilnehmer!$A$3:$C$102,2))","v":""},null,null,{"$f":"IF(EG23=\"\",\"\",VLOOKUP(EG23,Teilnehmer!$A$3:$C$102,2))","v":""},null,null,null,{"$f":"IF(EK23=\"\",\"\",VLOOKUP(EK23,Teilnehmer!$A$3:$C$102,2))","v":""},null,null,{"$f":"IF(EN23=\"\",\"\",VLOOKUP(EN23,Teilnehmer!$A$3:$C$102,2))","v":""},null,null,null,{"$f":"IF(ER23=\"\",\"\",VLOOKUP(ER23,Teilnehmer!$A$3:$C$102,2))","v":""},null,null,{"$f":"IF(EU23=\"\",\"\",VLOOKUP(EU23,Teilnehmer!$A$3:$C$102,2))","v":""},null,null,null,{"$f":"IF(EY23=\"\",\"\",VLOOKUP(EY23,Teilnehmer!$A$3:$C$102,2))","v":""},null,null,{"$f":"IF(FB23=\"\",\"\",VLOOKUP(FB23,Teilnehmer!$A$3:$C$102,2))","v":""},null,null,null,{"$f":"IF(FF23=\"\",\"\",VLOOKUP(FF23,Teilnehmer!$A$3:$C$102,2))","v":""},null,null,{"$f":"IF(FI23=\"\",\"\",VLOOKUP(FI23,Teilnehmer!$A$3:$C$102,2))","v":""},null,null,null,{"$f":"IF(FM23=\"\",\"\",VLOOKUP(FM23,Teilnehmer!$A$3:$C$102,2))","v":""},null,null,{"$f":"IF(FP23=\"\",\"\",VLOOKUP(FP23,Teilnehmer!$A$3:$C$102,2))","v":""},null,null,null,{"$f":"IF(FT23=\"\",\"\",VLOOKUP(FT23,Teilnehmer!$A$3:$C$102,2))","v":""},null,null,{"$f":"IF(FW23=\"\",\"\",VLOOKUP(FW23,Teilnehmer!$A$3:$C$102,2))","v":""},null,null,null,{"$f":"IF(GA23=\"\",\"\",VLOOKUP(GA23,Teilnehmer!$A$3:$C$102,2))","v":""},null,null,{"$f":"IF(GD23=\"\",\"\",VLOOKUP(GD23,Teilnehmer!$A$3:$C$102,2))","v":""},null,null,null,{"$f":"IF(GH23=\"\",\"\",VLOOKUP(GH23,Teilnehmer!$A$3:$C$102,2))","v":""},null,null,{"$f":"IF(GK23=\"\",\"\",VLOOKUP(GK23,Teilnehmer!$A$3:$C$102,2))","v":""},null,null,null,{"$f":"IF(GO23=\"\",\"\",VLOOKUP(GO23,Teilnehmer!$A$3:$C$102,2))","v":""},null,null,{"$f":"IF(GR23=\"\",\"\",VLOOKUP(GR23,Teilnehmer!$A$3:$C$102,2))","v":""},null,null,null,{"$f":"IF(GV23=\"\",\"\",VLOOKUP(GV23,Teilnehmer!$A$3:$C$102,2))","v":""},null,null,{"$f":"IF(GY23=\"\",\"\",VLOOKUP(GY23,Teilnehmer!$A$3:$C$102,2))","v":""},null,null,null,{"$f":"IF(HC23=\"\",\"\",VLOOKUP(HC23,Teilnehmer!$A$3:$C$102,2))","v":""},null,null,{"$f":"IF(HF23=\"\",\"\",VLOOKUP(HF23,Teilnehmer!$A$3:$C$102,2))","v":""},null,null,null,{"$f":"IF(HJ23=\"\",\"\",VLOOKUP(HJ23,Teilnehmer!$A$3:$C$102,2))","v":""},null,null,{"$f":"IF(HM23=\"\",\"\",VLOOKUP(HM23,Teilnehmer!$A$3:$C$102,2))","v":""},null,null,null,{"$f":"IF(HQ23=\"\",\"\",VLOOKUP(HQ23,Teilnehmer!$A$3:$C$102,2))","v":""},null,null,{"$f":"IF(HT23=\"\",\"\",VLOOKUP(HT23,Teilnehmer!$A$3:$C$102,2))","v":""},null,null,null,{"$f":"IF(HX23=\"\",\"\",VLOOKUP(HX23,Teilnehmer!$A$3:$C$102,2))","v":""},null,null,{"$f":"IF(IA23=\"\",\"\",VLOOKUP(IA23,Teilnehmer!$A$3:$C$102,2))","v":""},null,null,null,{"$f":"IF(IE23=\"\",\"\",VLOOKUP(IE23,Teilnehmer!$A$3:$C$102,2))","v":""},null,null,{"$f":"IF(IH23=\"\",\"\",VLOOKUP(IH23,Teilnehmer!$A$3:$C$102,2))","v":""},null,null,null,{"$f":"IF(IL23=\"\",\"\",VLOOKUP(IL23,Teilnehmer!$A$3:$C$102,2))","v":""},null,null,{"$f":"IF(IO23=\"\",\"\",VLOOKUP(IO23,Teilnehmer!$A$3:$C$102,2))","v":""},null,null,null,{"$f":"IF(IS23=\"\",\"\",VLOOKUP(IS23,Teilnehmer!$A$3:$C$102,2))","v":""},null,null,{"$f":"IF(IV23=\"\",\"\",VLOOKUP(IV23,Teilnehmer!$A$3:$C$102,2))","v":""},null,null,null,{"$f":"IF(IZ23=\"\",\"\",VLOOKUP(IZ23,Teilnehmer!$A$3:$C$102,2))","v":""},null,null,{"$f":"IF(JC23=\"\",\"\",VLOOKUP(JC23,Teilnehmer!$A$3:$C$102,2))","v":""},null,null,null,{"$f":"IF(JG23=\"\",\"\",VLOOKUP(JG23,Teilnehmer!$A$3:$C$102,2))","v":""},null,null,{"$f":"IF(JJ23=\"\",\"\",VLOOKUP(JJ23,Teilnehmer!$A$3:$C$102,2))","v":""},null,null,null,{"$f":"IF(JN23=\"\",\"\",VLOOKUP(JN23,Teilnehmer!$A$3:$C$102,2))","v":""},null,null,{"$f":"IF(JQ23=\"\",\"\",VLOOKUP(JQ23,Teilnehmer!$A$3:$C$102,2))","v":""},null,null,null,{"$f":"IF(JU23=\"\",\"\",VLOOKUP(JU23,Teilnehmer!$A$3:$C$102,2))","v":""},null,null,{"$f":"IF(JX23=\"\",\"\",VLOOKUP(JX23,Teilnehmer!$A$3:$C$102,2))","v":""},null,null,null,{"$f":"IF(KB23=\"\",\"\",VLOOKUP(KB23,Teilnehmer!$A$3:$C$102,2))","v":""},null,null,{"$f":"IF(KE23=\"\",\"\",VLOOKUP(KE23,Teilnehmer!$A$3:$C$102,2))","v":""},null,null,null,{"$f":"IF(KI23=\"\",\"\",VLOOKUP(KI23,Teilnehmer!$A$3:$C$102,2))","v":""},null,null,{"$f":"IF(KL23=\"\",\"\",VLOOKUP(KL23,Teilnehmer!$A$3:$C$102,2))","v":""},null,null,null,{"$f":"IF(KP23=\"\",\"\",VLOOKUP(KP23,Teilnehmer!$A$3:$C$102,2))","v":""},null,null,{"$f":"IF(KS23=\"\",\"\",VLOOKUP(KS23,Teilnehmer!$A$3:$C$102,2))","v":""}]
[null,{"$f":"IF(A24=\"\",\"\",VLOOKUP(A24,Teilnehmer!$A$3:$C$102,2))","v":""},null,null,{"$f":"IF(D24=\"\",\"\",VLOOKUP(D24,Teilnehmer!$A$3:$C$102,2))","v":""},null,null,null,{"$f":"IF(H24=\"\",\"\",VLOOKUP(H24,Teilnehmer!$A$3:$C$102,2))","v":""},null,null,{"$f":"IF(K24=\"\",\"\",VLOOKUP(K24,Teilnehmer!$A$3:$C$102,2))","v":""},null,null,null,{"$f":"IF(O24=\"\",\"\",VLOOKUP(O24,Teilnehmer!$A$3:$C$102,2))","v":""},null,null,{"$f":"IF(R24=\"\",\"\",VLOOKUP(R24,Teilnehmer!$A$3:$C$102,2))","v":""},null,null,null,{"$f":"IF(V24=\"\",\"\",VLOOKUP(V24,Teilnehmer!$A$3:$C$102,2))","v":""},null,null,{"$f":"IF(Y24=\"\",\"\",VLOOKUP(Y24,Teilnehmer!$A$3:$C$102,2))","v":""},null,null,null,{"$f":"IF(AC24=\"\",\"\",VLOOKUP(AC24,Teilnehmer!$A$3:$C$102,2))","v":""},null,null,{"$f":"IF(AF24=\"\",\"\",VLOOKUP(AF24,Teilnehmer!$A$3:$C$102,2))","v":""},null,null,null,{"$f":"IF(AJ24=\"\",\"\",VLOOKUP(AJ24,Teilnehmer!$A$3:$C$102,2))","v":""},null,null,{"$f":"IF(AM24=\"\",\"\",VLOOKUP(AM24,Teilnehmer!$A$3:$C$102,2))","v":""},null,null,null,{"$f":"IF(AQ24=\"\",\"\",VLOOKUP(AQ24,Teilnehmer!$A$3:$C$102,2))","v":""},null,null,{"$f":"IF(AT24=\"\",\"\",VLOOKUP(AT24,Teilnehmer!$A$3:$C$102,2))","v":""},null,null,null,{"$f":"IF(AX24=\"\",\"\",VLOOKUP(AX24,Teilnehmer!$A$3:$C$102,2))","v":""},null,null,{"$f":"IF(BA24=\"\",\"\",VLOOKUP(BA24,Teilnehmer!$A$3:$C$102,2))","v":""},null,null,null,{"$f":"IF(BE24=\"\",\"\",VLOOKUP(BE24,Teilnehmer!$A$3:$C$102,2))","v":""},null,null,{"$f":"IF(BH24=\"\",\"\",VLOOKUP(BH24,Teilnehmer!$A$3:$C$102,2))","v":""},null,null,null,{"$f":"IF(BL24=\"\",\"\",VLOOKUP(BL24,Teilnehmer!$A$3:$C$102,2))","v":""},null,null,{"$f":"IF(BO24=\"\",\"\",VLOOKUP(BO24,Teilnehmer!$A$3:$C$102,2))","v":""},null,null,null,{"$f":"IF(BS24=\"\",\"\",VLOOKUP(BS24,Teilnehmer!$A$3:$C$102,2))","v":""},null,null,{"$f":"IF(BV24=\"\",\"\",VLOOKUP(BV24,Teilnehmer!$A$3:$C$102,2))","v":""},null,null,null,{"$f":"IF(BZ24=\"\",\"\",VLOOKUP(BZ24,Teilnehmer!$A$3:$C$102,2))","v":""},null,null,{"$f":"IF(CC24=\"\",\"\",VLOOKUP(CC24,Teilnehmer!$A$3:$C$102,2))","v":""},null,null,null,{"$f":"IF(CG24=\"\",\"\",VLOOKUP(CG24,Teilnehmer!$A$3:$C$102,2))","v":""},null,null,{"$f":"IF(CJ24=\"\",\"\",VLOOKUP(CJ24,Teilnehmer!$A$3:$C$102,2))","v":""},null,null,null,{"$f":"IF(CN24=\"\",\"\",VLOOKUP(CN24,Teilnehmer!$A$3:$C$102,2))","v":""},null,null,{"$f":"IF(CQ24=\"\",\"\",VLOOKUP(CQ24,Teilnehmer!$A$3:$C$102,2))","v":""},null,null,null,{"$f":"IF(CU24=\"\",\"\",VLOOKUP(CU24,Teilnehmer!$A$3:$C$102,2))","v":""},null,null,{"$f":"IF(CX24=\"\",\"\",VLOOKUP(CX24,Teilnehmer!$A$3:$C$102,2))","v":""},null,null,null,{"$f":"IF(DB24=\"\",\"\",VLOOKUP(DB24,Teilnehmer!$A$3:$C$102,2))","v":""},null,null,{"$f":"IF(DE24=\"\",\"\",VLOOKUP(DE24,Teilnehmer!$A$3:$C$102,2))","v":""},null,null,null,{"$f":"IF(DI24=\"\",\"\",VLOOKUP(DI24,Teilnehmer!$A$3:$C$102,2))","v":""},null,null,{"$f":"IF(DL24=\"\",\"\",VLOOKUP(DL24,Teilnehmer!$A$3:$C$102,2))","v":""},null,null,null,{"$f":"IF(DP24=\"\",\"\",VLOOKUP(DP24,Teilnehmer!$A$3:$C$102,2))","v":""},null,null,{"$f":"IF(DS24=\"\",\"\",VLOOKUP(DS24,Teilnehmer!$A$3:$C$102,2))","v":""},null,null,null,{"$f":"IF(DW24=\"\",\"\",VLOOKUP(DW24,Teilnehmer!$A$3:$C$102,2))","v":""},null,null,{"$f":"IF(DZ24=\"\",\"\",VLOOKUP(DZ24,Teilnehmer!$A$3:$C$102,2))","v":""},null,null,null,{"$f":"IF(ED24=\"\",\"\",VLOOKUP(ED24,Teilnehmer!$A$3:$C$102,2))","v":""},null,null,{"$f":"IF(EG24=\"\",\"\",VLOOKUP(EG24,Teilnehmer!$A$3:$C$102,2))","v":""},null,null,null,{"$f":"IF(EK24=\"\",\"\",VLOOKUP(EK24,Teilnehmer!$A$3:$C$102,2))","v":""},null,null,{"$f":"IF(EN24=\"\",\"\",VLOOKUP(EN24,Teilnehmer!$A$3:$C$102,2))","v":""},null,null,null,{"$f":"IF(ER24=\"\",\"\",VLOOKUP(ER24,Teilnehmer!$A$3:$C$102,2))","v":""},null,null,{"$f":"IF(EU24=\"\",\"\",VLOOKUP(EU24,Teilnehmer!$A$3:$C$102,2))","v":""},null,null,null,{"$f":"IF(EY24=\"\",\"\",VLOOKUP(EY24,Teilnehmer!$A$3:$C$102,2))","v":""},null,null,{"$f":"IF(FB24=\"\",\"\",VLOOKUP(FB24,Teilnehmer!$A$3:$C$102,2))","v":""},null,null,null,{"$f":"IF(FF24=\"\",\"\",VLOOKUP(FF24,Teilnehmer!$A$3:$C$102,2))","v":""},null,null,{"$f":"IF(FI24=\"\",\"\",VLOOKUP(FI24,Teilnehmer!$A$3:$C$102,2))","v":""},null,null,null,{"$f":"IF(FM24=\"\",\"\",VLOOKUP(FM24,Teilnehmer!$A$3:$C$102,2))","v":""},null,null,{"$f":"IF(FP24=\"\",\"\",VLOOKUP(FP24,Teilnehmer!$A$3:$C$102,2))","v":""},null,null,null,{"$f":"IF(FT24=\"\",\"\",VLOOKUP(FT24,Teilnehmer!$A$3:$C$102,2))","v":""},null,null,{"$f":"IF(FW24=\"\",\"\",VLOOKUP(FW24,Teilnehmer!$A$3:$C$102,2))","v":""},null,null,null,{"$f":"IF(GA24=\"\",\"\",VLOOKUP(GA24,Teilnehmer!$A$3:$C$102,2))","v":""},null,null,{"$f":"IF(GD24=\"\",\"\",VLOOKUP(GD24,Teilnehmer!$A$3:$C$102,2))","v":""},null,null,null,{"$f":"IF(GH24=\"\",\"\",VLOOKUP(GH24,Teilnehmer!$A$3:$C$102,2))","v":""},null,null,{"$f":"IF(GK24=\"\",\"\",VLOOKUP(GK24,Teilnehmer!$A$3:$C$102,2))","v":""},null,null,null,{"$f":"IF(GO24=\"\",\"\",VLOOKUP(GO24,Teilnehmer!$A$3:$C$102,2))","v":""},null,null,{"$f":"IF(GR24=\"\",\"\",VLOOKUP(GR24,Teilnehmer!$A$3:$C$102,2))","v":""},null,null,null,{"$f":"IF(GV24=\"\",\"\",VLOOKUP(GV24,Teilnehmer!$A$3:$C$102,2))","v":""},null,null,{"$f":"IF(GY24=\"\",\"\",VLOOKUP(GY24,Teilnehmer!$A$3:$C$102,2))","v":""},null,null,null,{"$f":"IF(HC24=\"\",\"\",VLOOKUP(HC24,Teilnehmer!$A$3:$C$102,2))","v":""},null,null,{"$f":"IF(HF24=\"\",\"\",VLOOKUP(HF24,Teilnehmer!$A$3:$C$102,2))","v":""},null,null,null,{"$f":"IF(HJ24=\"\",\"\",VLOOKUP(HJ24,Teilnehmer!$A$3:$C$102,2))","v":""},null,null,{"$f":"IF(HM24=\"\",\"\",VLOOKUP(HM24,Teilnehmer!$A$3:$C$102,2))","v":""},null,null,null,{"$f":"IF(HQ24=\"\",\"\",VLOOKUP(HQ24,Teilnehmer!$A$3:$C$102,2))","v":""},null,null,{"$f":"IF(HT24=\"\",\"\",VLOOKUP(HT24,Teilnehmer!$A$3:$C$102,2))","v":""},null,null,null,{"$f":"IF(HX24=\"\",\"\",VLOOKUP(HX24,Teilnehmer!$A$3:$C$102,2))","v":""},null,null,{"$f":"IF(IA24=\"\",\"\",VLOOKUP(IA24,Teilnehmer!$A$3:$C$102,2))","v":""},null,null,null,{"$f":"IF(IE24=\"\",\"\",VLOOKUP(IE24,Teilnehmer!$A$3:$C$102,2))","v":""},null,null,{"$f":"IF(IH24=\"\",\"\",VLOOKUP(IH24,Teilnehmer!$A$3:$C$102,2))","v":""},null,null,null,{"$f":"IF(IL24=\"\",\"\",VLOOKUP(IL24,Teilnehmer!$A$3:$C$102,2))","v":""},null,null,{"$f":"IF(IO24=\"\",\"\",VLOOKUP(IO24,Teilnehmer!$A$3:$C$102,2))","v":""},null,null,null,{"$f":"IF(IS24=\"\",\"\",VLOOKUP(IS24,Teilnehmer!$A$3:$C$102,2))","v":""},null,null,{"$f":"IF(IV24=\"\",\"\",VLOOKUP(IV24,Teilnehmer!$A$3:$C$102,2))","v":""},null,null,null,{"$f":"IF(IZ24=\"\",\"\",VLOOKUP(IZ24,Teilnehmer!$A$3:$C$102,2))","v":""},null,null,{"$f":"IF(JC24=\"\",\"\",VLOOKUP(JC24,Teilnehmer!$A$3:$C$102,2))","v":""},null,null,null,{"$f":"IF(JG24=\"\",\"\",VLOOKUP(JG24,Teilnehmer!$A$3:$C$102,2))","v":""},null,null,{"$f":"IF(JJ24=\"\",\"\",VLOOKUP(JJ24,Teilnehmer!$A$3:$C$102,2))","v":""},null,null,null,{"$f":"IF(JN24=\"\",\"\",VLOOKUP(JN24,Teilnehmer!$A$3:$C$102,2))","v":""},null,null,{"$f":"IF(JQ24=\"\",\"\",VLOOKUP(JQ24,Teilnehmer!$A$3:$C$102,2))","v":""},null,null,null,{"$f":"IF(JU24=\"\",\"\",VLOOKUP(JU24,Teilnehmer!$A$3:$C$102,2))","v":""},null,null,{"$f":"IF(JX24=\"\",\"\",VLOOKUP(JX24,Teilnehmer!$A$3:$C$102,2))","v":""},null,null,null,{"$f":"IF(KB24=\"\",\"\",VLOOKUP(KB24,Teilnehmer!$A$3:$C$102,2))","v":""},null,null,{"$f":"IF(KE24=\"\",\"\",VLOOKUP(KE24,Teilnehmer!$A$3:$C$102,2))","v":""},null,null,null,{"$f":"IF(KI24=\"\",\"\",VLOOKUP(KI24,Teilnehmer!$A$3:$C$102,2))","v":""},null,null,{"$f":"IF(KL24=\"\",\"\",VLOOKUP(KL24,Teilnehmer!$A$3:$C$102,2))","v":""},null,null,null,{"$f":"IF(KP24=\"\",\"\",VLOOKUP(KP24,Teilnehmer!$A$3:$C$102,2))","v":""},null,null,{"$f":"IF(KS24=\"\",\"\",VLOOKUP(KS24,Teilnehmer!$A$3:$C$102,2))","v":""}]
[null,{"$f":"IF(A25=\"\",\"\",VLOOKUP(A25,Teilnehmer!$A$3:$C$102,2))","v":""},null,null,{"$f":"IF(D25=\"\",\"\",VLOOKUP(D25,Teilnehmer!$A$3:$C$102,2))","v":""},null,null,null,{"$f":"IF(H25=\"\",\"\",VLOOKUP(H25,Teilnehmer!$A$3:$C$102,2))","v":""},null,null,{"$f":"IF(K25=\"\",\"\",VLOOKUP(K25,Teilnehmer!$A$3:$C$102,2))","v":""},null,null,null,{"$f":"IF(O25=\"\",\"\",VLOOKUP(O25,Teilnehmer!$A$3:$C$102,2))","v":""},null,null,{"$f":"IF(R25=\"\",\"\",VLOOKUP(R25,Teilnehmer!$A$3:$C$102,2))","v":""},null,null,null,{"$f":"IF(V25=\"\",\"\",VLOOKUP(V25,Teilnehmer!$A$3:$C$102,2))","v":""},null,null,{"$f":"IF(Y25=\"\",\"\",VLOOKUP(Y25,Teilnehmer!$A$3:$C$102,2))","v":""},null,null,null,{"$f":"IF(AC25=\"\",\"\",VLOOKUP(AC25,Teilnehmer!$A$3:$C$102,2))","v":""},null,null,{"$f":"IF(AF25=\"\",\"\",VLOOKUP(AF25,Teilnehmer!$A$3:$C$102,2))","v":""},null,null,null,{"$f":"IF(AJ25=\"\",\"\",VLOOKUP(AJ25,Teilnehmer!$A$3:$C$102,2))","v":""},null,null,{"$f":"IF(AM25=\"\",\"\",VLOOKUP(AM25,Teilnehmer!$A$3:$C$102,2))","v":""},null,null,null,{"$f":"IF(AQ25=\"\",\"\",VLOOKUP(AQ25,Teilnehmer!$A$3:$C$102,2))","v":""},null,null,{"$f":"IF(AT25=\"\",\"\",VLOOKUP(AT25,Teilnehmer!$A$3:$C$102,2))","v":""},null,null,null,{"$f":"IF(AX25=\"\",\"\",VLOOKUP(AX25,Teilnehmer!$A$3:$C$102,2))","v":""},null,null,{"$f":"IF(BA25=\"\",\"\",VLOOKUP(BA25,Teilnehmer!$A$3:$C$102,2))","v":""},null,null,null,{"$f":"IF(BE25=\"\",\"\",VLOOKUP(BE25,Teilnehmer!$A$3:$C$102,2))","v":""},null,null,{"$f":"IF(BH25=\"\",\"\",VLOOKUP(BH25,Teilnehmer!$A$3:$C$102,2))","v":""},null,null,null,{"$f":"IF(BL25=\"\",\"\",VLOOKUP(BL25,Teilnehmer!$A$3:$C$102,2))","v":""},null,null,{"$f":"IF(BO25=\"\",\"\",VLOOKUP(BO25,Teilnehmer!$A$3:$C$102,2))","v":""},null,null,null,{"$f":"IF(BS25=\"\",\"\",VLOOKUP(BS25,Teilnehmer!$A$3:$C$102,2))","v":""},null,null,{"$f":"IF(BV25=\"\",\"\",VLOOKUP(BV25,Teilnehmer!$A$3:$C$102,2))","v":""},null,null,null,{"$f":"IF(BZ25=\"\",\"\",VLOOKUP(BZ25,Teilnehmer!$A$3:$C$102,2))","v":""},null,null,{"$f":"IF(CC25=\"\",\"\",VLOOKUP(CC25,Teilnehmer!$A$3:$C$102,2))","v":""},null,null,null,{"$f":"IF(CG25=\"\",\"\",VLOOKUP(CG25,Teilnehmer!$A$3:$C$102,2))","v":""},null,null,{"$f":"IF(CJ25=\"\",\"\",VLOOKUP(CJ25,Teilnehmer!$A$3:$C$102,2))","v":""},null,null,null,{"$f":"IF(CN25=\"\",\"\",VLOOKUP(CN25,Teilnehmer!$A$3:$C$102,2))","v":""},null,null,{"$f":"IF(CQ25=\"\",\"\",VLOOKUP(CQ25,Teilnehmer!$A$3:$C$102,2))","v":""},null,null,null,{"$f":"IF(CU25=\"\",\"\",VLOOKUP(CU25,Teilnehmer!$A$3:$C$102,2))","v":""},null,null,{"$f":"IF(CX25=\"\",\"\",VLOOKUP(CX25,Teilnehmer!$A$3:$C$102,2))","v":""},null,null,null,{"$f":"IF(DB25=\"\",\"\",VLOOKUP(DB25,Teilnehmer!$A$3:$C$102,2))","v":""},null,null,{"$f":"IF(DE25=\"\",\"\",VLOOKUP(DE25,Teilnehmer!$A$3:$C$102,2))","v":""},null,null,null,{"$f":"IF(DI25=\"\",\"\",VLOOKUP(DI25,Teilnehmer!$A$3:$C$102,2))","v":""},null,null,{"$f":"IF(DL25=\"\",\"\",VLOOKUP(DL25,Teilnehmer!$A$3:$C$102,2))","v":""},null,null,null,{"$f":"IF(DP25=\"\",\"\",VLOOKUP(DP25,Teilnehmer!$A$3:$C$102,2))","v":""},null,null,{"$f":"IF(DS25=\"\",\"\",VLOOKUP(DS25,Teilnehmer!$A$3:$C$102,2))","v":""},null,null,null,{"$f":"IF(DW25=\"\",\"\",VLOOKUP(DW25,Teilnehmer!$A$3:$C$102,2))","v":""},null,null,{"$f":"IF(DZ25=\"\",\"\",VLOOKUP(DZ25,Teilnehmer!$A$3:$C$102,2))","v":""},null,null,null,{"$f":"IF(ED25=\"\",\"\",VLOOKUP(ED25,Teilnehmer!$A$3:$C$102,2))","v":""},null,null,{"$f":"IF(EG25=\"\",\"\",VLOOKUP(EG25,Teilnehmer!$A$3:$C$102,2))","v":""},null,null,null,{"$f":"IF(EK25=\"\",\"\",VLOOKUP(EK25,Teilnehmer!$A$3:$C$102,2))","v":""},null,null,{"$f":"IF(EN25=\"\",\"\",VLOOKUP(EN25,Teilnehmer!$A$3:$C$102,2))","v":""},null,null,null,{"$f":"IF(ER25=\"\",\"\",VLOOKUP(ER25,Teilnehmer!$A$3:$C$102,2))","v":""},null,null,{"$f":"IF(EU25=\"\",\"\",VLOOKUP(EU25,Teilnehmer!$A$3:$C$102,2))","v":""},null,null,null,{"$f":"IF(EY25=\"\",\"\",VLOOKUP(EY25,Teilnehmer!$A$3:$C$102,2))","v":""},null,null,{"$f":"IF(FB25=\"\",\"\",VLOOKUP(FB25,Teilnehmer!$A$3:$C$102,2))","v":""},null,null,null,{"$f":"IF(FF25=\"\",\"\",VLOOKUP(FF25,Teilnehmer!$A$3:$C$102,2))","v":""},null,null,{"$f":"IF(FI25=\"\",\"\",VLOOKUP(FI25,Teilnehmer!$A$3:$C$102,2))","v":""},null,null,null,{"$f":"IF(FM25=\"\",\"\",VLOOKUP(FM25,Teilnehmer!$A$3:$C$102,2))","v":""},null,null,{"$f":"IF(FP25=\"\",\"\",VLOOKUP(FP25,Teilnehmer!$A$3:$C$102,2))","v":""},null,null,null,{"$f":"IF(FT25=\"\",\"\",VLOOKUP(FT25,Teilnehmer!$A$3:$C$102,2))","v":""},null,null,{"$f":"IF(FW25=\"\",\"\",VLOOKUP(FW25,Teilnehmer!$A$3:$C$102,2))","v":""},null,null,null,{"$f":"IF(GA25=\"\",\"\",VLOOKUP(GA25,Teilnehmer!$A$3:$C$102,2))","v":""},null,null,{"$f":"IF(GD25=\"\",\"\",VLOOKUP(GD25,Teilnehmer!$A$3:$C$102,2))","v":""},null,null,null,{"$f":"IF(GH25=\"\",\"\",VLOOKUP(GH25,Teilnehmer!$A$3:$C$102,2))","v":""},null,null,{"$f":"IF(GK25=\"\",\"\",VLOOKUP(GK25,Teilnehmer!$A$3:$C$102,2))","v":""},null,null,null,{"$f":"IF(GO25=\"\",\"\",VLOOKUP(GO25,Teilnehmer!$A$3:$C$102,2))","v":""},null,null,{"$f":"IF(GR25=\"\",\"\",VLOOKUP(GR25,Teilnehmer!$A$3:$C$102,2))","v":""},null,null,null,{"$f":"IF(GV25=\"\",\"\",VLOOKUP(GV25,Teilnehmer!$A$3:$C$102,2))","v":""},null,null,{"$f":"IF(GY25=\"\",\"\",VLOOKUP(GY25,Teilnehmer!$A$3:$C$102,2))","v":""},null,null,null,{"$f":"IF(HC25=\"\",\"\",VLOOKUP(HC25,Teilnehmer!$A$3:$C$102,2))","v":""},null,null,{"$f":"IF(HF25=\"\",\"\",VLOOKUP(HF25,Teilnehmer!$A$3:$C$102,2))","v":""},null,null,null,{"$f":"IF(HJ25=\"\",\"\",VLOOKUP(HJ25,Teilnehmer!$A$3:$C$102,2))","v":""},null,null,{"$f":"IF(HM25=\"\",\"\",VLOOKUP(HM25,Teilnehmer!$A$3:$C$102,2))","v":""},null,null,null,{"$f":"IF(HQ25=\"\",\"\",VLOOKUP(HQ25,Teilnehmer!$A$3:$C$102,2))","v":""},null,null,{"$f":"IF(HT25=\"\",\"\",VLOOKUP(HT25,Teilnehmer!$A$3:$C$102,2))","v":""},null,null,null,{"$f":"IF(HX25=\"\",\"\",VLOOKUP(HX25,Teilnehmer!$A$3:$C$102,2))","v":""},null,null,{"$f":"IF(IA25=\"\",\"\",VLOOKUP(IA25,Teilnehmer!$A$3:$C$102,2))","v":""},null,null,null,{"$f":"IF(IE25=\"\",\"\",VLOOKUP(IE25,Teilnehmer!$A$3:$C$102,2))","v":""},null,null,{"$f":"IF(IH25=\"\",\"\",VLOOKUP(IH25,Teilnehmer!$A$3:$C$102,2))","v":""},null,null,null,{"$f":"IF(IL25=\"\",\"\",VLOOKUP(IL25,Teilnehmer!$A$3:$C$102,2))","v":""},null,null,{"$f":"IF(IO25=\"\",\"\",VLOOKUP(IO25,Teilnehmer!$A$3:$C$102,2))","v":""},null,null,null,{"$f":"IF(IS25=\"\",\"\",VLOOKUP(IS25,Teilnehmer!$A$3:$C$102,2))","v":""},null,null,{"$f":"IF(IV25=\"\",\"\",VLOOKUP(IV25,Teilnehmer!$A$3:$C$102,2))","v":""},null,null,null,{"$f":"IF(IZ25=\"\",\"\",VLOOKUP(IZ25,Teilnehmer!$A$3:$C$102,2))","v":""},null,null,{"$f":"IF(JC25=\"\",\"\",VLOOKUP(JC25,Teilnehmer!$A$3:$C$102,2))","v":""},null,null,null,{"$f":"IF(JG25=\"\",\"\",VLOOKUP(JG25,Teilnehmer!$A$3:$C$102,2))","v":""},null,null,{"$f":"IF(JJ25=\"\",\"\",VLOOKUP(JJ25,Teilnehmer!$A$3:$C$102,2))","v":""},null,null,null,{"$f":"IF(JN25=\"\",\"\",VLOOKUP(JN25,Teilnehmer!$A$3:$C$102,2))","v":""},null,null,{"$f":"IF(JQ25=\"\",\"\",VLOOKUP(JQ25,Teilnehmer!$A$3:$C$102,2))","v":""},null,null,null,{"$f":"IF(JU25=\"\",\"\",VLOOKUP(JU25,Teilnehmer!$A$3:$C$102,2))","v":""},null,null,{"$f":"IF(JX25=\"\",\"\",VLOOKUP(JX25,Teilnehmer!$A$3:$C$102,2))","v":""},null,null,null,{"$f":"IF(KB25=\"\",\"\",VLOOKUP(KB25,Teilnehmer!$A$3:$C$102,2))","v":""},null,null,{"$f":"IF(KE25=\"\",\"\",VLOOKUP(KE25,Teilnehmer!$A$3:$C$102,2))","v":""},null,null,null,{"$f":"IF(KI25=\"\",\"\",VLOOKUP(KI25,Teilnehmer!$A$3:$C$102,2))","v":""},null,null,{"$f":"IF(KL25=\"\",\"\",VLOOKUP(KL25,Teilnehmer!$A$3:$C$102,2))","v":""},null,null,null,{"$f":"IF(KP25=\"\",\"\",VLOOKUP(KP25,Teilnehmer!$A$3:$C$102,2))","v":""},null,null,{"$f":"IF(KS25=\"\",\"\",VLOOKUP(KS25,Teilnehmer!$A$3:$C$102,2))","v":""}]
[null,{"$f":"IF(A26=\"\",\"\",VLOOKUP(A26,Teilnehmer!$A$3:$C$102,2))","v":""},null,null,{"$f":"IF(D26=\"\",\"\",VLOOKUP(D26,Teilnehmer!$A$3:$C$102,2))","v":""},null,null,null,{"$f":"IF(H26=\"\",\"\",VLOOKUP(H26,Teilnehmer!$A$3:$C$102,2))","v":""},null,null,{"$f":"IF(K26=\"\",\"\",VLOOKUP(K26,Teilnehmer!$A$3:$C$102,2))","v":""},null,null,null,{"$f":"IF(O26=\"\",\"\",VLOOKUP(O26,Teilnehmer!$A$3:$C$102,2))","v":""},null,null,{"$f":"IF(R26=\"\",\"\",VLOOKUP(R26,Teilnehmer!$A$3:$C$102,2))","v":""},null,null,null,{"$f":"IF(V26=\"\",\"\",VLOOKUP(V26,Teilnehmer!$A$3:$C$102,2))","v":""},null,null,{"$f":"IF(Y26=\"\",\"\",VLOOKUP(Y26,Teilnehmer!$A$3:$C$102,2))","v":""},null,null,null,{"$f":"IF(AC26=\"\",\"\",VLOOKUP(AC26,Teilnehmer!$A$3:$C$102,2))","v":""},null,null,{"$f":"IF(AF26=\"\",\"\",VLOOKUP(AF26,Teilnehmer!$A$3:$C$102,2))","v":""},null,null,null,{"$f":"IF(AJ26=\"\",\"\",VLOOKUP(AJ26,Teilnehmer!$A$3:$C$102,2))","v":""},null,null,{"$f":"IF(AM26=\"\",\"\",VLOOKUP(AM26,Teilnehmer!$A$3:$C$102,2))","v":""},null,null,null,{"$f":"IF(AQ26=\"\",\"\",VLOOKUP(AQ26,Teilnehmer!$A$3:$C$102,2))","v":""},null,null,{"$f":"IF(AT26=\"\",\"\",VLOOKUP(AT26,Teilnehmer!$A$3:$C$102,2))","v":""},null,null,null,{"$f":"IF(AX26=\"\",\"\",VLOOKUP(AX26,Teilnehmer!$A$3:$C$102,2))","v":""},null,null,{"$f":"IF(BA26=\"\",\"\",VLOOKUP(BA26,Teilnehmer!$A$3:$C$102,2))","v":""},null,null,null,{"$f":"IF(BE26=\"\",\"\",VLOOKUP(BE26,Teilnehmer!$A$3:$C$102,2))","v":""},null,null,{"$f":"IF(BH26=\"\",\"\",VLOOKUP(BH26,Teilnehmer!$A$3:$C$102,2))","v":""},null,null,null,{"$f":"IF(BL26=\"\",\"\",VLOOKUP(BL26,Teilnehmer!$A$3:$C$102,2))","v":""},null,null,{"$f":"IF(BO26=\"\",\"\",VLOOKUP(BO26,Teilnehmer!$A$3:$C$102,2))","v":""},null,null,null,{"$f":"IF(BS26=\"\",\"\",VLOOKUP(BS26,Teilnehmer!$A$3:$C$102,2))","v":""},null,null,{"$f":"IF(BV26=\"\",\"\",VLOOKUP(BV26,Teilnehmer!$A$3:$C$102,2))","v":""},null,null,null,{"$f":"IF(BZ26=\"\",\"\",VLOOKUP(BZ26,Teilnehmer!$A$3:$C$102,2))","v":""},null,null,{"$f":"IF(CC26=\"\",\"\",VLOOKUP(CC26,Teilnehmer!$A$3:$C$102,2))","v":""},null,null,null,{"$f":"IF(CG26=\"\",\"\",VLOOKUP(CG26,Teilnehmer!$A$3:$C$102,2))","v":""},null,null,{"$f":"IF(CJ26=\"\",\"\",VLOOKUP(CJ26,Teilnehmer!$A$3:$C$102,2))","v":""},null,null,null,{"$f":"IF(CN26=\"\",\"\",VLOOKUP(CN26,Teilnehmer!$A$3:$C$102,2))","v":""},null,null,{"$f":"IF(CQ26=\"\",\"\",VLOOKUP(CQ26,Teilnehmer!$A$3:$C$102,2))","v":""},null,null,null,{"$f":"IF(CU26=\"\",\"\",VLOOKUP(CU26,Teilnehmer!$A$3:$C$102,2))","v":""},null,null,{"$f":"IF(CX26=\"\",\"\",VLOOKUP(CX26,Teilnehmer!$A$3:$C$102,2))","v":""},null,null,null,{"$f":"IF(DB26=\"\",\"\",VLOOKUP(DB26,Teilnehmer!$A$3:$C$102,2))","v":""},null,null,{"$f":"IF(DE26=\"\",\"\",VLOOKUP(DE26,Teilnehmer!$A$3:$C$102,2))","v":""},null,null,null,{"$f":"IF(DI26=\"\",\"\",VLOOKUP(DI26,Teilnehmer!$A$3:$C$102,2))","v":""},null,null,{"$f":"IF(DL26=\"\",\"\",VLOOKUP(DL26,Teilnehmer!$A$3:$C$102,2))","v":""},null,null,null,{"$f":"IF(DP26=\"\",\"\",VLOOKUP(DP26,Teilnehmer!$A$3:$C$102,2))","v":""},null,null,{"$f":"IF(DS26=\"\",\"\",VLOOKUP(DS26,Teilnehmer!$A$3:$C$102,2))","v":""},null,null,null,{"$f":"IF(DW26=\"\",\"\",VLOOKUP(DW26,Teilnehmer!$A$3:$C$102,2))","v":""},null,null,{"$f":"IF(DZ26=\"\",\"\",VLOOKUP(DZ26,Teilnehmer!$A$3:$C$102,2))","v":""},null,null,null,{"$f":"IF(ED26=\"\",\"\",VLOOKUP(ED26,Teilnehmer!$A$3:$C$102,2))","v":""},null,null,{"$f":"IF(EG26=\"\",\"\",VLOOKUP(EG26,Teilnehmer!$A$3:$C$102,2))","v":""},null,null,null,{"$f":"IF(EK26=\"\",\"\",VLOOKUP(EK26,Teilnehmer!$A$3:$C$102,2))","v":""},null,null,{"$f":"IF(EN26=\"\",\"\",VLOOKUP(EN26,Teilnehmer!$A$3:$C$102,2))","v":""},null,null,null,{"$f":"IF(ER26=\"\",\"\",VLOOKUP(ER26,Teilnehmer!$A$3:$C$102,2))","v":""},null,null,{"$f":"IF(EU26=\"\",\"\",VLOOKUP(EU26,Teilnehmer!$A$3:$C$102,2))","v":""},null,null,null,{"$f":"IF(EY26=\"\",\"\",VLOOKUP(EY26,Teilnehmer!$A$3:$C$102,2))","v":""},null,null,{"$f":"IF(FB26=\"\",\"\",VLOOKUP(FB26,Teilnehmer!$A$3:$C$102,2))","v":""},null,null,null,{"$f":"IF(FF26=\"\",\"\",VLOOKUP(FF26,Teilnehmer!$A$3:$C$102,2))","v":""},null,null,{"$f":"IF(FI26=\"\",\"\",VLOOKUP(FI26,Teilnehmer!$A$3:$C$102,2))","v":""},null,null,null,{"$f":"IF(FM26=\"\",\"\",VLOOKUP(FM26,Teilnehmer!$A$3:$C$102,2))","v":""},null,null,{"$f":"IF(FP26=\"\",\"\",VLOOKUP(FP26,Teilnehmer!$A$3:$C$102,2))","v":""},null,null,null,{"$f":"IF(FT26=\"\",\"\",VLOOKUP(FT26,Teilnehmer!$A$3:$C$102,2))","v":""},null,null,{"$f":"IF(FW26=\"\",\"\",VLOOKUP(FW26,Teilnehmer!$A$3:$C$102,2))","v":""},null,null,null,{"$f":"IF(GA26=\"\",\"\",VLOOKUP(GA26,Teilnehmer!$A$3:$C$102,2))","v":""},null,null,{"$f":"IF(GD26=\"\",\"\",VLOOKUP(GD26,Teilnehmer!$A$3:$C$102,2))","v":""},null,null,null,{"$f":"IF(GH26=\"\",\"\",VLOOKUP(GH26,Teilnehmer!$A$3:$C$102,2))","v":""},null,null,{"$f":"IF(GK26=\"\",\"\",VLOOKUP(GK26,Teilnehmer!$A$3:$C$102,2))","v":""},null,null,null,{"$f":"IF(GO26=\"\",\"\",VLOOKUP(GO26,Teilnehmer!$A$3:$C$102,2))","v":""},null,null,{"$f":"IF(GR26=\"\",\"\",VLOOKUP(GR26,Teilnehmer!$A$3:$C$102,2))","v":""},null,null,null,{"$f":"IF(GV26=\"\",\"\",VLOOKUP(GV26,Teilnehmer!$A$3:$C$102,2))","v":""},null,null,{"$f":"IF(GY26=\"\",\"\",VLOOKUP(GY26,Teilnehmer!$A$3:$C$102,2))","v":""},null,null,null,{"$f":"IF(HC26=\"\",\"\",VLOOKUP(HC26,Teilnehmer!$A$3:$C$102,2))","v":""},null,null,{"$f":"IF(HF26=\"\",\"\",VLOOKUP(HF26,Teilnehmer!$A$3:$C$102,2))","v":""},null,null,null,{"$f":"IF(HJ26=\"\",\"\",VLOOKUP(HJ26,Teilnehmer!$A$3:$C$102,2))","v":""},null,null,{"$f":"IF(HM26=\"\",\"\",VLOOKUP(HM26,Teilnehmer!$A$3:$C$102,2))","v":""},null,null,null,{"$f":"IF(HQ26=\"\",\"\",VLOOKUP(HQ26,Teilnehmer!$A$3:$C$102,2))","v":""},null,null,{"$f":"IF(HT26=\"\",\"\",VLOOKUP(HT26,Teilnehmer!$A$3:$C$102,2))","v":""},null,null,null,{"$f":"IF(HX26=\"\",\"\",VLOOKUP(HX26,Teilnehmer!$A$3:$C$102,2))","v":""},null,null,{"$f":"IF(IA26=\"\",\"\",VLOOKUP(IA26,Teilnehmer!$A$3:$C$102,2))","v":""},null,null,null,{"$f":"IF(IE26=\"\",\"\",VLOOKUP(IE26,Teilnehmer!$A$3:$C$102,2))","v":""},null,null,{"$f":"IF(IH26=\"\",\"\",VLOOKUP(IH26,Teilnehmer!$A$3:$C$102,2))","v":""},null,null,null,{"$f":"IF(IL26=\"\",\"\",VLOOKUP(IL26,Teilnehmer!$A$3:$C$102,2))","v":""},null,null,{"$f":"IF(IO26=\"\",\"\",VLOOKUP(IO26,Teilnehmer!$A$3:$C$102,2))","v":""},null,null,null,{"$f":"IF(IS26=\"\",\"\",VLOOKUP(IS26,Teilnehmer!$A$3:$C$102,2))","v":""},null,null,{"$f":"IF(IV26=\"\",\"\",VLOOKUP(IV26,Teilnehmer!$A$3:$C$102,2))","v":""},null,null,null,{"$f":"IF(IZ26=\"\",\"\",VLOOKUP(IZ26,Teilnehmer!$A$3:$C$102,2))","v":""},null,null,{"$f":"IF(JC26=\"\",\"\",VLOOKUP(JC26,Teilnehmer!$A$3:$C$102,2))","v":""},null,null,null,{"$f":"IF(JG26=\"\",\"\",VLOOKUP(JG26,Teilnehmer!$A$3:$C$102,2))","v":""},null,null,{"$f":"IF(JJ26=\"\",\"\",VLOOKUP(JJ26,Teilnehmer!$A$3:$C$102,2))","v":""},null,null,null,{"$f":"IF(JN26=\"\",\"\",VLOOKUP(JN26,Teilnehmer!$A$3:$C$102,2))","v":""},null,null,{"$f":"IF(JQ26=\"\",\"\",VLOOKUP(JQ26,Teilnehmer!$A$3:$C$102,2))","v":""},null,null,null,{"$f":"IF(JU26=\"\",\"\",VLOOKUP(JU26,Teilnehmer!$A$3:$C$102,2))","v":""},null,null,{"$f":"IF(JX26=\"\",\"\",VLOOKUP(JX26,Teilnehmer!$A$3:$C$102,2))","v":""},null,null,null,{"$f":"IF(KB26=\"\",\"\",VLOOKUP(KB26,Teilnehmer!$A$3:$C$102,2))","v":""},null,null,{"$f":"IF(KE26=\"\",\"\",VLOOKUP(KE26,Teilnehmer!$A$3:$C$102,2))","v":""},null,null,null,{"$f":"IF(KI26=\"\",\"\",VLOOKUP(KI26,Teilnehmer!$A$3:$C$102,2))","v":""},null,null,{"$f":"IF(KL26=\"\",\"\",VLOOKUP(KL26,Teilnehmer!$A$3:$C$102,2))","v":""},null,null,null,{"$f":"IF(KP26=\"\",\"\",VLOOKUP(KP26,Teilnehmer!$A$3:$C$102,2))","v":""},null,null,{"$f":"IF(KS26=\"\",\"\",VLOOKUP(KS26,Teilnehmer!$A$3:$C$102,2))","v":""}]
[null,{"$f":"IF(A27=\"\",\"\",VLOOKUP(A27,Teilnehmer!$A$3:$C$102,2))","v":""},null,null,{"$f":"IF(D27=\"\",\"\",VLOOKUP(D27,Teilnehmer!$A$3:$C$102,2))","v":""},null,null,null,{"$f":"IF(H27=\"\",\"\",VLOOKUP(H27,Teilnehmer!$A$3:$C$102,2))","v":""},null,null,{"$f":"IF(K27=\"\",\"\",VLOOKUP(K27,Teilnehmer!$A$3:$C$102,2))","v":""},null,null,null,{"$f":"IF(O27=\"\",\"\",VLOOKUP(O27,Teilnehmer!$A$3:$C$102,2))","v":""},null,null,{"$f":"IF(R27=\"\",\"\",VLOOKUP(R27,Teilnehmer!$A$3:$C$102,2))","v":""},null,null,null,{"$f":"IF(V27=\"\",\"\",VLOOKUP(V27,Teilnehmer!$A$3:$C$102,2))","v":""},null,null,{"$f":"IF(Y27=\"\",\"\",VLOOKUP(Y27,Teilnehmer!$A$3:$C$102,2))","v":""},null,null,null,{"$f":"IF(AC27=\"\",\"\",VLOOKUP(AC27,Teilnehmer!$A$3:$C$102,2))","v":""},null,null,{"$f":"IF(AF27=\"\",\"\",VLOOKUP(AF27,Teilnehmer!$A$3:$C$102,2))","v":""},null,null,null,{"$f":"IF(AJ27=\"\",\"\",VLOOKUP(AJ27,Teilnehmer!$A$3:$C$102,2))","v":""},null,null,{"$f":"IF(AM27=\"\",\"\",VLOOKUP(AM27,Teilnehmer!$A$3:$C$102,2))","v":""},null,null,null,{"$f":"IF(AQ27=\"\",\"\",VLOOKUP(AQ27,Teilnehmer!$A$3:$C$102,2))","v":""},null,null,{"$f":"IF(AT27=\"\",\"\",VLOOKUP(AT27,Teilnehmer!$A$3:$C$102,2))","v":""},null,null,null,{"$f":"IF(AX27=\"\",\"\",VLOOKUP(AX27,Teilnehmer!$A$3:$C$102,2))","v":""},null,null,{"$f":"IF(BA27=\"\",\"\",VLOOKUP(BA27,Teilnehmer!$A$3:$C$102,2))","v":""},null,null,null,{"$f":"IF(BE27=\"\",\"\",VLOOKUP(BE27,Teilnehmer!$A$3:$C$102,2))","v":""},null,null,{"$f":"IF(BH27=\"\",\"\",VLOOKUP(BH27,Teilnehmer!$A$3:$C$102,2))","v":""},null,null,null,{"$f":"IF(BL27=\"\",\"\",VLOOKUP(BL27,Teilnehmer!$A$3:$C$102,2))","v":""},null,null,{"$f":"IF(BO27=\"\",\"\",VLOOKUP(BO27,Teilnehmer!$A$3:$C$102,2))","v":""},null,null,null,{"$f":"IF(BS27=\"\",\"\",VLOOKUP(BS27,Teilnehmer!$A$3:$C$102,2))","v":""},null,null,{"$f":"IF(BV27=\"\",\"\",VLOOKUP(BV27,Teilnehmer!$A$3:$C$102,2))","v":""},null,null,null,{"$f":"IF(BZ27=\"\",\"\",VLOOKUP(BZ27,Teilnehmer!$A$3:$C$102,2))","v":""},null,null,{"$f":"IF(CC27=\"\",\"\",VLOOKUP(CC27,Teilnehmer!$A$3:$C$102,2))","v":""},null,null,null,{"$f":"IF(CG27=\"\",\"\",VLOOKUP(CG27,Teilnehmer!$A$3:$C$102,2))","v":""},null,null,{"$f":"IF(CJ27=\"\",\"\",VLOOKUP(CJ27,Teilnehmer!$A$3:$C$102,2))","v":""},null,null,null,{"$f":"IF(CN27=\"\",\"\",VLOOKUP(CN27,Teilnehmer!$A$3:$C$102,2))","v":""},null,null,{"$f":"IF(CQ27=\"\",\"\",VLOOKUP(CQ27,Teilnehmer!$A$3:$C$102,2))","v":""},null,null,null,{"$f":"IF(CU27=\"\",\"\",VLOOKUP(CU27,Teilnehmer!$A$3:$C$102,2))","v":""},null,null,{"$f":"IF(CX27=\"\",\"\",VLOOKUP(CX27,Teilnehmer!$A$3:$C$102,2))","v":""},null,null,null,{"$f":"IF(DB27=\"\",\"\",VLOOKUP(DB27,Teilnehmer!$A$3:$C$102,2))","v":""},null,null,{"$f":"IF(DE27=\"\",\"\",VLOOKUP(DE27,Teilnehmer!$A$3:$C$102,2))","v":""},null,null,null,{"$f":"IF(DI27=\"\",\"\",VLOOKUP(DI27,Teilnehmer!$A$3:$C$102,2))","v":""},null,null,{"$f":"IF(DL27=\"\",\"\",VLOOKUP(DL27,Teilnehmer!$A$3:$C$102,2))","v":""},null,null,null,{"$f":"IF(DP27=\"\",\"\",VLOOKUP(DP27,Teilnehmer!$A$3:$C$102,2))","v":""},null,null,{"$f":"IF(DS27=\"\",\"\",VLOOKUP(DS27,Teilnehmer!$A$3:$C$102,2))","v":""},null,null,null,{"$f":"IF(DW27=\"\",\"\",VLOOKUP(DW27,Teilnehmer!$A$3:$C$102,2))","v":""},null,null,{"$f":"IF(DZ27=\"\",\"\",VLOOKUP(DZ27,Teilnehmer!$A$3:$C$102,2))","v":""},null,null,null,{"$f":"IF(ED27=\"\",\"\",VLOOKUP(ED27,Teilnehmer!$A$3:$C$102,2))","v":""},null,null,{"$f":"IF(EG27=\"\",\"\",VLOOKUP(EG27,Teilnehmer!$A$3:$C$102,2))","v":""},null,null,null,{"$f":"IF(EK27=\"\",\"\",VLOOKUP(EK27,Teilnehmer!$A$3:$C$102,2))","v":""},null,null,{"$f":"IF(EN27=\"\",\"\",VLOOKUP(EN27,Teilnehmer!$A$3:$C$102,2))","v":""},null,null,null,{"$f":"IF(ER27=\"\",\"\",VLOOKUP(ER27,Teilnehmer!$A$3:$C$102,2))","v":""},null,null,{"$f":"IF(EU27=\"\",\"\",VLOOKUP(EU27,Teilnehmer!$A$3:$C$102,2))","v":""},null,null,null,{"$f":"IF(EY27=\"\",\"\",VLOOKUP(EY27,Teilnehmer!$A$3:$C$102,2))","v":""},null,null,{"$f":"IF(FB27=\"\",\"\",VLOOKUP(FB27,Teilnehmer!$A$3:$C$102,2))","v":""},null,null,null,{"$f":"IF(FF27=\"\",\"\",VLOOKUP(FF27,Teilnehmer!$A$3:$C$102,2))","v":""},null,null,{"$f":"IF(FI27=\"\",\"\",VLOOKUP(FI27,Teilnehmer!$A$3:$C$102,2))","v":""},null,null,null,{"$f":"IF(FM27=\"\",\"\",VLOOKUP(FM27,Teilnehmer!$A$3:$C$102,2))","v":""},null,null,{"$f":"IF(FP27=\"\",\"\",VLOOKUP(FP27,Teilnehmer!$A$3:$C$102,2))","v":""},null,null,null,{"$f":"IF(FT27=\"\",\"\",VLOOKUP(FT27,Teilnehmer!$A$3:$C$102,2))","v":""},null,null,{"$f":"IF(FW27=\"\",\"\",VLOOKUP(FW27,Teilnehmer!$A$3:$C$102,2))","v":""},null,null,null,{"$f":"IF(GA27=\"\",\"\",VLOOKUP(GA27,Teilnehmer!$A$3:$C$102,2))","v":""},null,null,{"$f":"IF(GD27=\"\",\"\",VLOOKUP(GD27,Teilnehmer!$A$3:$C$102,2))","v":""},null,null,null,{"$f":"IF(GH27=\"\",\"\",VLOOKUP(GH27,Teilnehmer!$A$3:$C$102,2))","v":""},null,null,{"$f":"IF(GK27=\"\",\"\",VLOOKUP(GK27,Teilnehmer!$A$3:$C$102,2))","v":""},null,null,null,{"$f":"IF(GO27=\"\",\"\",VLOOKUP(GO27,Teilnehmer!$A$3:$C$102,2))","v":""},null,null,{"$f":"IF(GR27=\"\",\"\",VLOOKUP(GR27,Teilnehmer!$A$3:$C$102,2))","v":""},null,null,null,{"$f":"IF(GV27=\"\",\"\",VLOOKUP(GV27,Teilnehmer!$A$3:$C$102,2))","v":""},null,null,{"$f":"IF(GY27=\"\",\"\",VLOOKUP(GY27,Teilnehmer!$A$3:$C$102,2))","v":""},null,null,null,{"$f":"IF(HC27=\"\",\"\",VLOOKUP(HC27,Teilnehmer!$A$3:$C$102,2))","v":""},null,null,{"$f":"IF(HF27=\"\",\"\",VLOOKUP(HF27,Teilnehmer!$A$3:$C$102,2))","v":""},null,null,null,{"$f":"IF(HJ27=\"\",\"\",VLOOKUP(HJ27,Teilnehmer!$A$3:$C$102,2))","v":""},null,null,{"$f":"IF(HM27=\"\",\"\",VLOOKUP(HM27,Teilnehmer!$A$3:$C$102,2))","v":""},null,null,null,{"$f":"IF(HQ27=\"\",\"\",VLOOKUP(HQ27,Teilnehmer!$A$3:$C$102,2))","v":""},null,null,{"$f":"IF(HT27=\"\",\"\",VLOOKUP(HT27,Teilnehmer!$A$3:$C$102,2))","v":""},null,null,null,{"$f":"IF(HX27=\"\",\"\",VLOOKUP(HX27,Teilnehmer!$A$3:$C$102,2))","v":""},null,null,{"$f":"IF(IA27=\"\",\"\",VLOOKUP(IA27,Teilnehmer!$A$3:$C$102,2))","v":""},null,null,null,{"$f":"IF(IE27=\"\",\"\",VLOOKUP(IE27,Teilnehmer!$A$3:$C$102,2))","v":""},null,null,{"$f":"IF(IH27=\"\",\"\",VLOOKUP(IH27,Teilnehmer!$A$3:$C$102,2))","v":""},null,null,null,{"$f":"IF(IL27=\"\",\"\",VLOOKUP(IL27,Teilnehmer!$A$3:$C$102,2))","v":""},null,null,{"$f":"IF(IO27=\"\",\"\",VLOOKUP(IO27,Teilnehmer!$A$3:$C$102,2))","v":""},null,null,null,{"$f":"IF(IS27=\"\",\"\",VLOOKUP(IS27,Teilnehmer!$A$3:$C$102,2))","v":""},null,null,{"$f":"IF(IV27=\"\",\"\",VLOOKUP(IV27,Teilnehmer!$A$3:$C$102,2))","v":""},null,null,null,{"$f":"IF(IZ27=\"\",\"\",VLOOKUP(IZ27,Teilnehmer!$A$3:$C$102,2))","v":""},null,null,{"$f":"IF(JC27=\"\",\"\",VLOOKUP(JC27,Teilnehmer!$A$3:$C$102,2))","v":""},null,null,null,{"$f":"IF(JG27=\"\",\"\",VLOOKUP(JG27,Teilnehmer!$A$3:$C$102,2))","v":""},null,null,{"$f":"IF(JJ27=\"\",\"\",VLOOKUP(JJ27,Teilnehmer!$A$3:$C$102,2))","v":""},null,null,null,{"$f":"IF(JN27=\"\",\"\",VLOOKUP(JN27,Teilnehmer!$A$3:$C$102,2))","v":""},null,null,{"$f":"IF(JQ27=\"\",\"\",VLOOKUP(JQ27,Teilnehmer!$A$3:$C$102,2))","v":""},null,null,null,{"$f":"IF(JU27=\"\",\"\",VLOOKUP(JU27,Teilnehmer!$A$3:$C$102,2))","v":""},null,null,{"$f":"IF(JX27=\"\",\"\",VLOOKUP(JX27,Teilnehmer!$A$3:$C$102,2))","v":""},null,null,null,{"$f":"IF(KB27=\"\",\"\",VLOOKUP(KB27,Teilnehmer!$A$3:$C$102,2))","v":""},null,null,{"$f":"IF(KE27=\"\",\"\",VLOOKUP(KE27,Teilnehmer!$A$3:$C$102,2))","v":""},null,null,null,{"$f":"IF(KI27=\"\",\"\",VLOOKUP(KI27,Teilnehmer!$A$3:$C$102,2))","v":""},null,null,{"$f":"IF(KL27=\"\",\"\",VLOOKUP(KL27,Teilnehmer!$A$3:$C$102,2))","v":""},null,null,null,{"$f":"IF(KP27=\"\",\"\",VLOOKUP(KP27,Teilnehmer!$A$3:$C$102,2))","v":""},null,null,{"$f":"IF(KS27=\"\",\"\",VLOOKUP(KS27,Teilnehmer!$A$3:$C$102,2))","v":""}]
[null,{"$f":"IF(A28=\"\",\"\",VLOOKUP(A28,Teilnehmer!$A$3:$C$102,2))","v":""},null,null,{"$f":"IF(D28=\"\",\"\",VLOOKUP(D28,Teilnehmer!$A$3:$C$102,2))","v":""},null,null,null,{"$f":"IF(H28=\"\",\"\",VLOOKUP(H28,Teilnehmer!$A$3:$C$102,2))","v":""},null,null,{"$f":"IF(K28=\"\",\"\",VLOOKUP(K28,Teilnehmer!$A$3:$C$102,2))","v":""},null,null,null,{"$f":"IF(O28=\"\",\"\",VLOOKUP(O28,Teilnehmer!$A$3:$C$102,2))","v":""},null,null,{"$f":"IF(R28=\"\",\"\",VLOOKUP(R28,Teilnehmer!$A$3:$C$102,2))","v":""},null,null,null,{"$f":"IF(V28=\"\",\"\",VLOOKUP(V28,Teilnehmer!$A$3:$C$102,2))","v":""},null,null,{"$f":"IF(Y28=\"\",\"\",VLOOKUP(Y28,Teilnehmer!$A$3:$C$102,2))","v":""},null,null,null,{"$f":"IF(AC28=\"\",\"\",VLOOKUP(AC28,Teilnehmer!$A$3:$C$102,2))","v":""},null,null,{"$f":"IF(AF28=\"\",\"\",VLOOKUP(AF28,Teilnehmer!$A$3:$C$102,2))","v":""},null,null,null,{"$f":"IF(AJ28=\"\",\"\",VLOOKUP(AJ28,Teilnehmer!$A$3:$C$102,2))","v":""},null,null,{"$f":"IF(AM28=\"\",\"\",VLOOKUP(AM28,Teilnehmer!$A$3:$C$102,2))","v":""},null,null,null,{"$f":"IF(AQ28=\"\",\"\",VLOOKUP(AQ28,Teilnehmer!$A$3:$C$102,2))","v":""},null,null,{"$f":"IF(AT28=\"\",\"\",VLOOKUP(AT28,Teilnehmer!$A$3:$C$102,2))","v":""},null,null,null,{"$f":"IF(AX28=\"\",\"\",VLOOKUP(AX28,Teilnehmer!$A$3:$C$102,2))","v":""},null,null,{"$f":"IF(BA28=\"\",\"\",VLOOKUP(BA28,Teilnehmer!$A$3:$C$102,2))","v":""},null,null,null,{"$f":"IF(BE28=\"\",\"\",VLOOKUP(BE28,Teilnehmer!$A$3:$C$102,2))","v":""},null,null,{"$f":"IF(BH28=\"\",\"\",VLOOKUP(BH28,Teilnehmer!$A$3:$C$102,2))","v":""},null,null,null,{"$f":"IF(BL28=\"\",\"\",VLOOKUP(BL28,Teilnehmer!$A$3:$C$102,2))","v":""},null,null,{"$f":"IF(BO28=\"\",\"\",VLOOKUP(BO28,Teilnehmer!$A$3:$C$102,2))","v":""},null,null,null,{"$f":"IF(BS28=\"\",\"\",VLOOKUP(BS28,Teilnehmer!$A$3:$C$102,2))","v":""},null,null,{"$f":"IF(BV28=\"\",\"\",VLOOKUP(BV28,Teilnehmer!$A$3:$C$102,2))","v":""},null,null,null,{"$f":"IF(BZ28=\"\",\"\",VLOOKUP(BZ28,Teilnehmer!$A$3:$C$102,2))","v":""},null,null,{"$f":"IF(CC28=\"\",\"\",VLOOKUP(CC28,Teilnehmer!$A$3:$C$102,2))","v":""},null,null,null,{"$f":"IF(CG28=\"\",\"\",VLOOKUP(CG28,Teilnehmer!$A$3:$C$102,2))","v":""},null,null,{"$f":"IF(CJ28=\"\",\"\",VLOOKUP(CJ28,Teilnehmer!$A$3:$C$102,2))","v":""},null,null,null,{"$f":"IF(CN28=\"\",\"\",VLOOKUP(CN28,Teilnehmer!$A$3:$C$102,2))","v":""},null,null,{"$f":"IF(CQ28=\"\",\"\",VLOOKUP(CQ28,Teilnehmer!$A$3:$C$102,2))","v":""},null,null,null,{"$f":"IF(CU28=\"\",\"\",VLOOKUP(CU28,Teilnehmer!$A$3:$C$102,2))","v":""},null,null,{"$f":"IF(CX28=\"\",\"\",VLOOKUP(CX28,Teilnehmer!$A$3:$C$102,2))","v":""},null,null,null,{"$f":"IF(DB28=\"\",\"\",VLOOKUP(DB28,Teilnehmer!$A$3:$C$102,2))","v":""},null,null,{"$f":"IF(DE28=\"\",\"\",VLOOKUP(DE28,Teilnehmer!$A$3:$C$102,2))","v":""},null,null,null,{"$f":"IF(DI28=\"\",\"\",VLOOKUP(DI28,Teilnehmer!$A$3:$C$102,2))","v":""},null,null,{"$f":"IF(DL28=\"\",\"\",VLOOKUP(DL28,Teilnehmer!$A$3:$C$102,2))","v":""},null,null,null,{"$f":"IF(DP28=\"\",\"\",VLOOKUP(DP28,Teilnehmer!$A$3:$C$102,2))","v":""},null,null,{"$f":"IF(DS28=\"\",\"\",VLOOKUP(DS28,Teilnehmer!$A$3:$C$102,2))","v":""},null,null,null,{"$f":"IF(DW28=\"\",\"\",VLOOKUP(DW28,Teilnehmer!$A$3:$C$102,2))","v":""},null,null,{"$f":"IF(DZ28=\"\",\"\",VLOOKUP(DZ28,Teilnehmer!$A$3:$C$102,2))","v":""},null,null,null,{"$f":"IF(ED28=\"\",\"\",VLOOKUP(ED28,Teilnehmer!$A$3:$C$102,2))","v":""},null,null,{"$f":"IF(EG28=\"\",\"\",VLOOKUP(EG28,Teilnehmer!$A$3:$C$102,2))","v":""},null,null,null,{"$f":"IF(EK28=\"\",\"\",VLOOKUP(EK28,Teilnehmer!$A$3:$C$102,2))","v":""},null,null,{"$f":"IF(EN28=\"\",\"\",VLOOKUP(EN28,Teilnehmer!$A$3:$C$102,2))","v":""},null,null,null,{"$f":"IF(ER28=\"\",\"\",VLOOKUP(ER28,Teilnehmer!$A$3:$C$102,2))","v":""},null,null,{"$f":"IF(EU28=\"\",\"\",VLOOKUP(EU28,Teilnehmer!$A$3:$C$102,2))","v":""},null,null,null,{"$f":"IF(EY28=\"\",\"\",VLOOKUP(EY28,Teilnehmer!$A$3:$C$102,2))","v":""},null,null,{"$f":"IF(FB28=\"\",\"\",VLOOKUP(FB28,Teilnehmer!$A$3:$C$102,2))","v":""},null,null,null,{"$f":"IF(FF28=\"\",\"\",VLOOKUP(FF28,Teilnehmer!$A$3:$C$102,2))","v":""},null,null,{"$f":"IF(FI28=\"\",\"\",VLOOKUP(FI28,Teilnehmer!$A$3:$C$102,2))","v":""},null,null,null,{"$f":"IF(FM28=\"\",\"\",VLOOKUP(FM28,Teilnehmer!$A$3:$C$102,2))","v":""},null,null,{"$f":"IF(FP28=\"\",\"\",VLOOKUP(FP28,Teilnehmer!$A$3:$C$102,2))","v":""},null,null,null,{"$f":"IF(FT28=\"\",\"\",VLOOKUP(FT28,Teilnehmer!$A$3:$C$102,2))","v":""},null,null,{"$f":"IF(FW28=\"\",\"\",VLOOKUP(FW28,Teilnehmer!$A$3:$C$102,2))","v":""},null,null,null,{"$f":"IF(GA28=\"\",\"\",VLOOKUP(GA28,Teilnehmer!$A$3:$C$102,2))","v":""},null,null,{"$f":"IF(GD28=\"\",\"\",VLOOKUP(GD28,Teilnehmer!$A$3:$C$102,2))","v":""},null,null,null,{"$f":"IF(GH28=\"\",\"\",VLOOKUP(GH28,Teilnehmer!$A$3:$C$102,2))","v":""},null,null,{"$f":"IF(GK28=\"\",\"\",VLOOKUP(GK28,Teilnehmer!$A$3:$C$102,2))","v":""},null,null,null,{"$f":"IF(GO28=\"\",\"\",VLOOKUP(GO28,Teilnehmer!$A$3:$C$102,2))","v":""},null,null,{"$f":"IF(GR28=\"\",\"\",VLOOKUP(GR28,Teilnehmer!$A$3:$C$102,2))","v":""},null,null,null,{"$f":"IF(GV28=\"\",\"\",VLOOKUP(GV28,Teilnehmer!$A$3:$C$102,2))","v":""},null,null,{"$f":"IF(GY28=\"\",\"\",VLOOKUP(GY28,Teilnehmer!$A$3:$C$102,2))","v":""},null,null,null,{"$f":"IF(HC28=\"\",\"\",VLOOKUP(HC28,Teilnehmer!$A$3:$C$102,2))","v":""},null,null,{"$f":"IF(HF28=\"\",\"\",VLOOKUP(HF28,Teilnehmer!$A$3:$C$102,2))","v":""},null,null,null,{"$f":"IF(HJ28=\"\",\"\",VLOOKUP(HJ28,Teilnehmer!$A$3:$C$102,2))","v":""},null,null,{"$f":"IF(HM28=\"\",\"\",VLOOKUP(HM28,Teilnehmer!$A$3:$C$102,2))","v":""},null,null,null,{"$f":"IF(HQ28=\"\",\"\",VLOOKUP(HQ28,Teilnehmer!$A$3:$C$102,2))","v":""},null,null,{"$f":"IF(HT28=\"\",\"\",VLOOKUP(HT28,Teilnehmer!$A$3:$C$102,2))","v":""},null,null,null,{"$f":"IF(HX28=\"\",\"\",VLOOKUP(HX28,Teilnehmer!$A$3:$C$102,2))","v":""},null,null,{"$f":"IF(IA28=\"\",\"\",VLOOKUP(IA28,Teilnehmer!$A$3:$C$102,2))","v":""},null,null,null,{"$f":"IF(IE28=\"\",\"\",VLOOKUP(IE28,Teilnehmer!$A$3:$C$102,2))","v":""},null,null,{"$f":"IF(IH28=\"\",\"\",VLOOKUP(IH28,Teilnehmer!$A$3:$C$102,2))","v":""},null,null,null,{"$f":"IF(IL28=\"\",\"\",VLOOKUP(IL28,Teilnehmer!$A$3:$C$102,2))","v":""},null,null,{"$f":"IF(IO28=\"\",\"\",VLOOKUP(IO28,Teilnehmer!$A$3:$C$102,2))","v":""},null,null,null,{"$f":"IF(IS28=\"\",\"\",VLOOKUP(IS28,Teilnehmer!$A$3:$C$102,2))","v":""},null,null,{"$f":"IF(IV28=\"\",\"\",VLOOKUP(IV28,Teilnehmer!$A$3:$C$102,2))","v":""},null,null,null,{"$f":"IF(IZ28=\"\",\"\",VLOOKUP(IZ28,Teilnehmer!$A$3:$C$102,2))","v":""},null,null,{"$f":"IF(JC28=\"\",\"\",VLOOKUP(JC28,Teilnehmer!$A$3:$C$102,2))","v":""},null,null,null,{"$f":"IF(JG28=\"\",\"\",VLOOKUP(JG28,Teilnehmer!$A$3:$C$102,2))","v":""},null,null,{"$f":"IF(JJ28=\"\",\"\",VLOOKUP(JJ28,Teilnehmer!$A$3:$C$102,2))","v":""},null,null,null,{"$f":"IF(JN28=\"\",\"\",VLOOKUP(JN28,Teilnehmer!$A$3:$C$102,2))","v":""},null,null,{"$f":"IF(JQ28=\"\",\"\",VLOOKUP(JQ28,Teilnehmer!$A$3:$C$102,2))","v":""},null,null,null,{"$f":"IF(JU28=\"\",\"\",VLOOKUP(JU28,Teilnehmer!$A$3:$C$102,2))","v":""},null,null,{"$f":"IF(JX28=\"\",\"\",VLOOKUP(JX28,Teilnehmer!$A$3:$C$102,2))","v":""},null,null,null,{"$f":"IF(KB28=\"\",\"\",VLOOKUP(KB28,Teilnehmer!$A$3:$C$102,2))","v":""},null,null,{"$f":"IF(KE28=\"\",\"\",VLOOKUP(KE28,Teilnehmer!$A$3:$C$102,2))","v":""},null,null,null,{"$f":"IF(KI28=\"\",\"\",VLOOKUP(KI28,Teilnehmer!$A$3:$C$102,2))","v":""},null,null,{"$f":"IF(KL28=\"\",\"\",VLOOKUP(KL28,Teilnehmer!$A$3:$C$102,2))","v":""},null,null,null,{"$f":"IF(KP28=\"\",\"\",VLOOKUP(KP28,Teilnehmer!$A$3:$C$102,2))","v":""},null,null,{"$f":"IF(KS28=\"\",\"\",VLOOKUP(KS28,Teilnehmer!$A$3:$C$102,2))","v":""}]
[null,{"$f":"IF(A29=\"\",\"\",VLOOKUP(A29,Teilnehmer!$A$3:$C$102,2))","v":""},null,null,{"$f":"IF(D29=\"\",\"\",VLOOKUP(D29,Teilnehmer!$A$3:$C$102,2))","v":""},null,null,null,{"$f":"IF(H29=\"\",\"\",VLOOKUP(H29,Teilnehmer!$A$3:$C$102,2))","v":""},null,null,{"$f":"IF(K29=\"\",\"\",VLOOKUP(K29,Teilnehmer!$A$3:$C$102,2))","v":""},null,null,null,{"$f":"IF(O29=\"\",\"\",VLOOKUP(O29,Teilnehmer!$A$3:$C$102,2))","v":""},null,null,{"$f":"IF(R29=\"\",\"\",VLOOKUP(R29,Teilnehmer!$A$3:$C$102,2))","v":""},null,null,null,{"$f":"IF(V29=\"\",\"\",VLOOKUP(V29,Teilnehmer!$A$3:$C$102,2))","v":""},null,null,{"$f":"IF(Y29=\"\",\"\",VLOOKUP(Y29,Teilnehmer!$A$3:$C$102,2))","v":""},null,null,null,{"$f":"IF(AC29=\"\",\"\",VLOOKUP(AC29,Teilnehmer!$A$3:$C$102,2))","v":""},null,null,{"$f":"IF(AF29=\"\",\"\",VLOOKUP(AF29,Teilnehmer!$A$3:$C$102,2))","v":""},null,null,null,{"$f":"IF(AJ29=\"\",\"\",VLOOKUP(AJ29,Teilnehmer!$A$3:$C$102,2))","v":""},null,null,{"$f":"IF(AM29=\"\",\"\",VLOOKUP(AM29,Teilnehmer!$A$3:$C$102,2))","v":""},null,null,null,{"$f":"IF(AQ29=\"\",\"\",VLOOKUP(AQ29,Teilnehmer!$A$3:$C$102,2))","v":""},null,null,{"$f":"IF(AT29=\"\",\"\",VLOOKUP(AT29,Teilnehmer!$A$3:$C$102,2))","v":""},null,null,null,{"$f":"IF(AX29=\"\",\"\",VLOOKUP(AX29,Teilnehmer!$A$3:$C$102,2))","v":""},null,null,{"$f":"IF(BA29=\"\",\"\",VLOOKUP(BA29,Teilnehmer!$A$3:$C$102,2))","v":""},null,null,null,{"$f":"IF(BE29=\"\",\"\",VLOOKUP(BE29,Teilnehmer!$A$3:$C$102,2))","v":""},null,null,{"$f":"IF(BH29=\"\",\"\",VLOOKUP(BH29,Teilnehmer!$A$3:$C$102,2))","v":""},null,null,null,{"$f":"IF(BL29=\"\",\"\",VLOOKUP(BL29,Teilnehmer!$A$3:$C$102,2))","v":""},null,null,{"$f":"IF(BO29=\"\",\"\",VLOOKUP(BO29,Teilnehmer!$A$3:$C$102,2))","v":""},null,null,null,{"$f":"IF(BS29=\"\",\"\",VLOOKUP(BS29,Teilnehmer!$A$3:$C$102,2))","v":""},null,null,{"$f":"IF(BV29=\"\",\"\",VLOOKUP(BV29,Teilnehmer!$A$3:$C$102,2))","v":""},null,null,null,{"$f":"IF(BZ29=\"\",\"\",VLOOKUP(BZ29,Teilnehmer!$A$3:$C$102,2))","v":""},null,null,{"$f":"IF(CC29=\"\",\"\",VLOOKUP(CC29,Teilnehmer!$A$3:$C$102,2))","v":""},null,null,null,{"$f":"IF(CG29=\"\",\"\",VLOOKUP(CG29,Teilnehmer!$A$3:$C$102,2))","v":""},null,null,{"$f":"IF(CJ29=\"\",\"\",VLOOKUP(CJ29,Teilnehmer!$A$3:$C$102,2))","v":""},null,null,null,{"$f":"IF(CN29=\"\",\"\",VLOOKUP(CN29,Teilnehmer!$A$3:$C$102,2))","v":""},null,null,{"$f":"IF(CQ29=\"\",\"\",VLOOKUP(CQ29,Teilnehmer!$A$3:$C$102,2))","v":""},null,null,null,{"$f":"IF(CU29=\"\",\"\",VLOOKUP(CU29,Teilnehmer!$A$3:$C$102,2))","v":""},null,null,{"$f":"IF(CX29=\"\",\"\",VLOOKUP(CX29,Teilnehmer!$A$3:$C$102,2))","v":""},null,null,null,{"$f":"IF(DB29=\"\",\"\",VLOOKUP(DB29,Teilnehmer!$A$3:$C$102,2))","v":""},null,null,{"$f":"IF(DE29=\"\",\"\",VLOOKUP(DE29,Teilnehmer!$A$3:$C$102,2))","v":""},null,null,null,{"$f":"IF(DI29=\"\",\"\",VLOOKUP(DI29,Teilnehmer!$A$3:$C$102,2))","v":""},null,null,{"$f":"IF(DL29=\"\",\"\",VLOOKUP(DL29,Teilnehmer!$A$3:$C$102,2))","v":""},null,null,null,{"$f":"IF(DP29=\"\",\"\",VLOOKUP(DP29,Teilnehmer!$A$3:$C$102,2))","v":""},null,null,{"$f":"IF(DS29=\"\",\"\",VLOOKUP(DS29,Teilnehmer!$A$3:$C$102,2))","v":""},null,null,null,{"$f":"IF(DW29=\"\",\"\",VLOOKUP(DW29,Teilnehmer!$A$3:$C$102,2))","v":""},null,null,{"$f":"IF(DZ29=\"\",\"\",VLOOKUP(DZ29,Teilnehmer!$A$3:$C$102,2))","v":""},null,null,null,{"$f":"IF(ED29=\"\",\"\",VLOOKUP(ED29,Teilnehmer!$A$3:$C$102,2))","v":""},null,null,{"$f":"IF(EG29=\"\",\"\",VLOOKUP(EG29,Teilnehmer!$A$3:$C$102,2))","v":""},null,null,null,{"$f":"IF(EK29=\"\",\"\",VLOOKUP(EK29,Teilnehmer!$A$3:$C$102,2))","v":""},null,null,{"$f":"IF(EN29=\"\",\"\",VLOOKUP(EN29,Teilnehmer!$A$3:$C$102,2))","v":""},null,null,null,{"$f":"IF(ER29=\"\",\"\",VLOOKUP(ER29,Teilnehmer!$A$3:$C$102,2))","v":""},null,null,{"$f":"IF(EU29=\"\",\"\",VLOOKUP(EU29,Teilnehmer!$A$3:$C$102,2))","v":""},null,null,null,{"$f":"IF(EY29=\"\",\"\",VLOOKUP(EY29,Teilnehmer!$A$3:$C$102,2))","v":""},null,null,{"$f":"IF(FB29=\"\",\"\",VLOOKUP(FB29,Teilnehmer!$A$3:$C$102,2))","v":""},null,null,null,{"$f":"IF(FF29=\"\",\"\",VLOOKUP(FF29,Teilnehmer!$A$3:$C$102,2))","v":""},null,null,{"$f":"IF(FI29=\"\",\"\",VLOOKUP(FI29,Teilnehmer!$A$3:$C$102,2))","v":""},null,null,null,{"$f":"IF(FM29=\"\",\"\",VLOOKUP(FM29,Teilnehmer!$A$3:$C$102,2))","v":""},null,null,{"$f":"IF(FP29=\"\",\"\",VLOOKUP(FP29,Teilnehmer!$A$3:$C$102,2))","v":""},null,null,null,{"$f":"IF(FT29=\"\",\"\",VLOOKUP(FT29,Teilnehmer!$A$3:$C$102,2))","v":""},null,null,{"$f":"IF(FW29=\"\",\"\",VLOOKUP(FW29,Teilnehmer!$A$3:$C$102,2))","v":""},null,null,null,{"$f":"IF(GA29=\"\",\"\",VLOOKUP(GA29,Teilnehmer!$A$3:$C$102,2))","v":""},null,null,{"$f":"IF(GD29=\"\",\"\",VLOOKUP(GD29,Teilnehmer!$A$3:$C$102,2))","v":""},null,null,null,{"$f":"IF(GH29=\"\",\"\",VLOOKUP(GH29,Teilnehmer!$A$3:$C$102,2))","v":""},null,null,{"$f":"IF(GK29=\"\",\"\",VLOOKUP(GK29,Teilnehmer!$A$3:$C$102,2))","v":""},null,null,null,{"$f":"IF(GO29=\"\",\"\",VLOOKUP(GO29,Teilnehmer!$A$3:$C$102,2))","v":""},null,null,{"$f":"IF(GR29=\"\",\"\",VLOOKUP(GR29,Teilnehmer!$A$3:$C$102,2))","v":""},null,null,null,{"$f":"IF(GV29=\"\",\"\",VLOOKUP(GV29,Teilnehmer!$A$3:$C$102,2))","v":""},null,null,{"$f":"IF(GY29=\"\",\"\",VLOOKUP(GY29,Teilnehmer!$A$3:$C$102,2))","v":""},null,null,null,{"$f":"IF(HC29=\"\",\"\",VLOOKUP(HC29,Teilnehmer!$A$3:$C$102,2))","v":""},null,null,{"$f":"IF(HF29=\"\",\"\",VLOOKUP(HF29,Teilnehmer!$A$3:$C$102,2))","v":""},null,null,null,{"$f":"IF(HJ29=\"\",\"\",VLOOKUP(HJ29,Teilnehmer!$A$3:$C$102,2))","v":""},null,null,{"$f":"IF(HM29=\"\",\"\",VLOOKUP(HM29,Teilnehmer!$A$3:$C$102,2))","v":""},null,null,null,{"$f":"IF(HQ29=\"\",\"\",VLOOKUP(HQ29,Teilnehmer!$A$3:$C$102,2))","v":""},null,null,{"$f":"IF(HT29=\"\",\"\",VLOOKUP(HT29,Teilnehmer!$A$3:$C$102,2))","v":""},null,null,null,{"$f":"IF(HX29=\"\",\"\",VLOOKUP(HX29,Teilnehmer!$A$3:$C$102,2))","v":""},null,null,{"$f":"IF(IA29=\"\",\"\",VLOOKUP(IA29,Teilnehmer!$A$3:$C$102,2))","v":""},null,null,null,{"$f":"IF(IE29=\"\",\"\",VLOOKUP(IE29,Teilnehmer!$A$3:$C$102,2))","v":""},null,null,{"$f":"IF(IH29=\"\",\"\",VLOOKUP(IH29,Teilnehmer!$A$3:$C$102,2))","v":""},null,null,null,{"$f":"IF(IL29=\"\",\"\",VLOOKUP(IL29,Teilnehmer!$A$3:$C$102,2))","v":""},null,null,{"$f":"IF(IO29=\"\",\"\",VLOOKUP(IO29,Teilnehmer!$A$3:$C$102,2))","v":""},null,null,null,{"$f":"IF(IS29=\"\",\"\",VLOOKUP(IS29,Teilnehmer!$A$3:$C$102,2))","v":""},null,null,{"$f":"IF(IV29=\"\",\"\",VLOOKUP(IV29,Teilnehmer!$A$3:$C$102,2))","v":""},null,null,null,{"$f":"IF(IZ29=\"\",\"\",VLOOKUP(IZ29,Teilnehmer!$A$3:$C$102,2))","v":""},null,null,{"$f":"IF(JC29=\"\",\"\",VLOOKUP(JC29,Teilnehmer!$A$3:$C$102,2))","v":""},null,null,null,{"$f":"IF(JG29=\"\",\"\",VLOOKUP(JG29,Teilnehmer!$A$3:$C$102,2))","v":""},null,null,{"$f":"IF(JJ29=\"\",\"\",VLOOKUP(JJ29,Teilnehmer!$A$3:$C$102,2))","v":""},null,null,null,{"$f":"IF(JN29=\"\",\"\",VLOOKUP(JN29,Teilnehmer!$A$3:$C$102,2))","v":""},null,null,{"$f":"IF(JQ29=\"\",\"\",VLOOKUP(JQ29,Teilnehmer!$A$3:$C$102,2))","v":""},null,null,null,{"$f":"IF(JU29=\"\",\"\",VLOOKUP(JU29,Teilnehmer!$A$3:$C$102,2))","v":""},null,null,{"$f":"IF(JX29=\"\",\"\",VLOOKUP(JX29,Teilnehmer!$A$3:$C$102,2))","v":""},null,null,null,{"$f":"IF(KB29=\"\",\"\",VLOOKUP(KB29,Teilnehmer!$A$3:$C$102,2))","v":""},null,null,{"$f":"IF(KE29=\"\",\"\",VLOOKUP(KE29,Teilnehmer!$A$3:$C$102,2))","v":""},null,null,null,{"$f":"IF(KI29=\"\",\"\",VLOOKUP(KI29,Teilnehmer!$A$3:$C$102,2))","v":""},null,null,{"$f":"IF(KL29=\"\",\"\",VLOOKUP(KL29,Teilnehmer!$A$3:$C$102,2))","v":""},null,null,null,{"$f":"IF(KP29=\"\",\"\",VLOOKUP(KP29,Teilnehmer!$A$3:$C$102,2))","v":""},null,null,{"$f":"IF(KS29=\"\",\"\",VLOOKUP(KS29,Teilnehmer!$A$3:$C$102,2))","v":""}]
[null,{"$f":"IF(A30=\"\",\"\",VLOOKUP(A30,Teilnehmer!$A$3:$C$102,2))","v":""},null,null,{"$f":"IF(D30=\"\",\"\",VLOOKUP(D30,Teilnehmer!$A$3:$C$102,2))","v":""},null,null,null,{"$f":"IF(H30=\"\",\"\",VLOOKUP(H30,Teilnehmer!$A$3:$C$102,2))","v":""},null,null,{"$f":"IF(K30=\"\",\"\",VLOOKUP(K30,Teilnehmer!$A$3:$C$102,2))","v":""},null,null,null,{"$f":"IF(O30=\"\",\"\",VLOOKUP(O30,Teilnehmer!$A$3:$C$102,2))","v":""},null,null,{"$f":"IF(R30=\"\",\"\",VLOOKUP(R30,Teilnehmer!$A$3:$C$102,2))","v":""},null,null,null,{"$f":"IF(V30=\"\",\"\",VLOOKUP(V30,Teilnehmer!$A$3:$C$102,2))","v":""},null,null,{"$f":"IF(Y30=\"\",\"\",VLOOKUP(Y30,Teilnehmer!$A$3:$C$102,2))","v":""},null,null,null,{"$f":"IF(AC30=\"\",\"\",VLOOKUP(AC30,Teilnehmer!$A$3:$C$102,2))","v":""},null,null,{"$f":"IF(AF30=\"\",\"\",VLOOKUP(AF30,Teilnehmer!$A$3:$C$102,2))","v":""},null,null,null,{"$f":"IF(AJ30=\"\",\"\",VLOOKUP(AJ30,Teilnehmer!$A$3:$C$102,2))","v":""},null,null,{"$f":"IF(AM30=\"\",\"\",VLOOKUP(AM30,Teilnehmer!$A$3:$C$102,2))","v":""},null,null,null,{"$f":"IF(AQ30=\"\",\"\",VLOOKUP(AQ30,Teilnehmer!$A$3:$C$102,2))","v":""},null,null,{"$f":"IF(AT30=\"\",\"\",VLOOKUP(AT30,Teilnehmer!$A$3:$C$102,2))","v":""},null,null,null,{"$f":"IF(AX30=\"\",\"\",VLOOKUP(AX30,Teilnehmer!$A$3:$C$102,2))","v":""},null,null,{"$f":"IF(BA30=\"\",\"\",VLOOKUP(BA30,Teilnehmer!$A$3:$C$102,2))","v":""},null,null,null,{"$f":"IF(BE30=\"\",\"\",VLOOKUP(BE30,Teilnehmer!$A$3:$C$102,2))","v":""},null,null,{"$f":"IF(BH30=\"\",\"\",VLOOKUP(BH30,Teilnehmer!$A$3:$C$102,2))","v":""},null,null,null,{"$f":"IF(BL30=\"\",\"\",VLOOKUP(BL30,Teilnehmer!$A$3:$C$102,2))","v":""},null,null,{"$f":"IF(BO30=\"\",\"\",VLOOKUP(BO30,Teilnehmer!$A$3:$C$102,2))","v":""},null,null,null,{"$f":"IF(BS30=\"\",\"\",VLOOKUP(BS30,Teilnehmer!$A$3:$C$102,2))","v":""},null,null,{"$f":"IF(BV30=\"\",\"\",VLOOKUP(BV30,Teilnehmer!$A$3:$C$102,2))","v":""},null,null,null,{"$f":"IF(BZ30=\"\",\"\",VLOOKUP(BZ30,Teilnehmer!$A$3:$C$102,2))","v":""},null,null,{"$f":"IF(CC30=\"\",\"\",VLOOKUP(CC30,Teilnehmer!$A$3:$C$102,2))","v":""},null,null,null,{"$f":"IF(CG30=\"\",\"\",VLOOKUP(CG30,Teilnehmer!$A$3:$C$102,2))","v":""},null,null,{"$f":"IF(CJ30=\"\",\"\",VLOOKUP(CJ30,Teilnehmer!$A$3:$C$102,2))","v":""},null,null,null,{"$f":"IF(CN30=\"\",\"\",VLOOKUP(CN30,Teilnehmer!$A$3:$C$102,2))","v":""},null,null,{"$f":"IF(CQ30=\"\",\"\",VLOOKUP(CQ30,Teilnehmer!$A$3:$C$102,2))","v":""},null,null,null,{"$f":"IF(CU30=\"\",\"\",VLOOKUP(CU30,Teilnehmer!$A$3:$C$102,2))","v":""},null,null,{"$f":"IF(CX30=\"\",\"\",VLOOKUP(CX30,Teilnehmer!$A$3:$C$102,2))","v":""},null,null,null,{"$f":"IF(DB30=\"\",\"\",VLOOKUP(DB30,Teilnehmer!$A$3:$C$102,2))","v":""},null,null,{"$f":"IF(DE30=\"\",\"\",VLOOKUP(DE30,Teilnehmer!$A$3:$C$102,2))","v":""},null,null,null,{"$f":"IF(DI30=\"\",\"\",VLOOKUP(DI30,Teilnehmer!$A$3:$C$102,2))","v":""},null,null,{"$f":"IF(DL30=\"\",\"\",VLOOKUP(DL30,Teilnehmer!$A$3:$C$102,2))","v":""},null,null,null,{"$f":"IF(DP30=\"\",\"\",VLOOKUP(DP30,Teilnehmer!$A$3:$C$102,2))","v":""},null,null,{"$f":"IF(DS30=\"\",\"\",VLOOKUP(DS30,Teilnehmer!$A$3:$C$102,2))","v":""},null,null,null,{"$f":"IF(DW30=\"\",\"\",VLOOKUP(DW30,Teilnehmer!$A$3:$C$102,2))","v":""},null,null,{"$f":"IF(DZ30=\"\",\"\",VLOOKUP(DZ30,Teilnehmer!$A$3:$C$102,2))","v":""},null,null,null,{"$f":"IF(ED30=\"\",\"\",VLOOKUP(ED30,Teilnehmer!$A$3:$C$102,2))","v":""},null,null,{"$f":"IF(EG30=\"\",\"\",VLOOKUP(EG30,Teilnehmer!$A$3:$C$102,2))","v":""},null,null,null,{"$f":"IF(EK30=\"\",\"\",VLOOKUP(EK30,Teilnehmer!$A$3:$C$102,2))","v":""},null,null,{"$f":"IF(EN30=\"\",\"\",VLOOKUP(EN30,Teilnehmer!$A$3:$C$102,2))","v":""},null,null,null,{"$f":"IF(ER30=\"\",\"\",VLOOKUP(ER30,Teilnehmer!$A$3:$C$102,2))","v":""},null,null,{"$f":"IF(EU30=\"\",\"\",VLOOKUP(EU30,Teilnehmer!$A$3:$C$102,2))","v":""},null,null,null,{"$f":"IF(EY30=\"\",\"\",VLOOKUP(EY30,Teilnehmer!$A$3:$C$102,2))","v":""},null,null,{"$f":"IF(FB30=\"\",\"\",VLOOKUP(FB30,Teilnehmer!$A$3:$C$102,2))","v":""},null,null,null,{"$f":"IF(FF30=\"\",\"\",VLOOKUP(FF30,Teilnehmer!$A$3:$C$102,2))","v":""},null,null,{"$f":"IF(FI30=\"\",\"\",VLOOKUP(FI30,Teilnehmer!$A$3:$C$102,2))","v":""},null,null,null,{"$f":"IF(FM30=\"\",\"\",VLOOKUP(FM30,Teilnehmer!$A$3:$C$102,2))","v":""},null,null,{"$f":"IF(FP30=\"\",\"\",VLOOKUP(FP30,Teilnehmer!$A$3:$C$102,2))","v":""},null,null,null,{"$f":"IF(FT30=\"\",\"\",VLOOKUP(FT30,Teilnehmer!$A$3:$C$102,2))","v":""},null,null,{"$f":"IF(FW30=\"\",\"\",VLOOKUP(FW30,Teilnehmer!$A$3:$C$102,2))","v":""},null,null,null,{"$f":"IF(GA30=\"\",\"\",VLOOKUP(GA30,Teilnehmer!$A$3:$C$102,2))","v":""},null,null,{"$f":"IF(GD30=\"\",\"\",VLOOKUP(GD30,Teilnehmer!$A$3:$C$102,2))","v":""},null,null,null,{"$f":"IF(GH30=\"\",\"\",VLOOKUP(GH30,Teilnehmer!$A$3:$C$102,2))","v":""},null,null,{"$f":"IF(GK30=\"\",\"\",VLOOKUP(GK30,Teilnehmer!$A$3:$C$102,2))","v":""},null,null,null,{"$f":"IF(GO30=\"\",\"\",VLOOKUP(GO30,Teilnehmer!$A$3:$C$102,2))","v":""},null,null,{"$f":"IF(GR30=\"\",\"\",VLOOKUP(GR30,Teilnehmer!$A$3:$C$102,2))","v":""},null,null,null,{"$f":"IF(GV30=\"\",\"\",VLOOKUP(GV30,Teilnehmer!$A$3:$C$102,2))","v":""},null,null,{"$f":"IF(GY30=\"\",\"\",VLOOKUP(GY30,Teilnehmer!$A$3:$C$102,2))","v":""},null,null,null,{"$f":"IF(HC30=\"\",\"\",VLOOKUP(HC30,Teilnehmer!$A$3:$C$102,2))","v":""},null,null,{"$f":"IF(HF30=\"\",\"\",VLOOKUP(HF30,Teilnehmer!$A$3:$C$102,2))","v":""},null,null,null,{"$f":"IF(HJ30=\"\",\"\",VLOOKUP(HJ30,Teilnehmer!$A$3:$C$102,2))","v":""},null,null,{"$f":"IF(HM30=\"\",\"\",VLOOKUP(HM30,Teilnehmer!$A$3:$C$102,2))","v":""},null,null,null,{"$f":"IF(HQ30=\"\",\"\",VLOOKUP(HQ30,Teilnehmer!$A$3:$C$102,2))","v":""},null,null,{"$f":"IF(HT30=\"\",\"\",VLOOKUP(HT30,Teilnehmer!$A$3:$C$102,2))","v":""},null,null,null,{"$f":"IF(HX30=\"\",\"\",VLOOKUP(HX30,Teilnehmer!$A$3:$C$102,2))","v":""},null,null,{"$f":"IF(IA30=\"\",\"\",VLOOKUP(IA30,Teilnehmer!$A$3:$C$102,2))","v":""},null,null,null,{"$f":"IF(IE30=\"\",\"\",VLOOKUP(IE30,Teilnehmer!$A$3:$C$102,2))","v":""},null,null,{"$f":"IF(IH30=\"\",\"\",VLOOKUP(IH30,Teilnehmer!$A$3:$C$102,2))","v":""},null,null,null,{"$f":"IF(IL30=\"\",\"\",VLOOKUP(IL30,Teilnehmer!$A$3:$C$102,2))","v":""},null,null,{"$f":"IF(IO30=\"\",\"\",VLOOKUP(IO30,Teilnehmer!$A$3:$C$102,2))","v":""},null,null,null,{"$f":"IF(IS30=\"\",\"\",VLOOKUP(IS30,Teilnehmer!$A$3:$C$102,2))","v":""},null,null,{"$f":"IF(IV30=\"\",\"\",VLOOKUP(IV30,Teilnehmer!$A$3:$C$102,2))","v":""},null,null,null,{"$f":"IF(IZ30=\"\",\"\",VLOOKUP(IZ30,Teilnehmer!$A$3:$C$102,2))","v":""},null,null,{"$f":"IF(JC30=\"\",\"\",VLOOKUP(JC30,Teilnehmer!$A$3:$C$102,2))","v":""},null,null,null,{"$f":"IF(JG30=\"\",\"\",VLOOKUP(JG30,Teilnehmer!$A$3:$C$102,2))","v":""},null,null,{"$f":"IF(JJ30=\"\",\"\",VLOOKUP(JJ30,Teilnehmer!$A$3:$C$102,2))","v":""},null,null,null,{"$f":"IF(JN30=\"\",\"\",VLOOKUP(JN30,Teilnehmer!$A$3:$C$102,2))","v":""},null,null,{"$f":"IF(JQ30=\"\",\"\",VLOOKUP(JQ30,Teilnehmer!$A$3:$C$102,2))","v":""},null,null,null,{"$f":"IF(JU30=\"\",\"\",VLOOKUP(JU30,Teilnehmer!$A$3:$C$102,2))","v":""},null,null,{"$f":"IF(JX30=\"\",\"\",VLOOKUP(JX30,Teilnehmer!$A$3:$C$102,2))","v":""},null,null,null,{"$f":"IF(KB30=\"\",\"\",VLOOKUP(KB30,Teilnehmer!$A$3:$C$102,2))","v":""},null,null,{"$f":"IF(KE30=\"\",\"\",VLOOKUP(KE30,Teilnehmer!$A$3:$C$102,2))","v":""},null,null,null,{"$f":"IF(KI30=\"\",\"\",VLOOKUP(KI30,Teilnehmer!$A$3:$C$102,2))","v":""},null,null,{"$f":"IF(KL30=\"\",\"\",VLOOKUP(KL30,Teilnehmer!$A$3:$C$102,2))","v":""},null,null,null,{"$f":"IF(KP30=\"\",\"\",VLOOKUP(KP30,Teilnehmer!$A$3:$C$102,2))","v":""},null,null,{"$f":"IF(KS30=\"\",\"\",VLOOKUP(KS30,Teilnehmer!$A$3:$C$102,2))","v":""}]
[null,{"$f":"IF(A31=\"\",\"\",VLOOKUP(A31,Teilnehmer!$A$3:$C$102,2))","v":""},null,null,{"$f":"IF(D31=\"\",\"\",VLOOKUP(D31,Teilnehmer!$A$3:$C$102,2))","v":""},null,null,null,{"$f":"IF(H31=\"\",\"\",VLOOKUP(H31,Teilnehmer!$A$3:$C$102,2))","v":""},null,null,{"$f":"IF(K31=\"\",\"\",VLOOKUP(K31,Teilnehmer!$A$3:$C$102,2))","v":""},null,null,null,{"$f":"IF(O31=\"\",\"\",VLOOKUP(O31,Teilnehmer!$A$3:$C$102,2))","v":""},null,null,{"$f":"IF(R31=\"\",\"\",VLOOKUP(R31,Teilnehmer!$A$3:$C$102,2))","v":""},null,null,null,{"$f":"IF(V31=\"\",\"\",VLOOKUP(V31,Teilnehmer!$A$3:$C$102,2))","v":""},null,null,{"$f":"IF(Y31=\"\",\"\",VLOOKUP(Y31,Teilnehmer!$A$3:$C$102,2))","v":""},null,null,null,{"$f":"IF(AC31=\"\",\"\",VLOOKUP(AC31,Teilnehmer!$A$3:$C$102,2))","v":""},null,null,{"$f":"IF(AF31=\"\",\"\",VLOOKUP(AF31,Teilnehmer!$A$3:$C$102,2))","v":""},null,null,null,{"$f":"IF(AJ31=\"\",\"\",VLOOKUP(AJ31,Teilnehmer!$A$3:$C$102,2))","v":""},null,null,{"$f":"IF(AM31=\"\",\"\",VLOOKUP(AM31,Teilnehmer!$A$3:$C$102,2))","v":""},null,null,null,{"$f":"IF(AQ31=\"\",\"\",VLOOKUP(AQ31,Teilnehmer!$A$3:$C$102,2))","v":""},null,null,{"$f":"IF(AT31=\"\",\"\",VLOOKUP(AT31,Teilnehmer!$A$3:$C$102,2))","v":""},null,null,null,{"$f":"IF(AX31=\"\",\"\",VLOOKUP(AX31,Teilnehmer!$A$3:$C$102,2))","v":""},null,null,{"$f":"IF(BA31=\"\",\"\",VLOOKUP(BA31,Teilnehmer!$A$3:$C$102,2))","v":""},null,null,null,{"$f":"IF(BE31=\"\",\"\",VLOOKUP(BE31,Teilnehmer!$A$3:$C$102,2))","v":""},null,null,{"$f":"IF(BH31=\"\",\"\",VLOOKUP(BH31,Teilnehmer!$A$3:$C$102,2))","v":""},null,null,null,{"$f":"IF(BL31=\"\",\"\",VLOOKUP(BL31,Teilnehmer!$A$3:$C$102,2))","v":""},null,null,{"$f":"IF(BO31=\"\",\"\",VLOOKUP(BO31,Teilnehmer!$A$3:$C$102,2))","v":""},null,null,null,{"$f":"IF(BS31=\"\",\"\",VLOOKUP(BS31,Teilnehmer!$A$3:$C$102,2))","v":""},null,null,{"$f":"IF(BV31=\"\",\"\",VLOOKUP(BV31,Teilnehmer!$A$3:$C$102,2))","v":""},null,null,null,{"$f":"IF(BZ31=\"\",\"\",VLOOKUP(BZ31,Teilnehmer!$A$3:$C$102,2))","v":""},null,null,{"$f":"IF(CC31=\"\",\"\",VLOOKUP(CC31,Teilnehmer!$A$3:$C$102,2))","v":""},null,null,null,{"$f":"IF(CG31=\"\",\"\",VLOOKUP(CG31,Teilnehmer!$A$3:$C$102,2))","v":""},null,null,{"$f":"IF(CJ31=\"\",\"\",VLOOKUP(CJ31,Teilnehmer!$A$3:$C$102,2))","v":""},null,null,null,{"$f":"IF(CN31=\"\",\"\",VLOOKUP(CN31,Teilnehmer!$A$3:$C$102,2))","v":""},null,null,{"$f":"IF(CQ31=\"\",\"\",VLOOKUP(CQ31,Teilnehmer!$A$3:$C$102,2))","v":""},null,null,null,{"$f":"IF(CU31=\"\",\"\",VLOOKUP(CU31,Teilnehmer!$A$3:$C$102,2))","v":""},null,null,{"$f":"IF(CX31=\"\",\"\",VLOOKUP(CX31,Teilnehmer!$A$3:$C$102,2))","v":""},null,null,null,{"$f":"IF(DB31=\"\",\"\",VLOOKUP(DB31,Teilnehmer!$A$3:$C$102,2))","v":""},null,null,{"$f":"IF(DE31=\"\",\"\",VLOOKUP(DE31,Teilnehmer!$A$3:$C$102,2))","v":""},null,null,null,{"$f":"IF(DI31=\"\",\"\",VLOOKUP(DI31,Teilnehmer!$A$3:$C$102,2))","v":""},null,null,{"$f":"IF(DL31=\"\",\"\",VLOOKUP(DL31,Teilnehmer!$A$3:$C$102,2))","v":""},null,null,null,{"$f":"IF(DP31=\"\",\"\",VLOOKUP(DP31,Teilnehmer!$A$3:$C$102,2))","v":""},null,null,{"$f":"IF(DS31=\"\",\"\",VLOOKUP(DS31,Teilnehmer!$A$3:$C$102,2))","v":""},null,null,null,{"$f":"IF(DW31=\"\",\"\",VLOOKUP(DW31,Teilnehmer!$A$3:$C$102,2))","v":""},null,null,{"$f":"IF(DZ31=\"\",\"\",VLOOKUP(DZ31,Teilnehmer!$A$3:$C$102,2))","v":""},null,null,null,{"$f":"IF(ED31=\"\",\"\",VLOOKUP(ED31,Teilnehmer!$A$3:$C$102,2))","v":""},null,null,{"$f":"IF(EG31=\"\",\"\",VLOOKUP(EG31,Teilnehmer!$A$3:$C$102,2))","v":""},null,null,null,{"$f":"IF(EK31=\"\",\"\",VLOOKUP(EK31,Teilnehmer!$A$3:$C$102,2))","v":""},null,null,{"$f":"IF(EN31=\"\",\"\",VLOOKUP(EN31,Teilnehmer!$A$3:$C$102,2))","v":""},null,null,null,{"$f":"IF(ER31=\"\",\"\",VLOOKUP(ER31,Teilnehmer!$A$3:$C$102,2))","v":""},null,null,{"$f":"IF(EU31=\"\",\"\",VLOOKUP(EU31,Teilnehmer!$A$3:$C$102,2))","v":""},null,null,null,{"$f":"IF(EY31=\"\",\"\",VLOOKUP(EY31,Teilnehmer!$A$3:$C$102,2))","v":""},null,null,{"$f":"IF(FB31=\"\",\"\",VLOOKUP(FB31,Teilnehmer!$A$3:$C$102,2))","v":""},null,null,null,{"$f":"IF(FF31=\"\",\"\",VLOOKUP(FF31,Teilnehmer!$A$3:$C$102,2))","v":""},null,null,{"$f":"IF(FI31=\"\",\"\",VLOOKUP(FI31,Teilnehmer!$A$3:$C$102,2))","v":""},null,null,null,{"$f":"IF(FM31=\"\",\"\",VLOOKUP(FM31,Teilnehmer!$A$3:$C$102,2))","v":""},null,null,{"$f":"IF(FP31=\"\",\"\",VLOOKUP(FP31,Teilnehmer!$A$3:$C$102,2))","v":""},null,null,null,{"$f":"IF(FT31=\"\",\"\",VLOOKUP(FT31,Teilnehmer!$A$3:$C$102,2))","v":""},null,null,{"$f":"IF(FW31=\"\",\"\",VLOOKUP(FW31,Teilnehmer!$A$3:$C$102,2))","v":""},null,null,null,{"$f":"IF(GA31=\"\",\"\",VLOOKUP(GA31,Teilnehmer!$A$3:$C$102,2))","v":""},null,null,{"$f":"IF(GD31=\"\",\"\",VLOOKUP(GD31,Teilnehmer!$A$3:$C$102,2))","v":""},null,null,null,{"$f":"IF(GH31=\"\",\"\",VLOOKUP(GH31,Teilnehmer!$A$3:$C$102,2))","v":""},null,null,{"$f":"IF(GK31=\"\",\"\",VLOOKUP(GK31,Teilnehmer!$A$3:$C$102,2))","v":""},null,null,null,{"$f":"IF(GO31=\"\",\"\",VLOOKUP(GO31,Teilnehmer!$A$3:$C$102,2))","v":""},null,null,{"$f":"IF(GR31=\"\",\"\",VLOOKUP(GR31,Teilnehmer!$A$3:$C$102,2))","v":""},null,null,null,{"$f":"IF(GV31=\"\",\"\",VLOOKUP(GV31,Teilnehmer!$A$3:$C$102,2))","v":""},null,null,{"$f":"IF(GY31=\"\",\"\",VLOOKUP(GY31,Teilnehmer!$A$3:$C$102,2))","v":""},null,null,null,{"$f":"IF(HC31=\"\",\"\",VLOOKUP(HC31,Teilnehmer!$A$3:$C$102,2))","v":""},null,null,{"$f":"IF(HF31=\"\",\"\",VLOOKUP(HF31,Teilnehmer!$A$3:$C$102,2))","v":""},null,null,null,{"$f":"IF(HJ31=\"\",\"\",VLOOKUP(HJ31,Teilnehmer!$A$3:$C$102,2))","v":""},null,null,{"$f":"IF(HM31=\"\",\"\",VLOOKUP(HM31,Teilnehmer!$A$3:$C$102,2))","v":""},null,null,null,{"$f":"IF(HQ31=\"\",\"\",VLOOKUP(HQ31,Teilnehmer!$A$3:$C$102,2))","v":""},null,null,{"$f":"IF(HT31=\"\",\"\",VLOOKUP(HT31,Teilnehmer!$A$3:$C$102,2))","v":""},null,null,null,{"$f":"IF(HX31=\"\",\"\",VLOOKUP(HX31,Teilnehmer!$A$3:$C$102,2))","v":""},null,null,{"$f":"IF(IA31=\"\",\"\",VLOOKUP(IA31,Teilnehmer!$A$3:$C$102,2))","v":""},null,null,null,{"$f":"IF(IE31=\"\",\"\",VLOOKUP(IE31,Teilnehmer!$A$3:$C$102,2))","v":""},null,null,{"$f":"IF(IH31=\"\",\"\",VLOOKUP(IH31,Teilnehmer!$A$3:$C$102,2))","v":""},null,null,null,{"$f":"IF(IL31=\"\",\"\",VLOOKUP(IL31,Teilnehmer!$A$3:$C$102,2))","v":""},null,null,{"$f":"IF(IO31=\"\",\"\",VLOOKUP(IO31,Teilnehmer!$A$3:$C$102,2))","v":""},null,null,null,{"$f":"IF(IS31=\"\",\"\",VLOOKUP(IS31,Teilnehmer!$A$3:$C$102,2))","v":""},null,null,{"$f":"IF(IV31=\"\",\"\",VLOOKUP(IV31,Teilnehmer!$A$3:$C$102,2))","v":""},null,null,null,{"$f":"IF(IZ31=\"\",\"\",VLOOKUP(IZ31,Teilnehmer!$A$3:$C$102,2))","v":""},null,null,{"$f":"IF(JC31=\"\",\"\",VLOOKUP(JC31,Teilnehmer!$A$3:$C$102,2))","v":""},null,null,null,{"$f":"IF(JG31=\"\",\"\",VLOOKUP(JG31,Teilnehmer!$A$3:$C$102,2))","v":""},null,null,{"$f":"IF(JJ31=\"\",\"\",VLOOKUP(JJ31,Teilnehmer!$A$3:$C$102,2))","v":""},null,null,null,{"$f":"IF(JN31=\"\",\"\",VLOOKUP(JN31,Teilnehmer!$A$3:$C$102,2))","v":""},null,null,{"$f":"IF(JQ31=\"\",\"\",VLOOKUP(JQ31,Teilnehmer!$A$3:$C$102,2))","v":""},null,null,null,{"$f":"IF(JU31=\"\",\"\",VLOOKUP(JU31,Teilnehmer!$A$3:$C$102,2))","v":""},null,null,{"$f":"IF(JX31=\"\",\"\",VLOOKUP(JX31,Teilnehmer!$A$3:$C$102,2))","v":""},null,null,null,{"$f":"IF(KB31=\"\",\"\",VLOOKUP(KB31,Teilnehmer!$A$3:$C$102,2))","v":""},null,null,{"$f":"IF(KE31=\"\",\"\",VLOOKUP(KE31,Teilnehmer!$A$3:$C$102,2))","v":""},null,null,null,{"$f":"IF(KI31=\"\",\"\",VLOOKUP(KI31,Teilnehmer!$A$3:$C$102,2))","v":""},null,null,{"$f":"IF(KL31=\"\",\"\",VLOOKUP(KL31,Teilnehmer!$A$3:$C$102,2))","v":""},null,null,null,{"$f":"IF(KP31=\"\",\"\",VLOOKUP(KP31,Teilnehmer!$A$3:$C$102,2))","v":""},null,null,{"$f":"IF(KS31=\"\",\"\",VLOOKUP(KS31,Teilnehmer!$A$3:$C$102,2))","v":""}]
[null,{"$f":"IF(A32=\"\",\"\",VLOOKUP(A32,Teilnehmer!$A$3:$C$102,2))","v":""},null,null,{"$f":"IF(D32=\"\",\"\",VLOOKUP(D32,Teilnehmer!$A$3:$C$102,2))","v":""},null,null,null,{"$f":"IF(H32=\"\",\"\",VLOOKUP(H32,Teilnehmer!$A$3:$C$102,2))","v":""},null,null,{"$f":"IF(K32=\"\",\"\",VLOOKUP(K32,Teilnehmer!$A$3:$C$102,2))","v":""},null,null,null,{"$f":"IF(O32=\"\",\"\",VLOOKUP(O32,Teilnehmer!$A$3:$C$102,2))","v":""},null,null,{"$f":"IF(R32=\"\",\"\",VLOOKUP(R32,Teilnehmer!$A$3:$C$102,2))","v":""},null,null,null,{"$f":"IF(V32=\"\",\"\",VLOOKUP(V32,Teilnehmer!$A$3:$C$102,2))","v":""},null,null,{"$f":"IF(Y32=\"\",\"\",VLOOKUP(Y32,Teilnehmer!$A$3:$C$102,2))","v":""},null,null,null,{"$f":"IF(AC32=\"\",\"\",VLOOKUP(AC32,Teilnehmer!$A$3:$C$102,2))","v":""},null,null,{"$f":"IF(AF32=\"\",\"\",VLOOKUP(AF32,Teilnehmer!$A$3:$C$102,2))","v":""},null,null,null,{"$f":"IF(AJ32=\"\",\"\",VLOOKUP(AJ32,Teilnehmer!$A$3:$C$102,2))","v":""},null,null,{"$f":"IF(AM32=\"\",\"\",VLOOKUP(AM32,Teilnehmer!$A$3:$C$102,2))","v":""},null,null,null,{"$f":"IF(AQ32=\"\",\"\",VLOOKUP(AQ32,Teilnehmer!$A$3:$C$102,2))","v":""},null,null,{"$f":"IF(AT32=\"\",\"\",VLOOKUP(AT32,Teilnehmer!$A$3:$C$102,2))","v":""},null,null,null,{"$f":"IF(AX32=\"\",\"\",VLOOKUP(AX32,Teilnehmer!$A$3:$C$102,2))","v":""},null,null,{"$f":"IF(BA32=\"\",\"\",VLOOKUP(BA32,Teilnehmer!$A$3:$C$102,2))","v":""},null,null,null,{"$f":"IF(BE32=\"\",\"\",VLOOKUP(BE32,Teilnehmer!$A$3:$C$102,2))","v":""},null,null,{"$f":"IF(BH32=\"\",\"\",VLOOKUP(BH32,Teilnehmer!$A$3:$C$102,2))","v":""},null,null,null,{"$f":"IF(BL32=\"\",\"\",VLOOKUP(BL32,Teilnehmer!$A$3:$C$102,2))","v":""},null,null,{"$f":"IF(BO32=\"\",\"\",VLOOKUP(BO32,Teilnehmer!$A$3:$C$102,2))","v":""},null,null,null,{"$f":"IF(BS32=\"\",\"\",VLOOKUP(BS32,Teilnehmer!$A$3:$C$102,2))","v":""},null,null,{"$f":"IF(BV32=\"\",\"\",VLOOKUP(BV32,Teilnehmer!$A$3:$C$102,2))","v":""},null,null,null,{"$f":"IF(BZ32=\"\",\"\",VLOOKUP(BZ32,Teilnehmer!$A$3:$C$102,2))","v":""},null,null,{"$f":"IF(CC32=\"\",\"\",VLOOKUP(CC32,Teilnehmer!$A$3:$C$102,2))","v":""},null,null,null,{"$f":"IF(CG32=\"\",\"\",VLOOKUP(CG32,Teilnehmer!$A$3:$C$102,2))","v":""},null,null,{"$f":"IF(CJ32=\"\",\"\",VLOOKUP(CJ32,Teilnehmer!$A$3:$C$102,2))","v":""},null,null,null,{"$f":"IF(CN32=\"\",\"\",VLOOKUP(CN32,Teilnehmer!$A$3:$C$102,2))","v":""},null,null,{"$f":"IF(CQ32=\"\",\"\",VLOOKUP(CQ32,Teilnehmer!$A$3:$C$102,2))","v":""},null,null,null,{"$f":"IF(CU32=\"\",\"\",VLOOKUP(CU32,Teilnehmer!$A$3:$C$102,2))","v":""},null,null,{"$f":"IF(CX32=\"\",\"\",VLOOKUP(CX32,Teilnehmer!$A$3:$C$102,2))","v":""},null,null,null,{"$f":"IF(DB32=\"\",\"\",VLOOKUP(DB32,Teilnehmer!$A$3:$C$102,2))","v":""},null,null,{"$f":"IF(DE32=\"\",\"\",VLOOKUP(DE32,Teilnehmer!$A$3:$C$102,2))","v":""},null,null,null,{"$f":"IF(DI32=\"\",\"\",VLOOKUP(DI32,Teilnehmer!$A$3:$C$102,2))","v":""},null,null,{"$f":"IF(DL32=\"\",\"\",VLOOKUP(DL32,Teilnehmer!$A$3:$C$102,2))","v":""},null,null,null,{"$f":"IF(DP32=\"\",\"\",VLOOKUP(DP32,Teilnehmer!$A$3:$C$102,2))","v":""},null,null,{"$f":"IF(DS32=\"\",\"\",VLOOKUP(DS32,Teilnehmer!$A$3:$C$102,2))","v":""},null,null,null,{"$f":"IF(DW32=\"\",\"\",VLOOKUP(DW32,Teilnehmer!$A$3:$C$102,2))","v":""},null,null,{"$f":"IF(DZ32=\"\",\"\",VLOOKUP(DZ32,Teilnehmer!$A$3:$C$102,2))","v":""},null,null,null,{"$f":"IF(ED32=\"\",\"\",VLOOKUP(ED32,Teilnehmer!$A$3:$C$102,2))","v":""},null,null,{"$f":"IF(EG32=\"\",\"\",VLOOKUP(EG32,Teilnehmer!$A$3:$C$102,2))","v":""},null,null,null,{"$f":"IF(EK32=\"\",\"\",VLOOKUP(EK32,Teilnehmer!$A$3:$C$102,2))","v":""},null,null,{"$f":"IF(EN32=\"\",\"\",VLOOKUP(EN32,Teilnehmer!$A$3:$C$102,2))","v":""},null,null,null,{"$f":"IF(ER32=\"\",\"\",VLOOKUP(ER32,Teilnehmer!$A$3:$C$102,2))","v":""},null,null,{"$f":"IF(EU32=\"\",\"\",VLOOKUP(EU32,Teilnehmer!$A$3:$C$102,2))","v":""},null,null,null,{"$f":"IF(EY32=\"\",\"\",VLOOKUP(EY32,Teilnehmer!$A$3:$C$102,2))","v":""},null,null,{"$f":"IF(FB32=\"\",\"\",VLOOKUP(FB32,Teilnehmer!$A$3:$C$102,2))","v":""},null,null,null,{"$f":"IF(FF32=\"\",\"\",VLOOKUP(FF32,Teilnehmer!$A$3:$C$102,2))","v":""},null,null,{"$f":"IF(FI32=\"\",\"\",VLOOKUP(FI32,Teilnehmer!$A$3:$C$102,2))","v":""},null,null,null,{"$f":"IF(FM32=\"\",\"\",VLOOKUP(FM32,Teilnehmer!$A$3:$C$102,2))","v":""},null,null,{"$f":"IF(FP32=\"\",\"\",VLOOKUP(FP32,Teilnehmer!$A$3:$C$102,2))","v":""},null,null,null,{"$f":"IF(FT32=\"\",\"\",VLOOKUP(FT32,Teilnehmer!$A$3:$C$102,2))","v":""},null,null,{"$f":"IF(FW32=\"\",\"\",VLOOKUP(FW32,Teilnehmer!$A$3:$C$102,2))","v":""},null,null,null,{"$f":"IF(GA32=\"\",\"\",VLOOKUP(GA32,Teilnehmer!$A$3:$C$102,2))","v":""},null,null,{"$f":"IF(GD32=\"\",\"\",VLOOKUP(GD32,Teilnehmer!$A$3:$C$102,2))","v":""},null,null,null,{"$f":"IF(GH32=\"\",\"\",VLOOKUP(GH32,Teilnehmer!$A$3:$C$102,2))","v":""},null,null,{"$f":"IF(GK32=\"\",\"\",VLOOKUP(GK32,Teilnehmer!$A$3:$C$102,2))","v":""},null,null,null,{"$f":"IF(GO32=\"\",\"\",VLOOKUP(GO32,Teilnehmer!$A$3:$C$102,2))","v":""},null,null,{"$f":"IF(GR32=\"\",\"\",VLOOKUP(GR32,Teilnehmer!$A$3:$C$102,2))","v":""},null,null,null,{"$f":"IF(GV32=\"\",\"\",VLOOKUP(GV32,Teilnehmer!$A$3:$C$102,2))","v":""},null,null,{"$f":"IF(GY32=\"\",\"\",VLOOKUP(GY32,Teilnehmer!$A$3:$C$102,2))","v":""},null,null,null,{"$f":"IF(HC32=\"\",\"\",VLOOKUP(HC32,Teilnehmer!$A$3:$C$102,2))","v":""},null,null,{"$f":"IF(HF32=\"\",\"\",VLOOKUP(HF32,Teilnehmer!$A$3:$C$102,2))","v":""},null,null,null,{"$f":"IF(HJ32=\"\",\"\",VLOOKUP(HJ32,Teilnehmer!$A$3:$C$102,2))","v":""},null,null,{"$f":"IF(HM32=\"\",\"\",VLOOKUP(HM32,Teilnehmer!$A$3:$C$102,2))","v":""},null,null,null,{"$f":"IF(HQ32=\"\",\"\",VLOOKUP(HQ32,Teilnehmer!$A$3:$C$102,2))","v":""},null,null,{"$f":"IF(HT32=\"\",\"\",VLOOKUP(HT32,Teilnehmer!$A$3:$C$102,2))","v":""},null,null,null,{"$f":"IF(HX32=\"\",\"\",VLOOKUP(HX32,Teilnehmer!$A$3:$C$102,2))","v":""},null,null,{"$f":"IF(IA32=\"\",\"\",VLOOKUP(IA32,Teilnehmer!$A$3:$C$102,2))","v":""},null,null,null,{"$f":"IF(IE32=\"\",\"\",VLOOKUP(IE32,Teilnehmer!$A$3:$C$102,2))","v":""},null,null,{"$f":"IF(IH32=\"\",\"\",VLOOKUP(IH32,Teilnehmer!$A$3:$C$102,2))","v":""},null,null,null,{"$f":"IF(IL32=\"\",\"\",VLOOKUP(IL32,Teilnehmer!$A$3:$C$102,2))","v":""},null,null,{"$f":"IF(IO32=\"\",\"\",VLOOKUP(IO32,Teilnehmer!$A$3:$C$102,2))","v":""},null,null,null,{"$f":"IF(IS32=\"\",\"\",VLOOKUP(IS32,Teilnehmer!$A$3:$C$102,2))","v":""},null,null,{"$f":"IF(IV32=\"\",\"\",VLOOKUP(IV32,Teilnehmer!$A$3:$C$102,2))","v":""},null,null,null,{"$f":"IF(IZ32=\"\",\"\",VLOOKUP(IZ32,Teilnehmer!$A$3:$C$102,2))","v":""},null,null,{"$f":"IF(JC32=\"\",\"\",VLOOKUP(JC32,Teilnehmer!$A$3:$C$102,2))","v":""},null,null,null,{"$f":"IF(JG32=\"\",\"\",VLOOKUP(JG32,Teilnehmer!$A$3:$C$102,2))","v":""},null,null,{"$f":"IF(JJ32=\"\",\"\",VLOOKUP(JJ32,Teilnehmer!$A$3:$C$102,2))","v":""},null,null,null,{"$f":"IF(JN32=\"\",\"\",VLOOKUP(JN32,Teilnehmer!$A$3:$C$102,2))","v":""},null,null,{"$f":"IF(JQ32=\"\",\"\",VLOOKUP(JQ32,Teilnehmer!$A$3:$C$102,2))","v":""},null,null,null,{"$f":"IF(JU32=\"\",\"\",VLOOKUP(JU32,Teilnehmer!$A$3:$C$102,2))","v":""},null,null,{"$f":"IF(JX32=\"\",\"\",VLOOKUP(JX32,Teilnehmer!$A$3:$C$102,2))","v":""},null,null,null,{"$f":"IF(KB32=\"\",\"\",VLOOKUP(KB32,Teilnehmer!$A$3:$C$102,2))","v":""},null,null,{"$f":"IF(KE32=\"\",\"\",VLOOKUP(KE32,Teilnehmer!$A$3:$C$102,2))","v":""},null,null,null,{"$f":"IF(KI32=\"\",\"\",VLOOKUP(KI32,Teilnehmer!$A$3:$C$102,2))","v":""},null,null,{"$f":"IF(KL32=\"\",\"\",VLOOKUP(KL32,Teilnehmer!$A$3:$C$102,2))","v":""},null,null,null,{"$f":"IF(KP32=\"\",\"\",VLOOKUP(KP32,Teilnehmer!$A$3:$C$102,2))","v":""},null,null,{"$f":"IF(KS32=\"\",\"\",VLOOKUP(KS32,Teilnehmer!$A$3:$C$102,2))","v":""}]
[null,{"$f":"IF(A33=\"\",\"\",VLOOKUP(A33,Teilnehmer!$A$3:$C$102,2))","v":""},null,null,{"$f":"IF(D33=\"\",\"\",VLOOKUP(D33,Teilnehmer!$A$3:$C$102,2))","v":""},null,null,null,{"$f":"IF(H33=\"\",\"\",VLOOKUP(H33,Teilnehmer!$A$3:$C$102,2))","v":""},null,null,{"$f":"IF(K33=\"\",\"\",VLOOKUP(K33,Teilnehmer!$A$3:$C$102,2))","v":""},null,null,null,{"$f":"IF(O33=\"\",\"\",VLOOKUP(O33,Teilnehmer!$A$3:$C$102,2))","v":""},null,null,{"$f":"IF(R33=\"\",\"\",VLOOKUP(R33,Teilnehmer!$A$3:$C$102,2))","v":""},null,null,null,{"$f":"IF(V33=\"\",\"\",VLOOKUP(V33,Teilnehmer!$A$3:$C$102,2))","v":""},null,null,{"$f":"IF(Y33=\"\",\"\",VLOOKUP(Y33,Teilnehmer!$A$3:$C$102,2))","v":""},null,null,null,{"$f":"IF(AC33=\"\",\"\",VLOOKUP(AC33,Teilnehmer!$A$3:$C$102,2))","v":""},null,null,{"$f":"IF(AF33=\"\",\"\",VLOOKUP(AF33,Teilnehmer!$A$3:$C$102,2))","v":""},null,null,null,{"$f":"IF(AJ33=\"\",\"\",VLOOKUP(AJ33,Teilnehmer!$A$3:$C$102,2))","v":""},null,null,{"$f":"IF(AM33=\"\",\"\",VLOOKUP(AM33,Teilnehmer!$A$3:$C$102,2))","v":""},null,null,null,{"$f":"IF(AQ33=\"\",\"\",VLOOKUP(AQ33,Teilnehmer!$A$3:$C$102,2))","v":""},null,null,{"$f":"IF(AT33=\"\",\"\",VLOOKUP(AT33,Teilnehmer!$A$3:$C$102,2))","v":""},null,null,null,{"$f":"IF(AX33=\"\",\"\",VLOOKUP(AX33,Teilnehmer!$A$3:$C$102,2))","v":""},null,null,{"$f":"IF(BA33=\"\",\"\",VLOOKUP(BA33,Teilnehmer!$A$3:$C$102,2))","v":""},null,null,null,{"$f":"IF(BE33=\"\",\"\",VLOOKUP(BE33,Teilnehmer!$A$3:$C$102,2))","v":""},null,null,{"$f":"IF(BH33=\"\",\"\",VLOOKUP(BH33,Teilnehmer!$A$3:$C$102,2))","v":""},null,null,null,{"$f":"IF(BL33=\"\",\"\",VLOOKUP(BL33,Teilnehmer!$A$3:$C$102,2))","v":""},null,null,{"$f":"IF(BO33=\"\",\"\",VLOOKUP(BO33,Teilnehmer!$A$3:$C$102,2))","v":""},null,null,null,{"$f":"IF(BS33=\"\",\"\",VLOOKUP(BS33,Teilnehmer!$A$3:$C$102,2))","v":""},null,null,{"$f":"IF(BV33=\"\",\"\",VLOOKUP(BV33,Teilnehmer!$A$3:$C$102,2))","v":""},null,null,null,{"$f":"IF(BZ33=\"\",\"\",VLOOKUP(BZ33,Teilnehmer!$A$3:$C$102,2))","v":""},null,null,{"$f":"IF(CC33=\"\",\"\",VLOOKUP(CC33,Teilnehmer!$A$3:$C$102,2))","v":""},null,null,null,{"$f":"IF(CG33=\"\",\"\",VLOOKUP(CG33,Teilnehmer!$A$3:$C$102,2))","v":""},null,null,{"$f":"IF(CJ33=\"\",\"\",VLOOKUP(CJ33,Teilnehmer!$A$3:$C$102,2))","v":""},null,null,null,{"$f":"IF(CN33=\"\",\"\",VLOOKUP(CN33,Teilnehmer!$A$3:$C$102,2))","v":""},null,null,{"$f":"IF(CQ33=\"\",\"\",VLOOKUP(CQ33,Teilnehmer!$A$3:$C$102,2))","v":""},null,null,null,{"$f":"IF(CU33=\"\",\"\",VLOOKUP(CU33,Teilnehmer!$A$3:$C$102,2))","v":""},null,null,{"$f":"IF(CX33=\"\",\"\",VLOOKUP(CX33,Teilnehmer!$A$3:$C$102,2))","v":""},null,null,null,{"$f":"IF(DB33=\"\",\"\",VLOOKUP(DB33,Teilnehmer!$A$3:$C$102,2))","v":""},null,null,{"$f":"IF(DE33=\"\",\"\",VLOOKUP(DE33,Teilnehmer!$A$3:$C$102,2))","v":""},null,null,null,{"$f":"IF(DI33=\"\",\"\",VLOOKUP(DI33,Teilnehmer!$A$3:$C$102,2))","v":""},null,null,{"$f":"IF(DL33=\"\",\"\",VLOOKUP(DL33,Teilnehmer!$A$3:$C$102,2))","v":""},null,null,null,{"$f":"IF(DP33=\"\",\"\",VLOOKUP(DP33,Teilnehmer!$A$3:$C$102,2))","v":""},null,null,{"$f":"IF(DS33=\"\",\"\",VLOOKUP(DS33,Teilnehmer!$A$3:$C$102,2))","v":""},null,null,null,{"$f":"IF(DW33=\"\",\"\",VLOOKUP(DW33,Teilnehmer!$A$3:$C$102,2))","v":""},null,null,{"$f":"IF(DZ33=\"\",\"\",VLOOKUP(DZ33,Teilnehmer!$A$3:$C$102,2))","v":""},null,null,null,{"$f":"IF(ED33=\"\",\"\",VLOOKUP(ED33,Teilnehmer!$A$3:$C$102,2))","v":""},null,null,{"$f":"IF(EG33=\"\",\"\",VLOOKUP(EG33,Teilnehmer!$A$3:$C$102,2))","v":""},null,null,null,{"$f":"IF(EK33=\"\",\"\",VLOOKUP(EK33,Teilnehmer!$A$3:$C$102,2))","v":""},null,null,{"$f":"IF(EN33=\"\",\"\",VLOOKUP(EN33,Teilnehmer!$A$3:$C$102,2))","v":""},null,null,null,{"$f":"IF(ER33=\"\",\"\",VLOOKUP(ER33,Teilnehmer!$A$3:$C$102,2))","v":""},null,null,{"$f":"IF(EU33=\"\",\"\",VLOOKUP(EU33,Teilnehmer!$A$3:$C$102,2))","v":""},null,null,null,{"$f":"IF(EY33=\"\",\"\",VLOOKUP(EY33,Teilnehmer!$A$3:$C$102,2))","v":""},null,null,{"$f":"IF(FB33=\"\",\"\",VLOOKUP(FB33,Teilnehmer!$A$3:$C$102,2))","v":""},null,null,null,{"$f":"IF(FF33=\"\",\"\",VLOOKUP(FF33,Teilnehmer!$A$3:$C$102,2))","v":""},null,null,{"$f":"IF(FI33=\"\",\"\",VLOOKUP(FI33,Teilnehmer!$A$3:$C$102,2))","v":""},null,null,null,{"$f":"IF(FM33=\"\",\"\",VLOOKUP(FM33,Teilnehmer!$A$3:$C$102,2))","v":""},null,null,{"$f":"IF(FP33=\"\",\"\",VLOOKUP(FP33,Teilnehmer!$A$3:$C$102,2))","v":""},null,null,null,{"$f":"IF(FT33=\"\",\"\",VLOOKUP(FT33,Teilnehmer!$A$3:$C$102,2))","v":""},null,null,{"$f":"IF(FW33=\"\",\"\",VLOOKUP(FW33,Teilnehmer!$A$3:$C$102,2))","v":""},null,null,null,{"$f":"IF(GA33=\"\",\"\",VLOOKUP(GA33,Teilnehmer!$A$3:$C$102,2))","v":""},null,null,{"$f":"IF(GD33=\"\",\"\",VLOOKUP(GD33,Teilnehmer!$A$3:$C$102,2))","v":""},null,null,null,{"$f":"IF(GH33=\"\",\"\",VLOOKUP(GH33,Teilnehmer!$A$3:$C$102,2))","v":""},null,null,{"$f":"IF(GK33=\"\",\"\",VLOOKUP(GK33,Teilnehmer!$A$3:$C$102,2))","v":""},null,null,null,{"$f":"IF(GO33=\"\",\"\",VLOOKUP(GO33,Teilnehmer!$A$3:$C$102,2))","v":""},null,null,{"$f":"IF(GR33=\"\",\"\",VLOOKUP(GR33,Teilnehmer!$A$3:$C$102,2))","v":""},null,null,null,{"$f":"IF(GV33=\"\",\"\",VLOOKUP(GV33,Teilnehmer!$A$3:$C$102,2))","v":""},null,null,{"$f":"IF(GY33=\"\",\"\",VLOOKUP(GY33,Teilnehmer!$A$3:$C$102,2))","v":""},null,null,null,{"$f":"IF(HC33=\"\",\"\",VLOOKUP(HC33,Teilnehmer!$A$3:$C$102,2))","v":""},null,null,{"$f":"IF(HF33=\"\",\"\",VLOOKUP(HF33,Teilnehmer!$A$3:$C$102,2))","v":""},null,null,null,{"$f":"IF(HJ33=\"\",\"\",VLOOKUP(HJ33,Teilnehmer!$A$3:$C$102,2))","v":""},null,null,{"$f":"IF(HM33=\"\",\"\",VLOOKUP(HM33,Teilnehmer!$A$3:$C$102,2))","v":""},null,null,null,{"$f":"IF(HQ33=\"\",\"\",VLOOKUP(HQ33,Teilnehmer!$A$3:$C$102,2))","v":""},null,null,{"$f":"IF(HT33=\"\",\"\",VLOOKUP(HT33,Teilnehmer!$A$3:$C$102,2))","v":""},null,null,null,{"$f":"IF(HX33=\"\",\"\",VLOOKUP(HX33,Teilnehmer!$A$3:$C$102,2))","v":""},null,null,{"$f":"IF(IA33=\"\",\"\",VLOOKUP(IA33,Teilnehmer!$A$3:$C$102,2))","v":""},null,null,null,{"$f":"IF(IE33=\"\",\"\",VLOOKUP(IE33,Teilnehmer!$A$3:$C$102,2))","v":""},null,null,{"$f":"IF(IH33=\"\",\"\",VLOOKUP(IH33,Teilnehmer!$A$3:$C$102,2))","v":""},null,null,null,{"$f":"IF(IL33=\"\",\"\",VLOOKUP(IL33,Teilnehmer!$A$3:$C$102,2))","v":""},null,null,{"$f":"IF(IO33=\"\",\"\",VLOOKUP(IO33,Teilnehmer!$A$3:$C$102,2))","v":""},null,null,null,{"$f":"IF(IS33=\"\",\"\",VLOOKUP(IS33,Teilnehmer!$A$3:$C$102,2))","v":""},null,null,{"$f":"IF(IV33=\"\",\"\",VLOOKUP(IV33,Teilnehmer!$A$3:$C$102,2))","v":""},null,null,null,{"$f":"IF(IZ33=\"\",\"\",VLOOKUP(IZ33,Teilnehmer!$A$3:$C$102,2))","v":""},null,null,{"$f":"IF(JC33=\"\",\"\",VLOOKUP(JC33,Teilnehmer!$A$3:$C$102,2))","v":""},null,null,null,{"$f":"IF(JG33=\"\",\"\",VLOOKUP(JG33,Teilnehmer!$A$3:$C$102,2))","v":""},null,null,{"$f":"IF(JJ33=\"\",\"\",VLOOKUP(JJ33,Teilnehmer!$A$3:$C$102,2))","v":""},null,null,null,{"$f":"IF(JN33=\"\",\"\",VLOOKUP(JN33,Teilnehmer!$A$3:$C$102,2))","v":""},null,null,{"$f":"IF(JQ33=\"\",\"\",VLOOKUP(JQ33,Teilnehmer!$A$3:$C$102,2))","v":""},null,null,null,{"$f":"IF(JU33=\"\",\"\",VLOOKUP(JU33,Teilnehmer!$A$3:$C$102,2))","v":""},null,null,{"$f":"IF(JX33=\"\",\"\",VLOOKUP(JX33,Teilnehmer!$A$3:$C$102,2))","v":""},null,null,null,{"$f":"IF(KB33=\"\",\"\",VLOOKUP(KB33,Teilnehmer!$A$3:$C$102,2))","v":""},null,null,{"$f":"IF(KE33=\"\",\"\",VLOOKUP(KE33,Teilnehmer!$A$3:$C$102,2))","v":""},null,null,null,{"$f":"IF(KI33=\"\",\"\",VLOOKUP(KI33,Teilnehmer!$A$3:$C$102,2))","v":""},null,null,{"$f":"IF(KL33=\"\",\"\",VLOOKUP(KL33,Teilnehmer!$A$3:$C$102,2))","v":""},null,null,null,{"$f":"IF(KP33=\"\",\"\",VLOOKUP(KP33,Teilnehmer!$A$3:$C$102,2))","v":""},null,null,{"$f":"IF(KS33=\"\",\"\",VLOOKUP(KS33,Teilnehmer!$A$3:$C$102,2))","v":""}]
[null,{"$f":"IF(A34=\"\",\"\",VLOOKUP(A34,Teilnehmer!$A$3:$C$102,2))","v":""},null,null,{"$f":"IF(D34=\"\",\"\",VLOOKUP(D34,Teilnehmer!$A$3:$C$102,2))","v":""},null,null,null,{"$f":"IF(H34=\"\",\"\",VLOOKUP(H34,Teilnehmer!$A$3:$C$102,2))","v":""},null,null,{"$f":"IF(K34=\"\",\"\",VLOOKUP(K34,Teilnehmer!$A$3:$C$102,2))","v":""},null,null,null,{"$f":"IF(O34=\"\",\"\",VLOOKUP(O34,Teilnehmer!$A$3:$C$102,2))","v":""},null,null,{"$f":"IF(R34=\"\",\"\",VLOOKUP(R34,Teilnehmer!$A$3:$C$102,2))","v":""},null,null,null,{"$f":"IF(V34=\"\",\"\",VLOOKUP(V34,Teilnehmer!$A$3:$C$102,2))","v":""},null,null,{"$f":"IF(Y34=\"\",\"\",VLOOKUP(Y34,Teilnehmer!$A$3:$C$102,2))","v":""},null,null,null,{"$f":"IF(AC34=\"\",\"\",VLOOKUP(AC34,Teilnehmer!$A$3:$C$102,2))","v":""},null,null,{"$f":"IF(AF34=\"\",\"\",VLOOKUP(AF34,Teilnehmer!$A$3:$C$102,2))","v":""},null,null,null,{"$f":"IF(AJ34=\"\",\"\",VLOOKUP(AJ34,Teilnehmer!$A$3:$C$102,2))","v":""},null,null,{"$f":"IF(AM34=\"\",\"\",VLOOKUP(AM34,Teilnehmer!$A$3:$C$102,2))","v":""},null,null,null,{"$f":"IF(AQ34=\"\",\"\",VLOOKUP(AQ34,Teilnehmer!$A$3:$C$102,2))","v":""},null,null,{"$f":"IF(AT34=\"\",\"\",VLOOKUP(AT34,Teilnehmer!$A$3:$C$102,2))","v":""},null,null,null,{"$f":"IF(AX34=\"\",\"\",VLOOKUP(AX34,Teilnehmer!$A$3:$C$102,2))","v":""},null,null,{"$f":"IF(BA34=\"\",\"\",VLOOKUP(BA34,Teilnehmer!$A$3:$C$102,2))","v":""},null,null,null,{"$f":"IF(BE34=\"\",\"\",VLOOKUP(BE34,Teilnehmer!$A$3:$C$102,2))","v":""},null,null,{"$f":"IF(BH34=\"\",\"\",VLOOKUP(BH34,Teilnehmer!$A$3:$C$102,2))","v":""},null,null,null,{"$f":"IF(BL34=\"\",\"\",VLOOKUP(BL34,Teilnehmer!$A$3:$C$102,2))","v":""},null,null,{"$f":"IF(BO34=\"\",\"\",VLOOKUP(BO34,Teilnehmer!$A$3:$C$102,2))","v":""},null,null,null,{"$f":"IF(BS34=\"\",\"\",VLOOKUP(BS34,Teilnehmer!$A$3:$C$102,2))","v":""},null,null,{"$f":"IF(BV34=\"\",\"\",VLOOKUP(BV34,Teilnehmer!$A$3:$C$102,2))","v":""},null,null,null,{"$f":"IF(BZ34=\"\",\"\",VLOOKUP(BZ34,Teilnehmer!$A$3:$C$102,2))","v":""},null,null,{"$f":"IF(CC34=\"\",\"\",VLOOKUP(CC34,Teilnehmer!$A$3:$C$102,2))","v":""},null,null,null,{"$f":"IF(CG34=\"\",\"\",VLOOKUP(CG34,Teilnehmer!$A$3:$C$102,2))","v":""},null,null,{"$f":"IF(CJ34=\"\",\"\",VLOOKUP(CJ34,Teilnehmer!$A$3:$C$102,2))","v":""},null,null,null,{"$f":"IF(CN34=\"\",\"\",VLOOKUP(CN34,Teilnehmer!$A$3:$C$102,2))","v":""},null,null,{"$f":"IF(CQ34=\"\",\"\",VLOOKUP(CQ34,Teilnehmer!$A$3:$C$102,2))","v":""},null,null,null,{"$f":"IF(CU34=\"\",\"\",VLOOKUP(CU34,Teilnehmer!$A$3:$C$102,2))","v":""},null,null,{"$f":"IF(CX34=\"\",\"\",VLOOKUP(CX34,Teilnehmer!$A$3:$C$102,2))","v":""},null,null,null,{"$f":"IF(DB34=\"\",\"\",VLOOKUP(DB34,Teilnehmer!$A$3:$C$102,2))","v":""},null,null,{"$f":"IF(DE34=\"\",\"\",VLOOKUP(DE34,Teilnehmer!$A$3:$C$102,2))","v":""},null,null,null,{"$f":"IF(DI34=\"\",\"\",VLOOKUP(DI34,Teilnehmer!$A$3:$C$102,2))","v":""},null,null,{"$f":"IF(DL34=\"\",\"\",VLOOKUP(DL34,Teilnehmer!$A$3:$C$102,2))","v":""},null,null,null,{"$f":"IF(DP34=\"\",\"\",VLOOKUP(DP34,Teilnehmer!$A$3:$C$102,2))","v":""},null,null,{"$f":"IF(DS34=\"\",\"\",VLOOKUP(DS34,Teilnehmer!$A$3:$C$102,2))","v":""},null,null,null,{"$f":"IF(DW34=\"\",\"\",VLOOKUP(DW34,Teilnehmer!$A$3:$C$102,2))","v":""},null,null,{"$f":"IF(DZ34=\"\",\"\",VLOOKUP(DZ34,Teilnehmer!$A$3:$C$102,2))","v":""},null,null,null,{"$f":"IF(ED34=\"\",\"\",VLOOKUP(ED34,Teilnehmer!$A$3:$C$102,2))","v":""},null,null,{"$f":"IF(EG34=\"\",\"\",VLOOKUP(EG34,Teilnehmer!$A$3:$C$102,2))","v":""},null,null,null,{"$f":"IF(EK34=\"\",\"\",VLOOKUP(EK34,Teilnehmer!$A$3:$C$102,2))","v":""},null,null,{"$f":"IF(EN34=\"\",\"\",VLOOKUP(EN34,Teilnehmer!$A$3:$C$102,2))","v":""},null,null,null,{"$f":"IF(ER34=\"\",\"\",VLOOKUP(ER34,Teilnehmer!$A$3:$C$102,2))","v":""},null,null,{"$f":"IF(EU34=\"\",\"\",VLOOKUP(EU34,Teilnehmer!$A$3:$C$102,2))","v":""},null,null,null,{"$f":"IF(EY34=\"\",\"\",VLOOKUP(EY34,Teilnehmer!$A$3:$C$102,2))","v":""},null,null,{"$f":"IF(FB34=\"\",\"\",VLOOKUP(FB34,Teilnehmer!$A$3:$C$102,2))","v":""},null,null,null,{"$f":"IF(FF34=\"\",\"\",VLOOKUP(FF34,Teilnehmer!$A$3:$C$102,2))","v":""},null,null,{"$f":"IF(FI34=\"\",\"\",VLOOKUP(FI34,Teilnehmer!$A$3:$C$102,2))","v":""},null,null,null,{"$f":"IF(FM34=\"\",\"\",VLOOKUP(FM34,Teilnehmer!$A$3:$C$102,2))","v":""},null,null,{"$f":"IF(FP34=\"\",\"\",VLOOKUP(FP34,Teilnehmer!$A$3:$C$102,2))","v":""},null,null,null,{"$f":"IF(FT34=\"\",\"\",VLOOKUP(FT34,Teilnehmer!$A$3:$C$102,2))","v":""},null,null,{"$f":"IF(FW34=\"\",\"\",VLOOKUP(FW34,Teilnehmer!$A$3:$C$102,2))","v":""},null,null,null,{"$f":"IF(GA34=\"\",\"\",VLOOKUP(GA34,Teilnehmer!$A$3:$C$102,2))","v":""},null,null,{"$f":"IF(GD34=\"\",\"\",VLOOKUP(GD34,Teilnehmer!$A$3:$C$102,2))","v":""},null,null,null,{"$f":"IF(GH34=\"\",\"\",VLOOKUP(GH34,Teilnehmer!$A$3:$C$102,2))","v":""},null,null,{"$f":"IF(GK34=\"\",\"\",VLOOKUP(GK34,Teilnehmer!$A$3:$C$102,2))","v":""},null,null,null,{"$f":"IF(GO34=\"\",\"\",VLOOKUP(GO34,Teilnehmer!$A$3:$C$102,2))","v":""},null,null,{"$f":"IF(GR34=\"\",\"\",VLOOKUP(GR34,Teilnehmer!$A$3:$C$102,2))","v":""},null,null,null,{"$f":"IF(GV34=\"\",\"\",VLOOKUP(GV34,Teilnehmer!$A$3:$C$102,2))","v":""},null,null,{"$f":"IF(GY34=\"\",\"\",VLOOKUP(GY34,Teilnehmer!$A$3:$C$102,2))","v":""},null,null,null,{"$f":"IF(HC34=\"\",\"\",VLOOKUP(HC34,Teilnehmer!$A$3:$C$102,2))","v":""},null,null,{"$f":"IF(HF34=\"\",\"\",VLOOKUP(HF34,Teilnehmer!$A$3:$C$102,2))","v":""},null,null,null,{"$f":"IF(HJ34=\"\",\"\",VLOOKUP(HJ34,Teilnehmer!$A$3:$C$102,2))","v":""},null,null,{"$f":"IF(HM34=\"\",\"\",VLOOKUP(HM34,Teilnehmer!$A$3:$C$102,2))","v":""},null,null,null,{"$f":"IF(HQ34=\"\",\"\",VLOOKUP(HQ34,Teilnehmer!$A$3:$C$102,2))","v":""},null,null,{"$f":"IF(HT34=\"\",\"\",VLOOKUP(HT34,Teilnehmer!$A$3:$C$102,2))","v":""},null,null,null,{"$f":"IF(HX34=\"\",\"\",VLOOKUP(HX34,Teilnehmer!$A$3:$C$102,2))","v":""},null,null,{"$f":"IF(IA34=\"\",\"\",VLOOKUP(IA34,Teilnehmer!$A$3:$C$102,2))","v":""},null,null,null,{"$f":"IF(IE34=\"\",\"\",VLOOKUP(IE34,Teilnehmer!$A$3:$C$102,2))","v":""},null,null,{"$f":"IF(IH34=\"\",\"\",VLOOKUP(IH34,Teilnehmer!$A$3:$C$102,2))","v":""},null,null,null,{"$f":"IF(IL34=\"\",\"\",VLOOKUP(IL34,Teilnehmer!$A$3:$C$102,2))","v":""},null,null,{"$f":"IF(IO34=\"\",\"\",VLOOKUP(IO34,Teilnehmer!$A$3:$C$102,2))","v":""},null,null,null,{"$f":"IF(IS34=\"\",\"\",VLOOKUP(IS34,Teilnehmer!$A$3:$C$102,2))","v":""},null,null,{"$f":"IF(IV34=\"\",\"\",VLOOKUP(IV34,Teilnehmer!$A$3:$C$102,2))","v":""},null,null,null,{"$f":"IF(IZ34=\"\",\"\",VLOOKUP(IZ34,Teilnehmer!$A$3:$C$102,2))","v":""},null,null,{"$f":"IF(JC34=\"\",\"\",VLOOKUP(JC34,Teilnehmer!$A$3:$C$102,2))","v":""},null,null,null,{"$f":"IF(JG34=\"\",\"\",VLOOKUP(JG34,Teilnehmer!$A$3:$C$102,2))","v":""},null,null,{"$f":"IF(JJ34=\"\",\"\",VLOOKUP(JJ34,Teilnehmer!$A$3:$C$102,2))","v":""},null,null,null,{"$f":"IF(JN34=\"\",\"\",VLOOKUP(JN34,Teilnehmer!$A$3:$C$102,2))","v":""},null,null,{"$f":"IF(JQ34=\"\",\"\",VLOOKUP(JQ34,Teilnehmer!$A$3:$C$102,2))","v":""},null,null,null,{"$f":"IF(JU34=\"\",\"\",VLOOKUP(JU34,Teilnehmer!$A$3:$C$102,2))","v":""},null,null,{"$f":"IF(JX34=\"\",\"\",VLOOKUP(JX34,Teilnehmer!$A$3:$C$102,2))","v":""},null,null,null,{"$f":"IF(KB34=\"\",\"\",VLOOKUP(KB34,Teilnehmer!$A$3:$C$102,2))","v":""},null,null,{"$f":"IF(KE34=\"\",\"\",VLOOKUP(KE34,Teilnehmer!$A$3:$C$102,2))","v":""},null,null,null,{"$f":"IF(KI34=\"\",\"\",VLOOKUP(KI34,Teilnehmer!$A$3:$C$102,2))","v":""},null,null,{"$f":"IF(KL34=\"\",\"\",VLOOKUP(KL34,Teilnehmer!$A$3:$C$102,2))","v":""},null,null,null,{"$f":"IF(KP34=\"\",\"\",VLOOKUP(KP34,Teilnehmer!$A$3:$C$102,2))","v":""},null,null,{"$f":"IF(KS34=\"\",\"\",VLOOKUP(KS34,Teilnehmer!$A$3:$C$102,2))","v":""}]
[null,{"$f":"IF(A35=\"\",\"\",VLOOKUP(A35,Teilnehmer!$A$3:$C$102,2))","v":""},null,null,{"$f":"IF(D35=\"\",\"\",VLOOKUP(D35,Teilnehmer!$A$3:$C$102,2))","v":""},null,null,null,{"$f":"IF(H35=\"\",\"\",VLOOKUP(H35,Teilnehmer!$A$3:$C$102,2))","v":""},null,null,{"$f":"IF(K35=\"\",\"\",VLOOKUP(K35,Teilnehmer!$A$3:$C$102,2))","v":""},null,null,null,{"$f":"IF(O35=\"\",\"\",VLOOKUP(O35,Teilnehmer!$A$3:$C$102,2))","v":""},null,null,{"$f":"IF(R35=\"\",\"\",VLOOKUP(R35,Teilnehmer!$A$3:$C$102,2))","v":""},null,null,null,{"$f":"IF(V35=\"\",\"\",VLOOKUP(V35,Teilnehmer!$A$3:$C$102,2))","v":""},null,null,{"$f":"IF(Y35=\"\",\"\",VLOOKUP(Y35,Teilnehmer!$A$3:$C$102,2))","v":""},null,null,null,{"$f":"IF(AC35=\"\",\"\",VLOOKUP(AC35,Teilnehmer!$A$3:$C$102,2))","v":""},null,null,{"$f":"IF(AF35=\"\",\"\",VLOOKUP(AF35,Teilnehmer!$A$3:$C$102,2))","v":""},null,null,null,{"$f":"IF(AJ35=\"\",\"\",VLOOKUP(AJ35,Teilnehmer!$A$3:$C$102,2))","v":""},null,null,{"$f":"IF(AM35=\"\",\"\",VLOOKUP(AM35,Teilnehmer!$A$3:$C$102,2))","v":""},null,null,null,{"$f":"IF(AQ35=\"\",\"\",VLOOKUP(AQ35,Teilnehmer!$A$3:$C$102,2))","v":""},null,null,{"$f":"IF(AT35=\"\",\"\",VLOOKUP(AT35,Teilnehmer!$A$3:$C$102,2))","v":""},null,null,null,{"$f":"IF(AX35=\"\",\"\",VLOOKUP(AX35,Teilnehmer!$A$3:$C$102,2))","v":""},null,null,{"$f":"IF(BA35=\"\",\"\",VLOOKUP(BA35,Teilnehmer!$A$3:$C$102,2))","v":""},null,null,null,{"$f":"IF(BE35=\"\",\"\",VLOOKUP(BE35,Teilnehmer!$A$3:$C$102,2))","v":""},null,null,{"$f":"IF(BH35=\"\",\"\",VLOOKUP(BH35,Teilnehmer!$A$3:$C$102,2))","v":""},null,null,null,{"$f":"IF(BL35=\"\",\"\",VLOOKUP(BL35,Teilnehmer!$A$3:$C$102,2))","v":""},null,null,{"$f":"IF(BO35=\"\",\"\",VLOOKUP(BO35,Teilnehmer!$A$3:$C$102,2))","v":""},null,null,null,{"$f":"IF(BS35=\"\",\"\",VLOOKUP(BS35,Teilnehmer!$A$3:$C$102,2))","v":""},null,null,{"$f":"IF(BV35=\"\",\"\",VLOOKUP(BV35,Teilnehmer!$A$3:$C$102,2))","v":""},null,null,null,{"$f":"IF(BZ35=\"\",\"\",VLOOKUP(BZ35,Teilnehmer!$A$3:$C$102,2))","v":""},null,null,{"$f":"IF(CC35=\"\",\"\",VLOOKUP(CC35,Teilnehmer!$A$3:$C$102,2))","v":""},null,null,null,{"$f":"IF(CG35=\"\",\"\",VLOOKUP(CG35,Teilnehmer!$A$3:$C$102,2))","v":""},null,null,{"$f":"IF(CJ35=\"\",\"\",VLOOKUP(CJ35,Teilnehmer!$A$3:$C$102,2))","v":""},null,null,null,{"$f":"IF(CN35=\"\",\"\",VLOOKUP(CN35,Teilnehmer!$A$3:$C$102,2))","v":""},null,null,{"$f":"IF(CQ35=\"\",\"\",VLOOKUP(CQ35,Teilnehmer!$A$3:$C$102,2))","v":""},null,null,null,{"$f":"IF(CU35=\"\",\"\",VLOOKUP(CU35,Teilnehmer!$A$3:$C$102,2))","v":""},null,null,{"$f":"IF(CX35=\"\",\"\",VLOOKUP(CX35,Teilnehmer!$A$3:$C$102,2))","v":""},null,null,null,{"$f":"IF(DB35=\"\",\"\",VLOOKUP(DB35,Teilnehmer!$A$3:$C$102,2))","v":""},null,null,{"$f":"IF(DE35=\"\",\"\",VLOOKUP(DE35,Teilnehmer!$A$3:$C$102,2))","v":""},null,null,null,{"$f":"IF(DI35=\"\",\"\",VLOOKUP(DI35,Teilnehmer!$A$3:$C$102,2))","v":""},null,null,{"$f":"IF(DL35=\"\",\"\",VLOOKUP(DL35,Teilnehmer!$A$3:$C$102,2))","v":""},null,null,null,{"$f":"IF(DP35=\"\",\"\",VLOOKUP(DP35,Teilnehmer!$A$3:$C$102,2))","v":""},null,null,{"$f":"IF(DS35=\"\",\"\",VLOOKUP(DS35,Teilnehmer!$A$3:$C$102,2))","v":""},null,null,null,{"$f":"IF(DW35=\"\",\"\",VLOOKUP(DW35,Teilnehmer!$A$3:$C$102,2))","v":""},null,null,{"$f":"IF(DZ35=\"\",\"\",VLOOKUP(DZ35,Teilnehmer!$A$3:$C$102,2))","v":""},null,null,null,{"$f":"IF(ED35=\"\",\"\",VLOOKUP(ED35,Teilnehmer!$A$3:$C$102,2))","v":""},null,null,{"$f":"IF(EG35=\"\",\"\",VLOOKUP(EG35,Teilnehmer!$A$3:$C$102,2))","v":""},null,null,null,{"$f":"IF(EK35=\"\",\"\",VLOOKUP(EK35,Teilnehmer!$A$3:$C$102,2))","v":""},null,null,{"$f":"IF(EN35=\"\",\"\",VLOOKUP(EN35,Teilnehmer!$A$3:$C$102,2))","v":""},null,null,null,{"$f":"IF(ER35=\"\",\"\",VLOOKUP(ER35,Teilnehmer!$A$3:$C$102,2))","v":""},null,null,{"$f":"IF(EU35=\"\",\"\",VLOOKUP(EU35,Teilnehmer!$A$3:$C$102,2))","v":""},null,null,null,{"$f":"IF(EY35=\"\",\"\",VLOOKUP(EY35,Teilnehmer!$A$3:$C$102,2))","v":""},null,null,{"$f":"IF(FB35=\"\",\"\",VLOOKUP(FB35,Teilnehmer!$A$3:$C$102,2))","v":""},null,null,null,{"$f":"IF(FF35=\"\",\"\",VLOOKUP(FF35,Teilnehmer!$A$3:$C$102,2))","v":""},null,null,{"$f":"IF(FI35=\"\",\"\",VLOOKUP(FI35,Teilnehmer!$A$3:$C$102,2))","v":""},null,null,null,{"$f":"IF(FM35=\"\",\"\",VLOOKUP(FM35,Teilnehmer!$A$3:$C$102,2))","v":""},null,null,{"$f":"IF(FP35=\"\",\"\",VLOOKUP(FP35,Teilnehmer!$A$3:$C$102,2))","v":""},null,null,null,{"$f":"IF(FT35=\"\",\"\",VLOOKUP(FT35,Teilnehmer!$A$3:$C$102,2))","v":""},null,null,{"$f":"IF(FW35=\"\",\"\",VLOOKUP(FW35,Teilnehmer!$A$3:$C$102,2))","v":""},null,null,null,{"$f":"IF(GA35=\"\",\"\",VLOOKUP(GA35,Teilnehmer!$A$3:$C$102,2))","v":""},null,null,{"$f":"IF(GD35=\"\",\"\",VLOOKUP(GD35,Teilnehmer!$A$3:$C$102,2))","v":""},null,null,null,{"$f":"IF(GH35=\"\",\"\",VLOOKUP(GH35,Teilnehmer!$A$3:$C$102,2))","v":""},null,null,{"$f":"IF(GK35=\"\",\"\",VLOOKUP(GK35,Teilnehmer!$A$3:$C$102,2))","v":""},null,null,null,{"$f":"IF(GO35=\"\",\"\",VLOOKUP(GO35,Teilnehmer!$A$3:$C$102,2))","v":""},null,null,{"$f":"IF(GR35=\"\",\"\",VLOOKUP(GR35,Teilnehmer!$A$3:$C$102,2))","v":""},null,null,null,{"$f":"IF(GV35=\"\",\"\",VLOOKUP(GV35,Teilnehmer!$A$3:$C$102,2))","v":""},null,null,{"$f":"IF(GY35=\"\",\"\",VLOOKUP(GY35,Teilnehmer!$A$3:$C$102,2))","v":""},null,null,null,{"$f":"IF(HC35=\"\",\"\",VLOOKUP(HC35,Teilnehmer!$A$3:$C$102,2))","v":""},null,null,{"$f":"IF(HF35=\"\",\"\",VLOOKUP(HF35,Teilnehmer!$A$3:$C$102,2))","v":""},null,null,null,{"$f":"IF(HJ35=\"\",\"\",VLOOKUP(HJ35,Teilnehmer!$A$3:$C$102,2))","v":""},null,null,{"$f":"IF(HM35=\"\",\"\",VLOOKUP(HM35,Teilnehmer!$A$3:$C$102,2))","v":""},null,null,null,{"$f":"IF(HQ35=\"\",\"\",VLOOKUP(HQ35,Teilnehmer!$A$3:$C$102,2))","v":""},null,null,{"$f":"IF(HT35=\"\",\"\",VLOOKUP(HT35,Teilnehmer!$A$3:$C$102,2))","v":""},null,null,null,{"$f":"IF(HX35=\"\",\"\",VLOOKUP(HX35,Teilnehmer!$A$3:$C$102,2))","v":""},null,null,{"$f":"IF(IA35=\"\",\"\",VLOOKUP(IA35,Teilnehmer!$A$3:$C$102,2))","v":""},null,null,null,{"$f":"IF(IE35=\"\",\"\",VLOOKUP(IE35,Teilnehmer!$A$3:$C$102,2))","v":""},null,null,{"$f":"IF(IH35=\"\",\"\",VLOOKUP(IH35,Teilnehmer!$A$3:$C$102,2))","v":""},null,null,null,{"$f":"IF(IL35=\"\",\"\",VLOOKUP(IL35,Teilnehmer!$A$3:$C$102,2))","v":""},null,null,{"$f":"IF(IO35=\"\",\"\",VLOOKUP(IO35,Teilnehmer!$A$3:$C$102,2))","v":""},null,null,null,{"$f":"IF(IS35=\"\",\"\",VLOOKUP(IS35,Teilnehmer!$A$3:$C$102,2))","v":""},null,null,{"$f":"IF(IV35=\"\",\"\",VLOOKUP(IV35,Teilnehmer!$A$3:$C$102,2))","v":""},null,null,null,{"$f":"IF(IZ35=\"\",\"\",VLOOKUP(IZ35,Teilnehmer!$A$3:$C$102,2))","v":""},null,null,{"$f":"IF(JC35=\"\",\"\",VLOOKUP(JC35,Teilnehmer!$A$3:$C$102,2))","v":""},null,null,null,{"$f":"IF(JG35=\"\",\"\",VLOOKUP(JG35,Teilnehmer!$A$3:$C$102,2))","v":""},null,null,{"$f":"IF(JJ35=\"\",\"\",VLOOKUP(JJ35,Teilnehmer!$A$3:$C$102,2))","v":""},null,null,null,{"$f":"IF(JN35=\"\",\"\",VLOOKUP(JN35,Teilnehmer!$A$3:$C$102,2))","v":""},null,null,{"$f":"IF(JQ35=\"\",\"\",VLOOKUP(JQ35,Teilnehmer!$A$3:$C$102,2))","v":""},null,null,null,{"$f":"IF(JU35=\"\",\"\",VLOOKUP(JU35,Teilnehmer!$A$3:$C$102,2))","v":""},null,null,{"$f":"IF(JX35=\"\",\"\",VLOOKUP(JX35,Teilnehmer!$A$3:$C$102,2))","v":""},null,null,null,{"$f":"IF(KB35=\"\",\"\",VLOOKUP(KB35,Teilnehmer!$A$3:$C$102,2))","v":""},null,null,{"$f":"IF(KE35=\"\",\"\",VLOOKUP(KE35,Teilnehmer!$A$3:$C$102,2))","v":""},null,null,null,{"$f":"IF(KI35=\"\",\"\",VLOOKUP(KI35,Teilnehmer!$A$3:$C$102,2))","v":""},null,null,{"$f":"IF(KL35=\"\",\"\",VLOOKUP(KL35,Teilnehmer!$A$3:$C$102,2))","v":""},null,null,null,{"$f":"IF(KP35=\"\",\"\",VLOOKUP(KP35,Teilnehmer!$A$3:$C$102,2))","v":""},null,null,{"$f":"IF(KS35=\"\",\"\",VLOOKUP(KS35,Teilnehmer!$A$3:$C$102,2))","v":""}]
[null,{"$f":"IF(A36=\"\",\"\",VLOOKUP(A36,Teilnehmer!$A$3:$C$102,2))","v":""},null,null,{"$f":"IF(D36=\"\",\"\",VLOOKUP(D36,Teilnehmer!$A$3:$C$102,2))","v":""},null,null,null,{"$f":"IF(H36=\"\",\"\",VLOOKUP(H36,Teilnehmer!$A$3:$C$102,2))","v":""},null,null,{"$f":"IF(K36=\"\",\"\",VLOOKUP(K36,Teilnehmer!$A$3:$C$102,2))","v":""},null,null,null,{"$f":"IF(O36=\"\",\"\",VLOOKUP(O36,Teilnehmer!$A$3:$C$102,2))","v":""},null,null,{"$f":"IF(R36=\"\",\"\",VLOOKUP(R36,Teilnehmer!$A$3:$C$102,2))","v":""},null,null,null,{"$f":"IF(V36=\"\",\"\",VLOOKUP(V36,Teilnehmer!$A$3:$C$102,2))","v":""},null,null,{"$f":"IF(Y36=\"\",\"\",VLOOKUP(Y36,Teilnehmer!$A$3:$C$102,2))","v":""},null,null,null,{"$f":"IF(AC36=\"\",\"\",VLOOKUP(AC36,Teilnehmer!$A$3:$C$102,2))","v":""},null,null,{"$f":"IF(AF36=\"\",\"\",VLOOKUP(AF36,Teilnehmer!$A$3:$C$102,2))","v":""},null,null,null,{"$f":"IF(AJ36=\"\",\"\",VLOOKUP(AJ36,Teilnehmer!$A$3:$C$102,2))","v":""},null,null,{"$f":"IF(AM36=\"\",\"\",VLOOKUP(AM36,Teilnehmer!$A$3:$C$102,2))","v":""},null,null,null,{"$f":"IF(AQ36=\"\",\"\",VLOOKUP(AQ36,Teilnehmer!$A$3:$C$102,2))","v":""},null,null,{"$f":"IF(AT36=\"\",\"\",VLOOKUP(AT36,Teilnehmer!$A$3:$C$102,2))","v":""},null,null,null,{"$f":"IF(AX36=\"\",\"\",VLOOKUP(AX36,Teilnehmer!$A$3:$C$102,2))","v":""},null,null,{"$f":"IF(BA36=\"\",\"\",VLOOKUP(BA36,Teilnehmer!$A$3:$C$102,2))","v":""},null,null,null,{"$f":"IF(BE36=\"\",\"\",VLOOKUP(BE36,Teilnehmer!$A$3:$C$102,2))","v":""},null,null,{"$f":"IF(BH36=\"\",\"\",VLOOKUP(BH36,Teilnehmer!$A$3:$C$102,2))","v":""},null,null,null,{"$f":"IF(BL36=\"\",\"\",VLOOKUP(BL36,Teilnehmer!$A$3:$C$102,2))","v":""},null,null,{"$f":"IF(BO36=\"\",\"\",VLOOKUP(BO36,Teilnehmer!$A$3:$C$102,2))","v":""},null,null,null,{"$f":"IF(BS36=\"\",\"\",VLOOKUP(BS36,Teilnehmer!$A$3:$C$102,2))","v":""},null,null,{"$f":"IF(BV36=\"\",\"\",VLOOKUP(BV36,Teilnehmer!$A$3:$C$102,2))","v":""},null,null,null,{"$f":"IF(BZ36=\"\",\"\",VLOOKUP(BZ36,Teilnehmer!$A$3:$C$102,2))","v":""},null,null,{"$f":"IF(CC36=\"\",\"\",VLOOKUP(CC36,Teilnehmer!$A$3:$C$102,2))","v":""},null,null,null,{"$f":"IF(CG36=\"\",\"\",VLOOKUP(CG36,Teilnehmer!$A$3:$C$102,2))","v":""},null,null,{"$f":"IF(CJ36=\"\",\"\",VLOOKUP(CJ36,Teilnehmer!$A$3:$C$102,2))","v":""},null,null,null,{"$f":"IF(CN36=\"\",\"\",VLOOKUP(CN36,Teilnehmer!$A$3:$C$102,2))","v":""},null,null,{"$f":"IF(CQ36=\"\",\"\",VLOOKUP(CQ36,Teilnehmer!$A$3:$C$102,2))","v":""},null,null,null,{"$f":"IF(CU36=\"\",\"\",VLOOKUP(CU36,Teilnehmer!$A$3:$C$102,2))","v":""},null,null,{"$f":"IF(CX36=\"\",\"\",VLOOKUP(CX36,Teilnehmer!$A$3:$C$102,2))","v":""},null,null,null,{"$f":"IF(DB36=\"\",\"\",VLOOKUP(DB36,Teilnehmer!$A$3:$C$102,2))","v":""},null,null,{"$f":"IF(DE36=\"\",\"\",VLOOKUP(DE36,Teilnehmer!$A$3:$C$102,2))","v":""},null,null,null,{"$f":"IF(DI36=\"\",\"\",VLOOKUP(DI36,Teilnehmer!$A$3:$C$102,2))","v":""},null,null,{"$f":"IF(DL36=\"\",\"\",VLOOKUP(DL36,Teilnehmer!$A$3:$C$102,2))","v":""},null,null,null,{"$f":"IF(DP36=\"\",\"\",VLOOKUP(DP36,Teilnehmer!$A$3:$C$102,2))","v":""},null,null,{"$f":"IF(DS36=\"\",\"\",VLOOKUP(DS36,Teilnehmer!$A$3:$C$102,2))","v":""},null,null,null,{"$f":"IF(DW36=\"\",\"\",VLOOKUP(DW36,Teilnehmer!$A$3:$C$102,2))","v":""},null,null,{"$f":"IF(DZ36=\"\",\"\",VLOOKUP(DZ36,Teilnehmer!$A$3:$C$102,2))","v":""},null,null,null,{"$f":"IF(ED36=\"\",\"\",VLOOKUP(ED36,Teilnehmer!$A$3:$C$102,2))","v":""},null,null,{"$f":"IF(EG36=\"\",\"\",VLOOKUP(EG36,Teilnehmer!$A$3:$C$102,2))","v":""},null,null,null,{"$f":"IF(EK36=\"\",\"\",VLOOKUP(EK36,Teilnehmer!$A$3:$C$102,2))","v":""},null,null,{"$f":"IF(EN36=\"\",\"\",VLOOKUP(EN36,Teilnehmer!$A$3:$C$102,2))","v":""},null,null,null,{"$f":"IF(ER36=\"\",\"\",VLOOKUP(ER36,Teilnehmer!$A$3:$C$102,2))","v":""},null,null,{"$f":"IF(EU36=\"\",\"\",VLOOKUP(EU36,Teilnehmer!$A$3:$C$102,2))","v":""},null,null,null,{"$f":"IF(EY36=\"\",\"\",VLOOKUP(EY36,Teilnehmer!$A$3:$C$102,2))","v":""},null,null,{"$f":"IF(FB36=\"\",\"\",VLOOKUP(FB36,Teilnehmer!$A$3:$C$102,2))","v":""},null,null,null,{"$f":"IF(FF36=\"\",\"\",VLOOKUP(FF36,Teilnehmer!$A$3:$C$102,2))","v":""},null,null,{"$f":"IF(FI36=\"\",\"\",VLOOKUP(FI36,Teilnehmer!$A$3:$C$102,2))","v":""},null,null,null,{"$f":"IF(FM36=\"\",\"\",VLOOKUP(FM36,Teilnehmer!$A$3:$C$102,2))","v":""},null,null,{"$f":"IF(FP36=\"\",\"\",VLOOKUP(FP36,Teilnehmer!$A$3:$C$102,2))","v":""},null,null,null,{"$f":"IF(FT36=\"\",\"\",VLOOKUP(FT36,Teilnehmer!$A$3:$C$102,2))","v":""},null,null,{"$f":"IF(FW36=\"\",\"\",VLOOKUP(FW36,Teilnehmer!$A$3:$C$102,2))","v":""},null,null,null,{"$f":"IF(GA36=\"\",\"\",VLOOKUP(GA36,Teilnehmer!$A$3:$C$102,2))","v":""},null,null,{"$f":"IF(GD36=\"\",\"\",VLOOKUP(GD36,Teilnehmer!$A$3:$C$102,2))","v":""},null,null,null,{"$f":"IF(GH36=\"\",\"\",VLOOKUP(GH36,Teilnehmer!$A$3:$C$102,2))","v":""},null,null,{"$f":"IF(GK36=\"\",\"\",VLOOKUP(GK36,Teilnehmer!$A$3:$C$102,2))","v":""},null,null,null,{"$f":"IF(GO36=\"\",\"\",VLOOKUP(GO36,Teilnehmer!$A$3:$C$102,2))","v":""},null,null,{"$f":"IF(GR36=\"\",\"\",VLOOKUP(GR36,Teilnehmer!$A$3:$C$102,2))","v":""},null,null,null,{"$f":"IF(GV36=\"\",\"\",VLOOKUP(GV36,Teilnehmer!$A$3:$C$102,2))","v":""},null,null,{"$f":"IF(GY36=\"\",\"\",VLOOKUP(GY36,Teilnehmer!$A$3:$C$102,2))","v":""},null,null,null,{"$f":"IF(HC36=\"\",\"\",VLOOKUP(HC36,Teilnehmer!$A$3:$C$102,2))","v":""},null,null,{"$f":"IF(HF36=\"\",\"\",VLOOKUP(HF36,Teilnehmer!$A$3:$C$102,2))","v":""},null,null,null,{"$f":"IF(HJ36=\"\",\"\",VLOOKUP(HJ36,Teilnehmer!$A$3:$C$102,2))","v":""},null,null,{"$f":"IF(HM36=\"\",\"\",VLOOKUP(HM36,Teilnehmer!$A$3:$C$102,2))","v":""},null,null,null,{"$f":"IF(HQ36=\"\",\"\",VLOOKUP(HQ36,Teilnehmer!$A$3:$C$102,2))","v":""},null,null,{"$f":"IF(HT36=\"\",\"\",VLOOKUP(HT36,Teilnehmer!$A$3:$C$102,2))","v":""},null,null,null,{"$f":"IF(HX36=\"\",\"\",VLOOKUP(HX36,Teilnehmer!$A$3:$C$102,2))","v":""},null,null,{"$f":"IF(IA36=\"\",\"\",VLOOKUP(IA36,Teilnehmer!$A$3:$C$102,2))","v":""},null,null,null,{"$f":"IF(IE36=\"\",\"\",VLOOKUP(IE36,Teilnehmer!$A$3:$C$102,2))","v":""},null,null,{"$f":"IF(IH36=\"\",\"\",VLOOKUP(IH36,Teilnehmer!$A$3:$C$102,2))","v":""},null,null,null,{"$f":"IF(IL36=\"\",\"\",VLOOKUP(IL36,Teilnehmer!$A$3:$C$102,2))","v":""},null,null,{"$f":"IF(IO36=\"\",\"\",VLOOKUP(IO36,Teilnehmer!$A$3:$C$102,2))","v":""},null,null,null,{"$f":"IF(IS36=\"\",\"\",VLOOKUP(IS36,Teilnehmer!$A$3:$C$102,2))","v":""},null,null,{"$f":"IF(IV36=\"\",\"\",VLOOKUP(IV36,Teilnehmer!$A$3:$C$102,2))","v":""},null,null,null,{"$f":"IF(IZ36=\"\",\"\",VLOOKUP(IZ36,Teilnehmer!$A$3:$C$102,2))","v":""},null,null,{"$f":"IF(JC36=\"\",\"\",VLOOKUP(JC36,Teilnehmer!$A$3:$C$102,2))","v":""},null,null,null,{"$f":"IF(JG36=\"\",\"\",VLOOKUP(JG36,Teilnehmer!$A$3:$C$102,2))","v":""},null,null,{"$f":"IF(JJ36=\"\",\"\",VLOOKUP(JJ36,Teilnehmer!$A$3:$C$102,2))","v":""},null,null,null,{"$f":"IF(JN36=\"\",\"\",VLOOKUP(JN36,Teilnehmer!$A$3:$C$102,2))","v":""},null,null,{"$f":"IF(JQ36=\"\",\"\",VLOOKUP(JQ36,Teilnehmer!$A$3:$C$102,2))","v":""},null,null,null,{"$f":"IF(JU36=\"\",\"\",VLOOKUP(JU36,Teilnehmer!$A$3:$C$102,2))","v":""},null,null,{"$f":"IF(JX36=\"\",\"\",VLOOKUP(JX36,Teilnehmer!$A$3:$C$102,2))","v":""},null,null,null,{"$f":"IF(KB36=\"\",\"\",VLOOKUP(KB36,Teilnehmer!$A$3:$C$102,2))","v":""},null,null,{"$f":"IF(KE36=\"\",\"\",VLOOKUP(KE36,Teilnehmer!$A$3:$C$102,2))","v":""},null,null,null,{"$f":"IF(KI36=\"\",\"\",VLOOKUP(KI36,Teilnehmer!$A$3:$C$102,2))","v":""},null,null,{"$f":"IF(KL36=\"\",\"\",VLOOKUP(KL36,Teilnehmer!$A$3:$C$102,2))","v":""},null,null,null,{"$f":"IF(KP36=\"\",\"\",VLOOKUP(KP36,Teilnehmer!$A$3:$C$102,2))","v":""},null,null,{"$f":"IF(KS36=\"\",\"\",VLOOKUP(KS36,Teilnehmer!$A$3:$C$102,2))","v":""}]
[null,{"$f":"IF(A37=\"\",\"\",VLOOKUP(A37,Teilnehmer!$A$3:$C$102,2))","v":""},null,null,{"$f":"IF(D37=\"\",\"\",VLOOKUP(D37,Teilnehmer!$A$3:$C$102,2))","v":""},null,null,null,{"$f":"IF(H37=\"\",\"\",VLOOKUP(H37,Teilnehmer!$A$3:$C$102,2))","v":""},null,null,{"$f":"IF(K37=\"\",\"\",VLOOKUP(K37,Teilnehmer!$A$3:$C$102,2))","v":""},null,null,null,{"$f":"IF(O37=\"\",\"\",VLOOKUP(O37,Teilnehmer!$A$3:$C$102,2))","v":""},null,null,{"$f":"IF(R37=\"\",\"\",VLOOKUP(R37,Teilnehmer!$A$3:$C$102,2))","v":""},null,null,null,{"$f":"IF(V37=\"\",\"\",VLOOKUP(V37,Teilnehmer!$A$3:$C$102,2))","v":""},null,null,{"$f":"IF(Y37=\"\",\"\",VLOOKUP(Y37,Teilnehmer!$A$3:$C$102,2))","v":""},null,null,null,{"$f":"IF(AC37=\"\",\"\",VLOOKUP(AC37,Teilnehmer!$A$3:$C$102,2))","v":""},null,null,{"$f":"IF(AF37=\"\",\"\",VLOOKUP(AF37,Teilnehmer!$A$3:$C$102,2))","v":""},null,null,null,{"$f":"IF(AJ37=\"\",\"\",VLOOKUP(AJ37,Teilnehmer!$A$3:$C$102,2))","v":""},null,null,{"$f":"IF(AM37=\"\",\"\",VLOOKUP(AM37,Teilnehmer!$A$3:$C$102,2))","v":""},null,null,null,{"$f":"IF(AQ37=\"\",\"\",VLOOKUP(AQ37,Teilnehmer!$A$3:$C$102,2))","v":""},null,null,{"$f":"IF(AT37=\"\",\"\",VLOOKUP(AT37,Teilnehmer!$A$3:$C$102,2))","v":""},null,null,null,{"$f":"IF(AX37=\"\",\"\",VLOOKUP(AX37,Teilnehmer!$A$3:$C$102,2))","v":""},null,null,{"$f":"IF(BA37=\"\",\"\",VLOOKUP(BA37,Teilnehmer!$A$3:$C$102,2))","v":""},null,null,null,{"$f":"IF(BE37=\"\",\"\",VLOOKUP(BE37,Teilnehmer!$A$3:$C$102,2))","v":""},null,null,{"$f":"IF(BH37=\"\",\"\",VLOOKUP(BH37,Teilnehmer!$A$3:$C$102,2))","v":""},null,null,null,{"$f":"IF(BL37=\"\",\"\",VLOOKUP(BL37,Teilnehmer!$A$3:$C$102,2))","v":""},null,null,{"$f":"IF(BO37=\"\",\"\",VLOOKUP(BO37,Teilnehmer!$A$3:$C$102,2))","v":""},null,null,null,{"$f":"IF(BS37=\"\",\"\",VLOOKUP(BS37,Teilnehmer!$A$3:$C$102,2))","v":""},null,null,{"$f":"IF(BV37=\"\",\"\",VLOOKUP(BV37,Teilnehmer!$A$3:$C$102,2))","v":""},null,null,null,{"$f":"IF(BZ37=\"\",\"\",VLOOKUP(BZ37,Teilnehmer!$A$3:$C$102,2))","v":""},null,null,{"$f":"IF(CC37=\"\",\"\",VLOOKUP(CC37,Teilnehmer!$A$3:$C$102,2))","v":""},null,null,null,{"$f":"IF(CG37=\"\",\"\",VLOOKUP(CG37,Teilnehmer!$A$3:$C$102,2))","v":""},null,null,{"$f":"IF(CJ37=\"\",\"\",VLOOKUP(CJ37,Teilnehmer!$A$3:$C$102,2))","v":""},null,null,null,{"$f":"IF(CN37=\"\",\"\",VLOOKUP(CN37,Teilnehmer!$A$3:$C$102,2))","v":""},null,null,{"$f":"IF(CQ37=\"\",\"\",VLOOKUP(CQ37,Teilnehmer!$A$3:$C$102,2))","v":""},null,null,null,{"$f":"IF(CU37=\"\",\"\",VLOOKUP(CU37,Teilnehmer!$A$3:$C$102,2))","v":""},null,null,{"$f":"IF(CX37=\"\",\"\",VLOOKUP(CX37,Teilnehmer!$A$3:$C$102,2))","v":""},null,null,null,{"$f":"IF(DB37=\"\",\"\",VLOOKUP(DB37,Teilnehmer!$A$3:$C$102,2))","v":""},null,null,{"$f":"IF(DE37=\"\",\"\",VLOOKUP(DE37,Teilnehmer!$A$3:$C$102,2))","v":""},null,null,null,{"$f":"IF(DI37=\"\",\"\",VLOOKUP(DI37,Teilnehmer!$A$3:$C$102,2))","v":""},null,null,{"$f":"IF(DL37=\"\",\"\",VLOOKUP(DL37,Teilnehmer!$A$3:$C$102,2))","v":""},null,null,null,{"$f":"IF(DP37=\"\",\"\",VLOOKUP(DP37,Teilnehmer!$A$3:$C$102,2))","v":""},null,null,{"$f":"IF(DS37=\"\",\"\",VLOOKUP(DS37,Teilnehmer!$A$3:$C$102,2))","v":""},null,null,null,{"$f":"IF(DW37=\"\",\"\",VLOOKUP(DW37,Teilnehmer!$A$3:$C$102,2))","v":""},null,null,{"$f":"IF(DZ37=\"\",\"\",VLOOKUP(DZ37,Teilnehmer!$A$3:$C$102,2))","v":""},null,null,null,{"$f":"IF(ED37=\"\",\"\",VLOOKUP(ED37,Teilnehmer!$A$3:$C$102,2))","v":""},null,null,{"$f":"IF(EG37=\"\",\"\",VLOOKUP(EG37,Teilnehmer!$A$3:$C$102,2))","v":""},null,null,null,{"$f":"IF(EK37=\"\",\"\",VLOOKUP(EK37,Teilnehmer!$A$3:$C$102,2))","v":""},null,null,{"$f":"IF(EN37=\"\",\"\",VLOOKUP(EN37,Teilnehmer!$A$3:$C$102,2))","v":""},null,null,null,{"$f":"IF(ER37=\"\",\"\",VLOOKUP(ER37,Teilnehmer!$A$3:$C$102,2))","v":""},null,null,{"$f":"IF(EU37=\"\",\"\",VLOOKUP(EU37,Teilnehmer!$A$3:$C$102,2))","v":""},null,null,null,{"$f":"IF(EY37=\"\",\"\",VLOOKUP(EY37,Teilnehmer!$A$3:$C$102,2))","v":""},null,null,{"$f":"IF(FB37=\"\",\"\",VLOOKUP(FB37,Teilnehmer!$A$3:$C$102,2))","v":""},null,null,null,{"$f":"IF(FF37=\"\",\"\",VLOOKUP(FF37,Teilnehmer!$A$3:$C$102,2))","v":""},null,null,{"$f":"IF(FI37=\"\",\"\",VLOOKUP(FI37,Teilnehmer!$A$3:$C$102,2))","v":""},null,null,null,{"$f":"IF(FM37=\"\",\"\",VLOOKUP(FM37,Teilnehmer!$A$3:$C$102,2))","v":""},null,null,{"$f":"IF(FP37=\"\",\"\",VLOOKUP(FP37,Teilnehmer!$A$3:$C$102,2))","v":""},null,null,null,{"$f":"IF(FT37=\"\",\"\",VLOOKUP(FT37,Teilnehmer!$A$3:$C$102,2))","v":""},null,null,{"$f":"IF(FW37=\"\",\"\",VLOOKUP(FW37,Teilnehmer!$A$3:$C$102,2))","v":""},null,null,null,{"$f":"IF(GA37=\"\",\"\",VLOOKUP(GA37,Teilnehmer!$A$3:$C$102,2))","v":""},null,null,{"$f":"IF(GD37=\"\",\"\",VLOOKUP(GD37,Teilnehmer!$A$3:$C$102,2))","v":""},null,null,null,{"$f":"IF(GH37=\"\",\"\",VLOOKUP(GH37,Teilnehmer!$A$3:$C$102,2))","v":""},null,null,{"$f":"IF(GK37=\"\",\"\",VLOOKUP(GK37,Teilnehmer!$A$3:$C$102,2))","v":""},null,null,null,{"$f":"IF(GO37=\"\",\"\",VLOOKUP(GO37,Teilnehmer!$A$3:$C$102,2))","v":""},null,null,{"$f":"IF(GR37=\"\",\"\",VLOOKUP(GR37,Teilnehmer!$A$3:$C$102,2))","v":""},null,null,null,{"$f":"IF(GV37=\"\",\"\",VLOOKUP(GV37,Teilnehmer!$A$3:$C$102,2))","v":""},null,null,{"$f":"IF(GY37=\"\",\"\",VLOOKUP(GY37,Teilnehmer!$A$3:$C$102,2))","v":""},null,null,null,{"$f":"IF(HC37=\"\",\"\",VLOOKUP(HC37,Teilnehmer!$A$3:$C$102,2))","v":""},null,null,{"$f":"IF(HF37=\"\",\"\",VLOOKUP(HF37,Teilnehmer!$A$3:$C$102,2))","v":""},null,null,null,{"$f":"IF(HJ37=\"\",\"\",VLOOKUP(HJ37,Teilnehmer!$A$3:$C$102,2))","v":""},null,null,{"$f":"IF(HM37=\"\",\"\",VLOOKUP(HM37,Teilnehmer!$A$3:$C$102,2))","v":""},null,null,null,{"$f":"IF(HQ37=\"\",\"\",VLOOKUP(HQ37,Teilnehmer!$A$3:$C$102,2))","v":""},null,null,{"$f":"IF(HT37=\"\",\"\",VLOOKUP(HT37,Teilnehmer!$A$3:$C$102,2))","v":""},null,null,null,{"$f":"IF(HX37=\"\",\"\",VLOOKUP(HX37,Teilnehmer!$A$3:$C$102,2))","v":""},null,null,{"$f":"IF(IA37=\"\",\"\",VLOOKUP(IA37,Teilnehmer!$A$3:$C$102,2))","v":""},null,null,null,{"$f":"IF(IE37=\"\",\"\",VLOOKUP(IE37,Teilnehmer!$A$3:$C$102,2))","v":""},null,null,{"$f":"IF(IH37=\"\",\"\",VLOOKUP(IH37,Teilnehmer!$A$3:$C$102,2))","v":""},null,null,null,{"$f":"IF(IL37=\"\",\"\",VLOOKUP(IL37,Teilnehmer!$A$3:$C$102,2))","v":""},null,null,{"$f":"IF(IO37=\"\",\"\",VLOOKUP(IO37,Teilnehmer!$A$3:$C$102,2))","v":""},null,null,null,{"$f":"IF(IS37=\"\",\"\",VLOOKUP(IS37,Teilnehmer!$A$3:$C$102,2))","v":""},null,null,{"$f":"IF(IV37=\"\",\"\",VLOOKUP(IV37,Teilnehmer!$A$3:$C$102,2))","v":""},null,null,null,{"$f":"IF(IZ37=\"\",\"\",VLOOKUP(IZ37,Teilnehmer!$A$3:$C$102,2))","v":""},null,null,{"$f":"IF(JC37=\"\",\"\",VLOOKUP(JC37,Teilnehmer!$A$3:$C$102,2))","v":""},null,null,null,{"$f":"IF(JG37=\"\",\"\",VLOOKUP(JG37,Teilnehmer!$A$3:$C$102,2))","v":""},null,null,{"$f":"IF(JJ37=\"\",\"\",VLOOKUP(JJ37,Teilnehmer!$A$3:$C$102,2))","v":""},null,null,null,{"$f":"IF(JN37=\"\",\"\",VLOOKUP(JN37,Teilnehmer!$A$3:$C$102,2))","v":""},null,null,{"$f":"IF(JQ37=\"\",\"\",VLOOKUP(JQ37,Teilnehmer!$A$3:$C$102,2))","v":""},null,null,null,{"$f":"IF(JU37=\"\",\"\",VLOOKUP(JU37,Teilnehmer!$A$3:$C$102,2))","v":""},null,null,{"$f":"IF(JX37=\"\",\"\",VLOOKUP(JX37,Teilnehmer!$A$3:$C$102,2))","v":""},null,null,null,{"$f":"IF(KB37=\"\",\"\",VLOOKUP(KB37,Teilnehmer!$A$3:$C$102,2))","v":""},null,null,{"$f":"IF(KE37=\"\",\"\",VLOOKUP(KE37,Teilnehmer!$A$3:$C$102,2))","v":""},null,null,null,{"$f":"IF(KI37=\"\",\"\",VLOOKUP(KI37,Teilnehmer!$A$3:$C$102,2))","v":""},null,null,{"$f":"IF(KL37=\"\",\"\",VLOOKUP(KL37,Teilnehmer!$A$3:$C$102,2))","v":""},null,null,null,{"$f":"IF(KP37=\"\",\"\",VLOOKUP(KP37,Teilnehmer!$A$3:$C$102,2))","v":""},null,null,{"$f":"IF(KS37=\"\",\"\",VLOOKUP(KS37,Teilnehmer!$A$3:$C$102,2))","v":""}]
[null,{"$f":"IF(A38=\"\",\"\",VLOOKUP(A38,Teilnehmer!$A$3:$C$102,2))","v":""},null,null,{"$f":"IF(D38=\"\",\"\",VLOOKUP(D38,Teilnehmer!$A$3:$C$102,2))","v":""},null,null,null,{"$f":"IF(H38=\"\",\"\",VLOOKUP(H38,Teilnehmer!$A$3:$C$102,2))","v":""},null,null,{"$f":"IF(K38=\"\",\"\",VLOOKUP(K38,Teilnehmer!$A$3:$C$102,2))","v":""},null,null,null,{"$f":"IF(O38=\"\",\"\",VLOOKUP(O38,Teilnehmer!$A$3:$C$102,2))","v":""},null,null,{"$f":"IF(R38=\"\",\"\",VLOOKUP(R38,Teilnehmer!$A$3:$C$102,2))","v":""},null,null,null,{"$f":"IF(V38=\"\",\"\",VLOOKUP(V38,Teilnehmer!$A$3:$C$102,2))","v":""},null,null,{"$f":"IF(Y38=\"\",\"\",VLOOKUP(Y38,Teilnehmer!$A$3:$C$102,2))","v":""},null,null,null,{"$f":"IF(AC38=\"\",\"\",VLOOKUP(AC38,Teilnehmer!$A$3:$C$102,2))","v":""},null,null,{"$f":"IF(AF38=\"\",\"\",VLOOKUP(AF38,Teilnehmer!$A$3:$C$102,2))","v":""},null,null,null,{"$f":"IF(AJ38=\"\",\"\",VLOOKUP(AJ38,Teilnehmer!$A$3:$C$102,2))","v":""},null,null,{"$f":"IF(AM38=\"\",\"\",VLOOKUP(AM38,Teilnehmer!$A$3:$C$102,2))","v":""},null,null,null,{"$f":"IF(AQ38=\"\",\"\",VLOOKUP(AQ38,Teilnehmer!$A$3:$C$102,2))","v":""},null,null,{"$f":"IF(AT38=\"\",\"\",VLOOKUP(AT38,Teilnehmer!$A$3:$C$102,2))","v":""},null,null,null,{"$f":"IF(AX38=\"\",\"\",VLOOKUP(AX38,Teilnehmer!$A$3:$C$102,2))","v":""},null,null,{"$f":"IF(BA38=\"\",\"\",VLOOKUP(BA38,Teilnehmer!$A$3:$C$102,2))","v":""},null,null,null,{"$f":"IF(BE38=\"\",\"\",VLOOKUP(BE38,Teilnehmer!$A$3:$C$102,2))","v":""},null,null,{"$f":"IF(BH38=\"\",\"\",VLOOKUP(BH38,Teilnehmer!$A$3:$C$102,2))","v":""},null,null,null,{"$f":"IF(BL38=\"\",\"\",VLOOKUP(BL38,Teilnehmer!$A$3:$C$102,2))","v":""},null,null,{"$f":"IF(BO38=\"\",\"\",VLOOKUP(BO38,Teilnehmer!$A$3:$C$102,2))","v":""},null,null,null,{"$f":"IF(BS38=\"\",\"\",VLOOKUP(BS38,Teilnehmer!$A$3:$C$102,2))","v":""},null,null,{"$f":"IF(BV38=\"\",\"\",VLOOKUP(BV38,Teilnehmer!$A$3:$C$102,2))","v":""},null,null,null,{"$f":"IF(BZ38=\"\",\"\",VLOOKUP(BZ38,Teilnehmer!$A$3:$C$102,2))","v":""},null,null,{"$f":"IF(CC38=\"\",\"\",VLOOKUP(CC38,Teilnehmer!$A$3:$C$102,2))","v":""},null,null,null,{"$f":"IF(CG38=\"\",\"\",VLOOKUP(CG38,Teilnehmer!$A$3:$C$102,2))","v":""},null,null,{"$f":"IF(CJ38=\"\",\"\",VLOOKUP(CJ38,Teilnehmer!$A$3:$C$102,2))","v":""},null,null,null,{"$f":"IF(CN38=\"\",\"\",VLOOKUP(CN38,Teilnehmer!$A$3:$C$102,2))","v":""},null,null,{"$f":"IF(CQ38=\"\",\"\",VLOOKUP(CQ38,Teilnehmer!$A$3:$C$102,2))","v":""},null,null,null,{"$f":"IF(CU38=\"\",\"\",VLOOKUP(CU38,Teilnehmer!$A$3:$C$102,2))","v":""},null,null,{"$f":"IF(CX38=\"\",\"\",VLOOKUP(CX38,Teilnehmer!$A$3:$C$102,2))","v":""},null,null,null,{"$f":"IF(DB38=\"\",\"\",VLOOKUP(DB38,Teilnehmer!$A$3:$C$102,2))","v":""},null,null,{"$f":"IF(DE38=\"\",\"\",VLOOKUP(DE38,Teilnehmer!$A$3:$C$102,2))","v":""},null,null,null,{"$f":"IF(DI38=\"\",\"\",VLOOKUP(DI38,Teilnehmer!$A$3:$C$102,2))","v":""},null,null,{"$f":"IF(DL38=\"\",\"\",VLOOKUP(DL38,Teilnehmer!$A$3:$C$102,2))","v":""},null,null,null,{"$f":"IF(DP38=\"\",\"\",VLOOKUP(DP38,Teilnehmer!$A$3:$C$102,2))","v":""},null,null,{"$f":"IF(DS38=\"\",\"\",VLOOKUP(DS38,Teilnehmer!$A$3:$C$102,2))","v":""},null,null,null,{"$f":"IF(DW38=\"\",\"\",VLOOKUP(DW38,Teilnehmer!$A$3:$C$102,2))","v":""},null,null,{"$f":"IF(DZ38=\"\",\"\",VLOOKUP(DZ38,Teilnehmer!$A$3:$C$102,2))","v":""},null,null,null,{"$f":"IF(ED38=\"\",\"\",VLOOKUP(ED38,Teilnehmer!$A$3:$C$102,2))","v":""},null,null,{"$f":"IF(EG38=\"\",\"\",VLOOKUP(EG38,Teilnehmer!$A$3:$C$102,2))","v":""},null,null,null,{"$f":"IF(EK38=\"\",\"\",VLOOKUP(EK38,Teilnehmer!$A$3:$C$102,2))","v":""},null,null,{"$f":"IF(EN38=\"\",\"\",VLOOKUP(EN38,Teilnehmer!$A$3:$C$102,2))","v":""},null,null,null,{"$f":"IF(ER38=\"\",\"\",VLOOKUP(ER38,Teilnehmer!$A$3:$C$102,2))","v":""},null,null,{"$f":"IF(EU38=\"\",\"\",VLOOKUP(EU38,Teilnehmer!$A$3:$C$102,2))","v":""},null,null,null,{"$f":"IF(EY38=\"\",\"\",VLOOKUP(EY38,Teilnehmer!$A$3:$C$102,2))","v":""},null,null,{"$f":"IF(FB38=\"\",\"\",VLOOKUP(FB38,Teilnehmer!$A$3:$C$102,2))","v":""},null,null,null,{"$f":"IF(FF38=\"\",\"\",VLOOKUP(FF38,Teilnehmer!$A$3:$C$102,2))","v":""},null,null,{"$f":"IF(FI38=\"\",\"\",VLOOKUP(FI38,Teilnehmer!$A$3:$C$102,2))","v":""},null,null,null,{"$f":"IF(FM38=\"\",\"\",VLOOKUP(FM38,Teilnehmer!$A$3:$C$102,2))","v":""},null,null,{"$f":"IF(FP38=\"\",\"\",VLOOKUP(FP38,Teilnehmer!$A$3:$C$102,2))","v":""},null,null,null,{"$f":"IF(FT38=\"\",\"\",VLOOKUP(FT38,Teilnehmer!$A$3:$C$102,2))","v":""},null,null,{"$f":"IF(FW38=\"\",\"\",VLOOKUP(FW38,Teilnehmer!$A$3:$C$102,2))","v":""},null,null,null,{"$f":"IF(GA38=\"\",\"\",VLOOKUP(GA38,Teilnehmer!$A$3:$C$102,2))","v":""},null,null,{"$f":"IF(GD38=\"\",\"\",VLOOKUP(GD38,Teilnehmer!$A$3:$C$102,2))","v":""},null,null,null,{"$f":"IF(GH38=\"\",\"\",VLOOKUP(GH38,Teilnehmer!$A$3:$C$102,2))","v":""},null,null,{"$f":"IF(GK38=\"\",\"\",VLOOKUP(GK38,Teilnehmer!$A$3:$C$102,2))","v":""},null,null,null,{"$f":"IF(GO38=\"\",\"\",VLOOKUP(GO38,Teilnehmer!$A$3:$C$102,2))","v":""},null,null,{"$f":"IF(GR38=\"\",\"\",VLOOKUP(GR38,Teilnehmer!$A$3:$C$102,2))","v":""},null,null,null,{"$f":"IF(GV38=\"\",\"\",VLOOKUP(GV38,Teilnehmer!$A$3:$C$102,2))","v":""},null,null,{"$f":"IF(GY38=\"\",\"\",VLOOKUP(GY38,Teilnehmer!$A$3:$C$102,2))","v":""},null,null,null,{"$f":"IF(HC38=\"\",\"\",VLOOKUP(HC38,Teilnehmer!$A$3:$C$102,2))","v":""},null,null,{"$f":"IF(HF38=\"\",\"\",VLOOKUP(HF38,Teilnehmer!$A$3:$C$102,2))","v":""},null,null,null,{"$f":"IF(HJ38=\"\",\"\",VLOOKUP(HJ38,Teilnehmer!$A$3:$C$102,2))","v":""},null,null,{"$f":"IF(HM38=\"\",\"\",VLOOKUP(HM38,Teilnehmer!$A$3:$C$102,2))","v":""},null,null,null,{"$f":"IF(HQ38=\"\",\"\",VLOOKUP(HQ38,Teilnehmer!$A$3:$C$102,2))","v":""},null,null,{"$f":"IF(HT38=\"\",\"\",VLOOKUP(HT38,Teilnehmer!$A$3:$C$102,2))","v":""},null,null,null,{"$f":"IF(HX38=\"\",\"\",VLOOKUP(HX38,Teilnehmer!$A$3:$C$102,2))","v":""},null,null,{"$f":"IF(IA38=\"\",\"\",VLOOKUP(IA38,Teilnehmer!$A$3:$C$102,2))","v":""},null,null,null,{"$f":"IF(IE38=\"\",\"\",VLOOKUP(IE38,Teilnehmer!$A$3:$C$102,2))","v":""},null,null,{"$f":"IF(IH38=\"\",\"\",VLOOKUP(IH38,Teilnehmer!$A$3:$C$102,2))","v":""},null,null,null,{"$f":"IF(IL38=\"\",\"\",VLOOKUP(IL38,Teilnehmer!$A$3:$C$102,2))","v":""},null,null,{"$f":"IF(IO38=\"\",\"\",VLOOKUP(IO38,Teilnehmer!$A$3:$C$102,2))","v":""},null,null,null,{"$f":"IF(IS38=\"\",\"\",VLOOKUP(IS38,Teilnehmer!$A$3:$C$102,2))","v":""},null,null,{"$f":"IF(IV38=\"\",\"\",VLOOKUP(IV38,Teilnehmer!$A$3:$C$102,2))","v":""},null,null,null,{"$f":"IF(IZ38=\"\",\"\",VLOOKUP(IZ38,Teilnehmer!$A$3:$C$102,2))","v":""},null,null,{"$f":"IF(JC38=\"\",\"\",VLOOKUP(JC38,Teilnehmer!$A$3:$C$102,2))","v":""},null,null,null,{"$f":"IF(JG38=\"\",\"\",VLOOKUP(JG38,Teilnehmer!$A$3:$C$102,2))","v":""},null,null,{"$f":"IF(JJ38=\"\",\"\",VLOOKUP(JJ38,Teilnehmer!$A$3:$C$102,2))","v":""},null,null,null,{"$f":"IF(JN38=\"\",\"\",VLOOKUP(JN38,Teilnehmer!$A$3:$C$102,2))","v":""},null,null,{"$f":"IF(JQ38=\"\",\"\",VLOOKUP(JQ38,Teilnehmer!$A$3:$C$102,2))","v":""},null,null,null,{"$f":"IF(JU38=\"\",\"\",VLOOKUP(JU38,Teilnehmer!$A$3:$C$102,2))","v":""},null,null,{"$f":"IF(JX38=\"\",\"\",VLOOKUP(JX38,Teilnehmer!$A$3:$C$102,2))","v":""},null,null,null,{"$f":"IF(KB38=\"\",\"\",VLOOKUP(KB38,Teilnehmer!$A$3:$C$102,2))","v":""},null,null,{"$f":"IF(KE38=\"\",\"\",VLOOKUP(KE38,Teilnehmer!$A$3:$C$102,2))","v":""},null,null,null,{"$f":"IF(KI38=\"\",\"\",VLOOKUP(KI38,Teilnehmer!$A$3:$C$102,2))","v":""},null,null,{"$f":"IF(KL38=\"\",\"\",VLOOKUP(KL38,Teilnehmer!$A$3:$C$102,2))","v":""},null,null,null,{"$f":"IF(KP38=\"\",\"\",VLOOKUP(KP38,Teilnehmer!$A$3:$C$102,2))","v":""},null,null,{"$f":"IF(KS38=\"\",\"\",VLOOKUP(KS38,Teilnehmer!$A$3:$C$102,2))","v":""}]
[null,{"$f":"IF(A39=\"\",\"\",VLOOKUP(A39,Teilnehmer!$A$3:$C$102,2))","v":""},null,null,{"$f":"IF(D39=\"\",\"\",VLOOKUP(D39,Teilnehmer!$A$3:$C$102,2))","v":""},null,null,null,{"$f":"IF(H39=\"\",\"\",VLOOKUP(H39,Teilnehmer!$A$3:$C$102,2))","v":""},null,null,{"$f":"IF(K39=\"\",\"\",VLOOKUP(K39,Teilnehmer!$A$3:$C$102,2))","v":""},null,null,null,{"$f":"IF(O39=\"\",\"\",VLOOKUP(O39,Teilnehmer!$A$3:$C$102,2))","v":""},null,null,{"$f":"IF(R39=\"\",\"\",VLOOKUP(R39,Teilnehmer!$A$3:$C$102,2))","v":""},null,null,null,{"$f":"IF(V39=\"\",\"\",VLOOKUP(V39,Teilnehmer!$A$3:$C$102,2))","v":""},null,null,{"$f":"IF(Y39=\"\",\"\",VLOOKUP(Y39,Teilnehmer!$A$3:$C$102,2))","v":""},null,null,null,{"$f":"IF(AC39=\"\",\"\",VLOOKUP(AC39,Teilnehmer!$A$3:$C$102,2))","v":""},null,null,{"$f":"IF(AF39=\"\",\"\",VLOOKUP(AF39,Teilnehmer!$A$3:$C$102,2))","v":""},null,null,null,{"$f":"IF(AJ39=\"\",\"\",VLOOKUP(AJ39,Teilnehmer!$A$3:$C$102,2))","v":""},null,null,{"$f":"IF(AM39=\"\",\"\",VLOOKUP(AM39,Teilnehmer!$A$3:$C$102,2))","v":""},null,null,null,{"$f":"IF(AQ39=\"\",\"\",VLOOKUP(AQ39,Teilnehmer!$A$3:$C$102,2))","v":""},null,null,{"$f":"IF(AT39=\"\",\"\",VLOOKUP(AT39,Teilnehmer!$A$3:$C$102,2))","v":""},null,null,null,{"$f":"IF(AX39=\"\",\"\",VLOOKUP(AX39,Teilnehmer!$A$3:$C$102,2))","v":""},null,null,{"$f":"IF(BA39=\"\",\"\",VLOOKUP(BA39,Teilnehmer!$A$3:$C$102,2))","v":""},null,null,null,{"$f":"IF(BE39=\"\",\"\",VLOOKUP(BE39,Teilnehmer!$A$3:$C$102,2))","v":""},null,null,{"$f":"IF(BH39=\"\",\"\",VLOOKUP(BH39,Teilnehmer!$A$3:$C$102,2))","v":""},null,null,null,{"$f":"IF(BL39=\"\",\"\",VLOOKUP(BL39,Teilnehmer!$A$3:$C$102,2))","v":""},null,null,{"$f":"IF(BO39=\"\",\"\",VLOOKUP(BO39,Teilnehmer!$A$3:$C$102,2))","v":""},null,null,null,{"$f":"IF(BS39=\"\",\"\",VLOOKUP(BS39,Teilnehmer!$A$3:$C$102,2))","v":""},null,null,{"$f":"IF(BV39=\"\",\"\",VLOOKUP(BV39,Teilnehmer!$A$3:$C$102,2))","v":""},null,null,null,{"$f":"IF(BZ39=\"\",\"\",VLOOKUP(BZ39,Teilnehmer!$A$3:$C$102,2))","v":""},null,null,{"$f":"IF(CC39=\"\",\"\",VLOOKUP(CC39,Teilnehmer!$A$3:$C$102,2))","v":""},null,null,null,{"$f":"IF(CG39=\"\",\"\",VLOOKUP(CG39,Teilnehmer!$A$3:$C$102,2))","v":""},null,null,{"$f":"IF(CJ39=\"\",\"\",VLOOKUP(CJ39,Teilnehmer!$A$3:$C$102,2))","v":""},null,null,null,{"$f":"IF(CN39=\"\",\"\",VLOOKUP(CN39,Teilnehmer!$A$3:$C$102,2))","v":""},null,null,{"$f":"IF(CQ39=\"\",\"\",VLOOKUP(CQ39,Teilnehmer!$A$3:$C$102,2))","v":""},null,null,null,{"$f":"IF(CU39=\"\",\"\",VLOOKUP(CU39,Teilnehmer!$A$3:$C$102,2))","v":""},null,null,{"$f":"IF(CX39=\"\",\"\",VLOOKUP(CX39,Teilnehmer!$A$3:$C$102,2))","v":""},null,null,null,{"$f":"IF(DB39=\"\",\"\",VLOOKUP(DB39,Teilnehmer!$A$3:$C$102,2))","v":""},null,null,{"$f":"IF(DE39=\"\",\"\",VLOOKUP(DE39,Teilnehmer!$A$3:$C$102,2))","v":""},null,null,null,{"$f":"IF(DI39=\"\",\"\",VLOOKUP(DI39,Teilnehmer!$A$3:$C$102,2))","v":""},null,null,{"$f":"IF(DL39=\"\",\"\",VLOOKUP(DL39,Teilnehmer!$A$3:$C$102,2))","v":""},null,null,null,{"$f":"IF(DP39=\"\",\"\",VLOOKUP(DP39,Teilnehmer!$A$3:$C$102,2))","v":""},null,null,{"$f":"IF(DS39=\"\",\"\",VLOOKUP(DS39,Teilnehmer!$A$3:$C$102,2))","v":""},null,null,null,{"$f":"IF(DW39=\"\",\"\",VLOOKUP(DW39,Teilnehmer!$A$3:$C$102,2))","v":""},null,null,{"$f":"IF(DZ39=\"\",\"\",VLOOKUP(DZ39,Teilnehmer!$A$3:$C$102,2))","v":""},null,null,null,{"$f":"IF(ED39=\"\",\"\",VLOOKUP(ED39,Teilnehmer!$A$3:$C$102,2))","v":""},null,null,{"$f":"IF(EG39=\"\",\"\",VLOOKUP(EG39,Teilnehmer!$A$3:$C$102,2))","v":""},null,null,null,{"$f":"IF(EK39=\"\",\"\",VLOOKUP(EK39,Teilnehmer!$A$3:$C$102,2))","v":""},null,null,{"$f":"IF(EN39=\"\",\"\",VLOOKUP(EN39,Teilnehmer!$A$3:$C$102,2))","v":""},null,null,null,{"$f":"IF(ER39=\"\",\"\",VLOOKUP(ER39,Teilnehmer!$A$3:$C$102,2))","v":""},null,null,{"$f":"IF(EU39=\"\",\"\",VLOOKUP(EU39,Teilnehmer!$A$3:$C$102,2))","v":""},null,null,null,{"$f":"IF(EY39=\"\",\"\",VLOOKUP(EY39,Teilnehmer!$A$3:$C$102,2))","v":""},null,null,{"$f":"IF(FB39=\"\",\"\",VLOOKUP(FB39,Teilnehmer!$A$3:$C$102,2))","v":""},null,null,null,{"$f":"IF(FF39=\"\",\"\",VLOOKUP(FF39,Teilnehmer!$A$3:$C$102,2))","v":""},null,null,{"$f":"IF(FI39=\"\",\"\",VLOOKUP(FI39,Teilnehmer!$A$3:$C$102,2))","v":""},null,null,null,{"$f":"IF(FM39=\"\",\"\",VLOOKUP(FM39,Teilnehmer!$A$3:$C$102,2))","v":""},null,null,{"$f":"IF(FP39=\"\",\"\",VLOOKUP(FP39,Teilnehmer!$A$3:$C$102,2))","v":""},null,null,null,{"$f":"IF(FT39=\"\",\"\",VLOOKUP(FT39,Teilnehmer!$A$3:$C$102,2))","v":""},null,null,{"$f":"IF(FW39=\"\",\"\",VLOOKUP(FW39,Teilnehmer!$A$3:$C$102,2))","v":""},null,null,null,{"$f":"IF(GA39=\"\",\"\",VLOOKUP(GA39,Teilnehmer!$A$3:$C$102,2))","v":""},null,null,{"$f":"IF(GD39=\"\",\"\",VLOOKUP(GD39,Teilnehmer!$A$3:$C$102,2))","v":""},null,null,null,{"$f":"IF(GH39=\"\",\"\",VLOOKUP(GH39,Teilnehmer!$A$3:$C$102,2))","v":""},null,null,{"$f":"IF(GK39=\"\",\"\",VLOOKUP(GK39,Teilnehmer!$A$3:$C$102,2))","v":""},null,null,null,{"$f":"IF(GO39=\"\",\"\",VLOOKUP(GO39,Teilnehmer!$A$3:$C$102,2))","v":""},null,null,{"$f":"IF(GR39=\"\",\"\",VLOOKUP(GR39,Teilnehmer!$A$3:$C$102,2))","v":""},null,null,null,{"$f":"IF(GV39=\"\",\"\",VLOOKUP(GV39,Teilnehmer!$A$3:$C$102,2))","v":""},null,null,{"$f":"IF(GY39=\"\",\"\",VLOOKUP(GY39,Teilnehmer!$A$3:$C$102,2))","v":""},null,null,null,{"$f":"IF(HC39=\"\",\"\",VLOOKUP(HC39,Teilnehmer!$A$3:$C$102,2))","v":""},null,null,{"$f":"IF(HF39=\"\",\"\",VLOOKUP(HF39,Teilnehmer!$A$3:$C$102,2))","v":""},null,null,null,{"$f":"IF(HJ39=\"\",\"\",VLOOKUP(HJ39,Teilnehmer!$A$3:$C$102,2))","v":""},null,null,{"$f":"IF(HM39=\"\",\"\",VLOOKUP(HM39,Teilnehmer!$A$3:$C$102,2))","v":""},null,null,null,{"$f":"IF(HQ39=\"\",\"\",VLOOKUP(HQ39,Teilnehmer!$A$3:$C$102,2))","v":""},null,null,{"$f":"IF(HT39=\"\",\"\",VLOOKUP(HT39,Teilnehmer!$A$3:$C$102,2))","v":""},null,null,null,{"$f":"IF(HX39=\"\",\"\",VLOOKUP(HX39,Teilnehmer!$A$3:$C$102,2))","v":""},null,null,{"$f":"IF(IA39=\"\",\"\",VLOOKUP(IA39,Teilnehmer!$A$3:$C$102,2))","v":""},null,null,null,{"$f":"IF(IE39=\"\",\"\",VLOOKUP(IE39,Teilnehmer!$A$3:$C$102,2))","v":""},null,null,{"$f":"IF(IH39=\"\",\"\",VLOOKUP(IH39,Teilnehmer!$A$3:$C$102,2))","v":""},null,null,null,{"$f":"IF(IL39=\"\",\"\",VLOOKUP(IL39,Teilnehmer!$A$3:$C$102,2))","v":""},null,null,{"$f":"IF(IO39=\"\",\"\",VLOOKUP(IO39,Teilnehmer!$A$3:$C$102,2))","v":""},null,null,null,{"$f":"IF(IS39=\"\",\"\",VLOOKUP(IS39,Teilnehmer!$A$3:$C$102,2))","v":""},null,null,{"$f":"IF(IV39=\"\",\"\",VLOOKUP(IV39,Teilnehmer!$A$3:$C$102,2))","v":""},null,null,null,{"$f":"IF(IZ39=\"\",\"\",VLOOKUP(IZ39,Teilnehmer!$A$3:$C$102,2))","v":""},null,null,{"$f":"IF(JC39=\"\",\"\",VLOOKUP(JC39,Teilnehmer!$A$3:$C$102,2))","v":""},null,null,null,{"$f":"IF(JG39=\"\",\"\",VLOOKUP(JG39,Teilnehmer!$A$3:$C$102,2))","v":""},null,null,{"$f":"IF(JJ39=\"\",\"\",VLOOKUP(JJ39,Teilnehmer!$A$3:$C$102,2))","v":""},null,null,null,{"$f":"IF(JN39=\"\",\"\",VLOOKUP(JN39,Teilnehmer!$A$3:$C$102,2))","v":""},null,null,{"$f":"IF(JQ39=\"\",\"\",VLOOKUP(JQ39,Teilnehmer!$A$3:$C$102,2))","v":""},null,null,null,{"$f":"IF(JU39=\"\",\"\",VLOOKUP(JU39,Teilnehmer!$A$3:$C$102,2))","v":""},null,null,{"$f":"IF(JX39=\"\",\"\",VLOOKUP(JX39,Teilnehmer!$A$3:$C$102,2))","v":""},null,null,null,{"$f":"IF(KB39=\"\",\"\",VLOOKUP(KB39,Teilnehmer!$A$3:$C$102,2))","v":""},null,null,{"$f":"IF(KE39=\"\",\"\",VLOOKUP(KE39,Teilnehmer!$A$3:$C$102,2))","v":""},null,null,null,{"$f":"IF(KI39=\"\",\"\",VLOOKUP(KI39,Teilnehmer!$A$3:$C$102,2))","v":""},null,null,{"$f":"IF(KL39=\"\",\"\",VLOOKUP(KL39,Teilnehmer!$A$3:$C$102,2))","v":""},null,null,null,{"$f":"IF(KP39=\"\",\"\",VLOOKUP(KP39,Teilnehmer!$A$3:$C$102,2))","v":""},null,null,{"$f":"IF(KS39=\"\",\"\",VLOOKUP(KS39,Teilnehmer!$A$3:$C$102,2))","v":""}]
[null,{"$f":"IF(A40=\"\",\"\",VLOOKUP(A40,Teilnehmer!$A$3:$C$102,2))","v":""},null,null,{"$f":"IF(D40=\"\",\"\",VLOOKUP(D40,Teilnehmer!$A$3:$C$102,2))","v":""},null,null,null,{"$f":"IF(H40=\"\",\"\",VLOOKUP(H40,Teilnehmer!$A$3:$C$102,2))","v":""},null,null,{"$f":"IF(K40=\"\",\"\",VLOOKUP(K40,Teilnehmer!$A$3:$C$102,2))","v":""},null,null,null,{"$f":"IF(O40=\"\",\"\",VLOOKUP(O40,Teilnehmer!$A$3:$C$102,2))","v":""},null,null,{"$f":"IF(R40=\"\",\"\",VLOOKUP(R40,Teilnehmer!$A$3:$C$102,2))","v":""},null,null,null,{"$f":"IF(V40=\"\",\"\",VLOOKUP(V40,Teilnehmer!$A$3:$C$102,2))","v":""},null,null,{"$f":"IF(Y40=\"\",\"\",VLOOKUP(Y40,Teilnehmer!$A$3:$C$102,2))","v":""},null,null,null,{"$f":"IF(AC40=\"\",\"\",VLOOKUP(AC40,Teilnehmer!$A$3:$C$102,2))","v":""},null,null,{"$f":"IF(AF40=\"\",\"\",VLOOKUP(AF40,Teilnehmer!$A$3:$C$102,2))","v":""},null,null,null,{"$f":"IF(AJ40=\"\",\"\",VLOOKUP(AJ40,Teilnehmer!$A$3:$C$102,2))","v":""},null,null,{"$f":"IF(AM40=\"\",\"\",VLOOKUP(AM40,Teilnehmer!$A$3:$C$102,2))","v":""},null,null,null,{"$f":"IF(AQ40=\"\",\"\",VLOOKUP(AQ40,Teilnehmer!$A$3:$C$102,2))","v":""},null,null,{"$f":"IF(AT40=\"\",\"\",VLOOKUP(AT40,Teilnehmer!$A$3:$C$102,2))","v":""},null,null,null,{"$f":"IF(AX40=\"\",\"\",VLOOKUP(AX40,Teilnehmer!$A$3:$C$102,2))","v":""},null,null,{"$f":"IF(BA40=\"\",\"\",VLOOKUP(BA40,Teilnehmer!$A$3:$C$102,2))","v":""},null,null,null,{"$f":"IF(BE40=\"\",\"\",VLOOKUP(BE40,Teilnehmer!$A$3:$C$102,2))","v":""},null,null,{"$f":"IF(BH40=\"\",\"\",VLOOKUP(BH40,Teilnehmer!$A$3:$C$102,2))","v":""},null,null,null,{"$f":"IF(BL40=\"\",\"\",VLOOKUP(BL40,Teilnehmer!$A$3:$C$102,2))","v":""},null,null,{"$f":"IF(BO40=\"\",\"\",VLOOKUP(BO40,Teilnehmer!$A$3:$C$102,2))","v":""},null,null,null,{"$f":"IF(BS40=\"\",\"\",VLOOKUP(BS40,Teilnehmer!$A$3:$C$102,2))","v":""},null,null,{"$f":"IF(BV40=\"\",\"\",VLOOKUP(BV40,Teilnehmer!$A$3:$C$102,2))","v":""},null,null,null,{"$f":"IF(BZ40=\"\",\"\",VLOOKUP(BZ40,Teilnehmer!$A$3:$C$102,2))","v":""},null,null,{"$f":"IF(CC40=\"\",\"\",VLOOKUP(CC40,Teilnehmer!$A$3:$C$102,2))","v":""},null,null,null,{"$f":"IF(CG40=\"\",\"\",VLOOKUP(CG40,Teilnehmer!$A$3:$C$102,2))","v":""},null,null,{"$f":"IF(CJ40=\"\",\"\",VLOOKUP(CJ40,Teilnehmer!$A$3:$C$102,2))","v":""},null,null,null,{"$f":"IF(CN40=\"\",\"\",VLOOKUP(CN40,Teilnehmer!$A$3:$C$102,2))","v":""},null,null,{"$f":"IF(CQ40=\"\",\"\",VLOOKUP(CQ40,Teilnehmer!$A$3:$C$102,2))","v":""},null,null,null,{"$f":"IF(CU40=\"\",\"\",VLOOKUP(CU40,Teilnehmer!$A$3:$C$102,2))","v":""},null,null,{"$f":"IF(CX40=\"\",\"\",VLOOKUP(CX40,Teilnehmer!$A$3:$C$102,2))","v":""},null,null,null,{"$f":"IF(DB40=\"\",\"\",VLOOKUP(DB40,Teilnehmer!$A$3:$C$102,2))","v":""},null,null,{"$f":"IF(DE40=\"\",\"\",VLOOKUP(DE40,Teilnehmer!$A$3:$C$102,2))","v":""},null,null,null,{"$f":"IF(DI40=\"\",\"\",VLOOKUP(DI40,Teilnehmer!$A$3:$C$102,2))","v":""},null,null,{"$f":"IF(DL40=\"\",\"\",VLOOKUP(DL40,Teilnehmer!$A$3:$C$102,2))","v":""},null,null,null,{"$f":"IF(DP40=\"\",\"\",VLOOKUP(DP40,Teilnehmer!$A$3:$C$102,2))","v":""},null,null,{"$f":"IF(DS40=\"\",\"\",VLOOKUP(DS40,Teilnehmer!$A$3:$C$102,2))","v":""},null,null,null,{"$f":"IF(DW40=\"\",\"\",VLOOKUP(DW40,Teilnehmer!$A$3:$C$102,2))","v":""},null,null,{"$f":"IF(DZ40=\"\",\"\",VLOOKUP(DZ40,Teilnehmer!$A$3:$C$102,2))","v":""},null,null,null,{"$f":"IF(ED40=\"\",\"\",VLOOKUP(ED40,Teilnehmer!$A$3:$C$102,2))","v":""},null,null,{"$f":"IF(EG40=\"\",\"\",VLOOKUP(EG40,Teilnehmer!$A$3:$C$102,2))","v":""},null,null,null,{"$f":"IF(EK40=\"\",\"\",VLOOKUP(EK40,Teilnehmer!$A$3:$C$102,2))","v":""},null,null,{"$f":"IF(EN40=\"\",\"\",VLOOKUP(EN40,Teilnehmer!$A$3:$C$102,2))","v":""},null,null,null,{"$f":"IF(ER40=\"\",\"\",VLOOKUP(ER40,Teilnehmer!$A$3:$C$102,2))","v":""},null,null,{"$f":"IF(EU40=\"\",\"\",VLOOKUP(EU40,Teilnehmer!$A$3:$C$102,2))","v":""},null,null,null,{"$f":"IF(EY40=\"\",\"\",VLOOKUP(EY40,Teilnehmer!$A$3:$C$102,2))","v":""},null,null,{"$f":"IF(FB40=\"\",\"\",VLOOKUP(FB40,Teilnehmer!$A$3:$C$102,2))","v":""},null,null,null,{"$f":"IF(FF40=\"\",\"\",VLOOKUP(FF40,Teilnehmer!$A$3:$C$102,2))","v":""},null,null,{"$f":"IF(FI40=\"\",\"\",VLOOKUP(FI40,Teilnehmer!$A$3:$C$102,2))","v":""},null,null,null,{"$f":"IF(FM40=\"\",\"\",VLOOKUP(FM40,Teilnehmer!$A$3:$C$102,2))","v":""},null,null,{"$f":"IF(FP40=\"\",\"\",VLOOKUP(FP40,Teilnehmer!$A$3:$C$102,2))","v":""},null,null,null,{"$f":"IF(FT40=\"\",\"\",VLOOKUP(FT40,Teilnehmer!$A$3:$C$102,2))","v":""},null,null,{"$f":"IF(FW40=\"\",\"\",VLOOKUP(FW40,Teilnehmer!$A$3:$C$102,2))","v":""},null,null,null,{"$f":"IF(GA40=\"\",\"\",VLOOKUP(GA40,Teilnehmer!$A$3:$C$102,2))","v":""},null,null,{"$f":"IF(GD40=\"\",\"\",VLOOKUP(GD40,Teilnehmer!$A$3:$C$102,2))","v":""},null,null,null,{"$f":"IF(GH40=\"\",\"\",VLOOKUP(GH40,Teilnehmer!$A$3:$C$102,2))","v":""},null,null,{"$f":"IF(GK40=\"\",\"\",VLOOKUP(GK40,Teilnehmer!$A$3:$C$102,2))","v":""},null,null,null,{"$f":"IF(GO40=\"\",\"\",VLOOKUP(GO40,Teilnehmer!$A$3:$C$102,2))","v":""},null,null,{"$f":"IF(GR40=\"\",\"\",VLOOKUP(GR40,Teilnehmer!$A$3:$C$102,2))","v":""},null,null,null,{"$f":"IF(GV40=\"\",\"\",VLOOKUP(GV40,Teilnehmer!$A$3:$C$102,2))","v":""},null,null,{"$f":"IF(GY40=\"\",\"\",VLOOKUP(GY40,Teilnehmer!$A$3:$C$102,2))","v":""},null,null,null,{"$f":"IF(HC40=\"\",\"\",VLOOKUP(HC40,Teilnehmer!$A$3:$C$102,2))","v":""},null,null,{"$f":"IF(HF40=\"\",\"\",VLOOKUP(HF40,Teilnehmer!$A$3:$C$102,2))","v":""},null,null,null,{"$f":"IF(HJ40=\"\",\"\",VLOOKUP(HJ40,Teilnehmer!$A$3:$C$102,2))","v":""},null,null,{"$f":"IF(HM40=\"\",\"\",VLOOKUP(HM40,Teilnehmer!$A$3:$C$102,2))","v":""},null,null,null,{"$f":"IF(HQ40=\"\",\"\",VLOOKUP(HQ40,Teilnehmer!$A$3:$C$102,2))","v":""},null,null,{"$f":"IF(HT40=\"\",\"\",VLOOKUP(HT40,Teilnehmer!$A$3:$C$102,2))","v":""},null,null,null,{"$f":"IF(HX40=\"\",\"\",VLOOKUP(HX40,Teilnehmer!$A$3:$C$102,2))","v":""},null,null,{"$f":"IF(IA40=\"\",\"\",VLOOKUP(IA40,Teilnehmer!$A$3:$C$102,2))","v":""},null,null,null,{"$f":"IF(IE40=\"\",\"\",VLOOKUP(IE40,Teilnehmer!$A$3:$C$102,2))","v":""},null,null,{"$f":"IF(IH40=\"\",\"\",VLOOKUP(IH40,Teilnehmer!$A$3:$C$102,2))","v":""},null,null,null,{"$f":"IF(IL40=\"\",\"\",VLOOKUP(IL40,Teilnehmer!$A$3:$C$102,2))","v":""},null,null,{"$f":"IF(IO40=\"\",\"\",VLOOKUP(IO40,Teilnehmer!$A$3:$C$102,2))","v":""},null,null,null,{"$f":"IF(IS40=\"\",\"\",VLOOKUP(IS40,Teilnehmer!$A$3:$C$102,2))","v":""},null,null,{"$f":"IF(IV40=\"\",\"\",VLOOKUP(IV40,Teilnehmer!$A$3:$C$102,2))","v":""},null,null,null,{"$f":"IF(IZ40=\"\",\"\",VLOOKUP(IZ40,Teilnehmer!$A$3:$C$102,2))","v":""},null,null,{"$f":"IF(JC40=\"\",\"\",VLOOKUP(JC40,Teilnehmer!$A$3:$C$102,2))","v":""},null,null,null,{"$f":"IF(JG40=\"\",\"\",VLOOKUP(JG40,Teilnehmer!$A$3:$C$102,2))","v":""},null,null,{"$f":"IF(JJ40=\"\",\"\",VLOOKUP(JJ40,Teilnehmer!$A$3:$C$102,2))","v":""},null,null,null,{"$f":"IF(JN40=\"\",\"\",VLOOKUP(JN40,Teilnehmer!$A$3:$C$102,2))","v":""},null,null,{"$f":"IF(JQ40=\"\",\"\",VLOOKUP(JQ40,Teilnehmer!$A$3:$C$102,2))","v":""},null,null,null,{"$f":"IF(JU40=\"\",\"\",VLOOKUP(JU40,Teilnehmer!$A$3:$C$102,2))","v":""},null,null,{"$f":"IF(JX40=\"\",\"\",VLOOKUP(JX40,Teilnehmer!$A$3:$C$102,2))","v":""},null,null,null,{"$f":"IF(KB40=\"\",\"\",VLOOKUP(KB40,Teilnehmer!$A$3:$C$102,2))","v":""},null,null,{"$f":"IF(KE40=\"\",\"\",VLOOKUP(KE40,Teilnehmer!$A$3:$C$102,2))","v":""},null,null,null,{"$f":"IF(KI40=\"\",\"\",VLOOKUP(KI40,Teilnehmer!$A$3:$C$102,2))","v":""},null,null,{"$f":"IF(KL40=\"\",\"\",VLOOKUP(KL40,Teilnehmer!$A$3:$C$102,2))","v":""},null,null,null,{"$f":"IF(KP40=\"\",\"\",VLOOKUP(KP40,Teilnehmer!$A$3:$C$102,2))","v":""},null,null,{"$f":"IF(KS40=\"\",\"\",VLOOKUP(KS40,Teilnehmer!$A$3:$C$102,2))","v":""}]
[null,{"$f":"IF(A41=\"\",\"\",VLOOKUP(A41,Teilnehmer!$A$3:$C$102,2))","v":""},null,null,{"$f":"IF(D41=\"\",\"\",VLOOKUP(D41,Teilnehmer!$A$3:$C$102,2))","v":""},null,null,null,{"$f":"IF(H41=\"\",\"\",VLOOKUP(H41,Teilnehmer!$A$3:$C$102,2))","v":""},null,null,{"$f":"IF(K41=\"\",\"\",VLOOKUP(K41,Teilnehmer!$A$3:$C$102,2))","v":""},null,null,null,{"$f":"IF(O41=\"\",\"\",VLOOKUP(O41,Teilnehmer!$A$3:$C$102,2))","v":""},null,null,{"$f":"IF(R41=\"\",\"\",VLOOKUP(R41,Teilnehmer!$A$3:$C$102,2))","v":""},null,null,null,{"$f":"IF(V41=\"\",\"\",VLOOKUP(V41,Teilnehmer!$A$3:$C$102,2))","v":""},null,null,{"$f":"IF(Y41=\"\",\"\",VLOOKUP(Y41,Teilnehmer!$A$3:$C$102,2))","v":""},null,null,null,{"$f":"IF(AC41=\"\",\"\",VLOOKUP(AC41,Teilnehmer!$A$3:$C$102,2))","v":""},null,null,{"$f":"IF(AF41=\"\",\"\",VLOOKUP(AF41,Teilnehmer!$A$3:$C$102,2))","v":""},null,null,null,{"$f":"IF(AJ41=\"\",\"\",VLOOKUP(AJ41,Teilnehmer!$A$3:$C$102,2))","v":""},null,null,{"$f":"IF(AM41=\"\",\"\",VLOOKUP(AM41,Teilnehmer!$A$3:$C$102,2))","v":""},null,null,null,{"$f":"IF(AQ41=\"\",\"\",VLOOKUP(AQ41,Teilnehmer!$A$3:$C$102,2))","v":""},null,null,{"$f":"IF(AT41=\"\",\"\",VLOOKUP(AT41,Teilnehmer!$A$3:$C$102,2))","v":""},null,null,null,{"$f":"IF(AX41=\"\",\"\",VLOOKUP(AX41,Teilnehmer!$A$3:$C$102,2))","v":""},null,null,{"$f":"IF(BA41=\"\",\"\",VLOOKUP(BA41,Teilnehmer!$A$3:$C$102,2))","v":""},null,null,null,{"$f":"IF(BE41=\"\",\"\",VLOOKUP(BE41,Teilnehmer!$A$3:$C$102,2))","v":""},null,null,{"$f":"IF(BH41=\"\",\"\",VLOOKUP(BH41,Teilnehmer!$A$3:$C$102,2))","v":""},null,null,null,{"$f":"IF(BL41=\"\",\"\",VLOOKUP(BL41,Teilnehmer!$A$3:$C$102,2))","v":""},null,null,{"$f":"IF(BO41=\"\",\"\",VLOOKUP(BO41,Teilnehmer!$A$3:$C$102,2))","v":""},null,null,null,{"$f":"IF(BS41=\"\",\"\",VLOOKUP(BS41,Teilnehmer!$A$3:$C$102,2))","v":""},null,null,{"$f":"IF(BV41=\"\",\"\",VLOOKUP(BV41,Teilnehmer!$A$3:$C$102,2))","v":""},null,null,null,{"$f":"IF(BZ41=\"\",\"\",VLOOKUP(BZ41,Teilnehmer!$A$3:$C$102,2))","v":""},null,null,{"$f":"IF(CC41=\"\",\"\",VLOOKUP(CC41,Teilnehmer!$A$3:$C$102,2))","v":""},null,null,null,{"$f":"IF(CG41=\"\",\"\",VLOOKUP(CG41,Teilnehmer!$A$3:$C$102,2))","v":""},null,null,{"$f":"IF(CJ41=\"\",\"\",VLOOKUP(CJ41,Teilnehmer!$A$3:$C$102,2))","v":""},null,null,null,{"$f":"IF(CN41=\"\",\"\",VLOOKUP(CN41,Teilnehmer!$A$3:$C$102,2))","v":""},null,null,{"$f":"IF(CQ41=\"\",\"\",VLOOKUP(CQ41,Teilnehmer!$A$3:$C$102,2))","v":""},null,null,null,{"$f":"IF(CU41=\"\",\"\",VLOOKUP(CU41,Teilnehmer!$A$3:$C$102,2))","v":""},null,null,{"$f":"IF(CX41=\"\",\"\",VLOOKUP(CX41,Teilnehmer!$A$3:$C$102,2))","v":""},null,null,null,{"$f":"IF(DB41=\"\",\"\",VLOOKUP(DB41,Teilnehmer!$A$3:$C$102,2))","v":""},null,null,{"$f":"IF(DE41=\"\",\"\",VLOOKUP(DE41,Teilnehmer!$A$3:$C$102,2))","v":""},null,null,null,{"$f":"IF(DI41=\"\",\"\",VLOOKUP(DI41,Teilnehmer!$A$3:$C$102,2))","v":""},null,null,{"$f":"IF(DL41=\"\",\"\",VLOOKUP(DL41,Teilnehmer!$A$3:$C$102,2))","v":""},null,null,null,{"$f":"IF(DP41=\"\",\"\",VLOOKUP(DP41,Teilnehmer!$A$3:$C$102,2))","v":""},null,null,{"$f":"IF(DS41=\"\",\"\",VLOOKUP(DS41,Teilnehmer!$A$3:$C$102,2))","v":""},null,null,null,{"$f":"IF(DW41=\"\",\"\",VLOOKUP(DW41,Teilnehmer!$A$3:$C$102,2))","v":""},null,null,{"$f":"IF(DZ41=\"\",\"\",VLOOKUP(DZ41,Teilnehmer!$A$3:$C$102,2))","v":""},null,null,null,{"$f":"IF(ED41=\"\",\"\",VLOOKUP(ED41,Teilnehmer!$A$3:$C$102,2))","v":""},null,null,{"$f":"IF(EG41=\"\",\"\",VLOOKUP(EG41,Teilnehmer!$A$3:$C$102,2))","v":""},null,null,null,{"$f":"IF(EK41=\"\",\"\",VLOOKUP(EK41,Teilnehmer!$A$3:$C$102,2))","v":""},null,null,{"$f":"IF(EN41=\"\",\"\",VLOOKUP(EN41,Teilnehmer!$A$3:$C$102,2))","v":""},null,null,null,{"$f":"IF(ER41=\"\",\"\",VLOOKUP(ER41,Teilnehmer!$A$3:$C$102,2))","v":""},null,null,{"$f":"IF(EU41=\"\",\"\",VLOOKUP(EU41,Teilnehmer!$A$3:$C$102,2))","v":""},null,null,null,{"$f":"IF(EY41=\"\",\"\",VLOOKUP(EY41,Teilnehmer!$A$3:$C$102,2))","v":""},null,null,{"$f":"IF(FB41=\"\",\"\",VLOOKUP(FB41,Teilnehmer!$A$3:$C$102,2))","v":""},null,null,null,{"$f":"IF(FF41=\"\",\"\",VLOOKUP(FF41,Teilnehmer!$A$3:$C$102,2))","v":""},null,null,{"$f":"IF(FI41=\"\",\"\",VLOOKUP(FI41,Teilnehmer!$A$3:$C$102,2))","v":""},null,null,null,{"$f":"IF(FM41=\"\",\"\",VLOOKUP(FM41,Teilnehmer!$A$3:$C$102,2))","v":""},null,null,{"$f":"IF(FP41=\"\",\"\",VLOOKUP(FP41,Teilnehmer!$A$3:$C$102,2))","v":""},null,null,null,{"$f":"IF(FT41=\"\",\"\",VLOOKUP(FT41,Teilnehmer!$A$3:$C$102,2))","v":""},null,null,{"$f":"IF(FW41=\"\",\"\",VLOOKUP(FW41,Teilnehmer!$A$3:$C$102,2))","v":""},null,null,null,{"$f":"IF(GA41=\"\",\"\",VLOOKUP(GA41,Teilnehmer!$A$3:$C$102,2))","v":""},null,null,{"$f":"IF(GD41=\"\",\"\",VLOOKUP(GD41,Teilnehmer!$A$3:$C$102,2))","v":""},null,null,null,{"$f":"IF(GH41=\"\",\"\",VLOOKUP(GH41,Teilnehmer!$A$3:$C$102,2))","v":""},null,null,{"$f":"IF(GK41=\"\",\"\",VLOOKUP(GK41,Teilnehmer!$A$3:$C$102,2))","v":""},null,null,null,{"$f":"IF(GO41=\"\",\"\",VLOOKUP(GO41,Teilnehmer!$A$3:$C$102,2))","v":""},null,null,{"$f":"IF(GR41=\"\",\"\",VLOOKUP(GR41,Teilnehmer!$A$3:$C$102,2))","v":""},null,null,null,{"$f":"IF(GV41=\"\",\"\",VLOOKUP(GV41,Teilnehmer!$A$3:$C$102,2))","v":""},null,null,{"$f":"IF(GY41=\"\",\"\",VLOOKUP(GY41,Teilnehmer!$A$3:$C$102,2))","v":""},null,null,null,{"$f":"IF(HC41=\"\",\"\",VLOOKUP(HC41,Teilnehmer!$A$3:$C$102,2))","v":""},null,null,{"$f":"IF(HF41=\"\",\"\",VLOOKUP(HF41,Teilnehmer!$A$3:$C$102,2))","v":""},null,null,null,{"$f":"IF(HJ41=\"\",\"\",VLOOKUP(HJ41,Teilnehmer!$A$3:$C$102,2))","v":""},null,null,{"$f":"IF(HM41=\"\",\"\",VLOOKUP(HM41,Teilnehmer!$A$3:$C$102,2))","v":""},null,null,null,{"$f":"IF(HQ41=\"\",\"\",VLOOKUP(HQ41,Teilnehmer!$A$3:$C$102,2))","v":""},null,null,{"$f":"IF(HT41=\"\",\"\",VLOOKUP(HT41,Teilnehmer!$A$3:$C$102,2))","v":""},null,null,null,{"$f":"IF(HX41=\"\",\"\",VLOOKUP(HX41,Teilnehmer!$A$3:$C$102,2))","v":""},null,null,{"$f":"IF(IA41=\"\",\"\",VLOOKUP(IA41,Teilnehmer!$A$3:$C$102,2))","v":""},null,null,null,{"$f":"IF(IE41=\"\",\"\",VLOOKUP(IE41,Teilnehmer!$A$3:$C$102,2))","v":""},null,null,{"$f":"IF(IH41=\"\",\"\",VLOOKUP(IH41,Teilnehmer!$A$3:$C$102,2))","v":""},null,null,null,{"$f":"IF(IL41=\"\",\"\",VLOOKUP(IL41,Teilnehmer!$A$3:$C$102,2))","v":""},null,null,{"$f":"IF(IO41=\"\",\"\",VLOOKUP(IO41,Teilnehmer!$A$3:$C$102,2))","v":""},null,null,null,{"$f":"IF(IS41=\"\",\"\",VLOOKUP(IS41,Teilnehmer!$A$3:$C$102,2))","v":""},null,null,{"$f":"IF(IV41=\"\",\"\",VLOOKUP(IV41,Teilnehmer!$A$3:$C$102,2))","v":""},null,null,null,{"$f":"IF(IZ41=\"\",\"\",VLOOKUP(IZ41,Teilnehmer!$A$3:$C$102,2))","v":""},null,null,{"$f":"IF(JC41=\"\",\"\",VLOOKUP(JC41,Teilnehmer!$A$3:$C$102,2))","v":""},null,null,null,{"$f":"IF(JG41=\"\",\"\",VLOOKUP(JG41,Teilnehmer!$A$3:$C$102,2))","v":""},null,null,{"$f":"IF(JJ41=\"\",\"\",VLOOKUP(JJ41,Teilnehmer!$A$3:$C$102,2))","v":""},null,null,null,{"$f":"IF(JN41=\"\",\"\",VLOOKUP(JN41,Teilnehmer!$A$3:$C$102,2))","v":""},null,null,{"$f":"IF(JQ41=\"\",\"\",VLOOKUP(JQ41,Teilnehmer!$A$3:$C$102,2))","v":""},null,null,null,{"$f":"IF(JU41=\"\",\"\",VLOOKUP(JU41,Teilnehmer!$A$3:$C$102,2))","v":""},null,null,{"$f":"IF(JX41=\"\",\"\",VLOOKUP(JX41,Teilnehmer!$A$3:$C$102,2))","v":""},null,null,null,{"$f":"IF(KB41=\"\",\"\",VLOOKUP(KB41,Teilnehmer!$A$3:$C$102,2))","v":""},null,null,{"$f":"IF(KE41=\"\",\"\",VLOOKUP(KE41,Teilnehmer!$A$3:$C$102,2))","v":""},null,null,null,{"$f":"IF(KI41=\"\",\"\",VLOOKUP(KI41,Teilnehmer!$A$3:$C$102,2))","v":""},null,null,{"$f":"IF(KL41=\"\",\"\",VLOOKUP(KL41,Teilnehmer!$A$3:$C$102,2))","v":""},null,null,null,{"$f":"IF(KP41=\"\",\"\",VLOOKUP(KP41,Teilnehmer!$A$3:$C$102,2))","v":""},null,null,{"$f":"IF(KS41=\"\",\"\",VLOOKUP(KS41,Teilnehmer!$A$3:$C$102,2))","v":""}]
[null,{"$f":"IF(A42=\"\",\"\",VLOOKUP(A42,Teilnehmer!$A$3:$C$102,2))","v":""},null,null,{"$f":"IF(D42=\"\",\"\",VLOOKUP(D42,Teilnehmer!$A$3:$C$102,2))","v":""},null,null,null,{"$f":"IF(H42=\"\",\"\",VLOOKUP(H42,Teilnehmer!$A$3:$C$102,2))","v":""},null,null,{"$f":"IF(K42=\"\",\"\",VLOOKUP(K42,Teilnehmer!$A$3:$C$102,2))","v":""},null,null,null,{"$f":"IF(O42=\"\",\"\",VLOOKUP(O42,Teilnehmer!$A$3:$C$102,2))","v":""},null,null,{"$f":"IF(R42=\"\",\"\",VLOOKUP(R42,Teilnehmer!$A$3:$C$102,2))","v":""},null,null,null,{"$f":"IF(V42=\"\",\"\",VLOOKUP(V42,Teilnehmer!$A$3:$C$102,2))","v":""},null,null,{"$f":"IF(Y42=\"\",\"\",VLOOKUP(Y42,Teilnehmer!$A$3:$C$102,2))","v":""},null,null,null,{"$f":"IF(AC42=\"\",\"\",VLOOKUP(AC42,Teilnehmer!$A$3:$C$102,2))","v":""},null,null,{"$f":"IF(AF42=\"\",\"\",VLOOKUP(AF42,Teilnehmer!$A$3:$C$102,2))","v":""},null,null,null,{"$f":"IF(AJ42=\"\",\"\",VLOOKUP(AJ42,Teilnehmer!$A$3:$C$102,2))","v":""},null,null,{"$f":"IF(AM42=\"\",\"\",VLOOKUP(AM42,Teilnehmer!$A$3:$C$102,2))","v":""},null,null,null,{"$f":"IF(AQ42=\"\",\"\",VLOOKUP(AQ42,Teilnehmer!$A$3:$C$102,2))","v":""},null,null,{"$f":"IF(AT42=\"\",\"\",VLOOKUP(AT42,Teilnehmer!$A$3:$C$102,2))","v":""},null,null,null,{"$f":"IF(AX42=\"\",\"\",VLOOKUP(AX42,Teilnehmer!$A$3:$C$102,2))","v":""},null,null,{"$f":"IF(BA42=\"\",\"\",VLOOKUP(BA42,Teilnehmer!$A$3:$C$102,2))","v":""},null,null,null,{"$f":"IF(BE42=\"\",\"\",VLOOKUP(BE42,Teilnehmer!$A$3:$C$102,2))","v":""},null,null,{"$f":"IF(BH42=\"\",\"\",VLOOKUP(BH42,Teilnehmer!$A$3:$C$102,2))","v":""},null,null,null,{"$f":"IF(BL42=\"\",\"\",VLOOKUP(BL42,Teilnehmer!$A$3:$C$102,2))","v":""},null,null,{"$f":"IF(BO42=\"\",\"\",VLOOKUP(BO42,Teilnehmer!$A$3:$C$102,2))","v":""},null,null,null,{"$f":"IF(BS42=\"\",\"\",VLOOKUP(BS42,Teilnehmer!$A$3:$C$102,2))","v":""},null,null,{"$f":"IF(BV42=\"\",\"\",VLOOKUP(BV42,Teilnehmer!$A$3:$C$102,2))","v":""},null,null,null,{"$f":"IF(BZ42=\"\",\"\",VLOOKUP(BZ42,Teilnehmer!$A$3:$C$102,2))","v":""},null,null,{"$f":"IF(CC42=\"\",\"\",VLOOKUP(CC42,Teilnehmer!$A$3:$C$102,2))","v":""},null,null,null,{"$f":"IF(CG42=\"\",\"\",VLOOKUP(CG42,Teilnehmer!$A$3:$C$102,2))","v":""},null,null,{"$f":"IF(CJ42=\"\",\"\",VLOOKUP(CJ42,Teilnehmer!$A$3:$C$102,2))","v":""},null,null,null,{"$f":"IF(CN42=\"\",\"\",VLOOKUP(CN42,Teilnehmer!$A$3:$C$102,2))","v":""},null,null,{"$f":"IF(CQ42=\"\",\"\",VLOOKUP(CQ42,Teilnehmer!$A$3:$C$102,2))","v":""},null,null,null,{"$f":"IF(CU42=\"\",\"\",VLOOKUP(CU42,Teilnehmer!$A$3:$C$102,2))","v":""},null,null,{"$f":"IF(CX42=\"\",\"\",VLOOKUP(CX42,Teilnehmer!$A$3:$C$102,2))","v":""},null,null,null,{"$f":"IF(DB42=\"\",\"\",VLOOKUP(DB42,Teilnehmer!$A$3:$C$102,2))","v":""},null,null,{"$f":"IF(DE42=\"\",\"\",VLOOKUP(DE42,Teilnehmer!$A$3:$C$102,2))","v":""},null,null,null,{"$f":"IF(DI42=\"\",\"\",VLOOKUP(DI42,Teilnehmer!$A$3:$C$102,2))","v":""},null,null,{"$f":"IF(DL42=\"\",\"\",VLOOKUP(DL42,Teilnehmer!$A$3:$C$102,2))","v":""},null,null,null,{"$f":"IF(DP42=\"\",\"\",VLOOKUP(DP42,Teilnehmer!$A$3:$C$102,2))","v":""},null,null,{"$f":"IF(DS42=\"\",\"\",VLOOKUP(DS42,Teilnehmer!$A$3:$C$102,2))","v":""},null,null,null,{"$f":"IF(DW42=\"\",\"\",VLOOKUP(DW42,Teilnehmer!$A$3:$C$102,2))","v":""},null,null,{"$f":"IF(DZ42=\"\",\"\",VLOOKUP(DZ42,Teilnehmer!$A$3:$C$102,2))","v":""},null,null,null,{"$f":"IF(ED42=\"\",\"\",VLOOKUP(ED42,Teilnehmer!$A$3:$C$102,2))","v":""},null,null,{"$f":"IF(EG42=\"\",\"\",VLOOKUP(EG42,Teilnehmer!$A$3:$C$102,2))","v":""},null,null,null,{"$f":"IF(EK42=\"\",\"\",VLOOKUP(EK42,Teilnehmer!$A$3:$C$102,2))","v":""},null,null,{"$f":"IF(EN42=\"\",\"\",VLOOKUP(EN42,Teilnehmer!$A$3:$C$102,2))","v":""},null,null,null,{"$f":"IF(ER42=\"\",\"\",VLOOKUP(ER42,Teilnehmer!$A$3:$C$102,2))","v":""},null,null,{"$f":"IF(EU42=\"\",\"\",VLOOKUP(EU42,Teilnehmer!$A$3:$C$102,2))","v":""},null,null,null,{"$f":"IF(EY42=\"\",\"\",VLOOKUP(EY42,Teilnehmer!$A$3:$C$102,2))","v":""},null,null,{"$f":"IF(FB42=\"\",\"\",VLOOKUP(FB42,Teilnehmer!$A$3:$C$102,2))","v":""},null,null,null,{"$f":"IF(FF42=\"\",\"\",VLOOKUP(FF42,Teilnehmer!$A$3:$C$102,2))","v":""},null,null,{"$f":"IF(FI42=\"\",\"\",VLOOKUP(FI42,Teilnehmer!$A$3:$C$102,2))","v":""},null,null,null,{"$f":"IF(FM42=\"\",\"\",VLOOKUP(FM42,Teilnehmer!$A$3:$C$102,2))","v":""},null,null,{"$f":"IF(FP42=\"\",\"\",VLOOKUP(FP42,Teilnehmer!$A$3:$C$102,2))","v":""},null,null,null,{"$f":"IF(FT42=\"\",\"\",VLOOKUP(FT42,Teilnehmer!$A$3:$C$102,2))","v":""},null,null,{"$f":"IF(FW42=\"\",\"\",VLOOKUP(FW42,Teilnehmer!$A$3:$C$102,2))","v":""},null,null,null,{"$f":"IF(GA42=\"\",\"\",VLOOKUP(GA42,Teilnehmer!$A$3:$C$102,2))","v":""},null,null,{"$f":"IF(GD42=\"\",\"\",VLOOKUP(GD42,Teilnehmer!$A$3:$C$102,2))","v":""},null,null,null,{"$f":"IF(GH42=\"\",\"\",VLOOKUP(GH42,Teilnehmer!$A$3:$C$102,2))","v":""},null,null,{"$f":"IF(GK42=\"\",\"\",VLOOKUP(GK42,Teilnehmer!$A$3:$C$102,2))","v":""},null,null,null,{"$f":"IF(GO42=\"\",\"\",VLOOKUP(GO42,Teilnehmer!$A$3:$C$102,2))","v":""},null,null,{"$f":"IF(GR42=\"\",\"\",VLOOKUP(GR42,Teilnehmer!$A$3:$C$102,2))","v":""},null,null,null,{"$f":"IF(GV42=\"\",\"\",VLOOKUP(GV42,Teilnehmer!$A$3:$C$102,2))","v":""},null,null,{"$f":"IF(GY42=\"\",\"\",VLOOKUP(GY42,Teilnehmer!$A$3:$C$102,2))","v":""},null,null,null,{"$f":"IF(HC42=\"\",\"\",VLOOKUP(HC42,Teilnehmer!$A$3:$C$102,2))","v":""},null,null,{"$f":"IF(HF42=\"\",\"\",VLOOKUP(HF42,Teilnehmer!$A$3:$C$102,2))","v":""},null,null,null,{"$f":"IF(HJ42=\"\",\"\",VLOOKUP(HJ42,Teilnehmer!$A$3:$C$102,2))","v":""},null,null,{"$f":"IF(HM42=\"\",\"\",VLOOKUP(HM42,Teilnehmer!$A$3:$C$102,2))","v":""},null,null,null,{"$f":"IF(HQ42=\"\",\"\",VLOOKUP(HQ42,Teilnehmer!$A$3:$C$102,2))","v":""},null,null,{"$f":"IF(HT42=\"\",\"\",VLOOKUP(HT42,Teilnehmer!$A$3:$C$102,2))","v":""},null,null,null,{"$f":"IF(HX42=\"\",\"\",VLOOKUP(HX42,Teilnehmer!$A$3:$C$102,2))","v":""},null,null,{"$f":"IF(IA42=\"\",\"\",VLOOKUP(IA42,Teilnehmer!$A$3:$C$102,2))","v":""},null,null,null,{"$f":"IF(IE42=\"\",\"\",VLOOKUP(IE42,Teilnehmer!$A$3:$C$102,2))","v":""},null,null,{"$f":"IF(IH42=\"\",\"\",VLOOKUP(IH42,Teilnehmer!$A$3:$C$102,2))","v":""},null,null,null,{"$f":"IF(IL42=\"\",\"\",VLOOKUP(IL42,Teilnehmer!$A$3:$C$102,2))","v":""},null,null,{"$f":"IF(IO42=\"\",\"\",VLOOKUP(IO42,Teilnehmer!$A$3:$C$102,2))","v":""},null,null,null,{"$f":"IF(IS42=\"\",\"\",VLOOKUP(IS42,Teilnehmer!$A$3:$C$102,2))","v":""},null,null,{"$f":"IF(IV42=\"\",\"\",VLOOKUP(IV42,Teilnehmer!$A$3:$C$102,2))","v":""},null,null,null,{"$f":"IF(IZ42=\"\",\"\",VLOOKUP(IZ42,Teilnehmer!$A$3:$C$102,2))","v":""},null,null,{"$f":"IF(JC42=\"\",\"\",VLOOKUP(JC42,Teilnehmer!$A$3:$C$102,2))","v":""},null,null,null,{"$f":"IF(JG42=\"\",\"\",VLOOKUP(JG42,Teilnehmer!$A$3:$C$102,2))","v":""},null,null,{"$f":"IF(JJ42=\"\",\"\",VLOOKUP(JJ42,Teilnehmer!$A$3:$C$102,2))","v":""},null,null,null,{"$f":"IF(JN42=\"\",\"\",VLOOKUP(JN42,Teilnehmer!$A$3:$C$102,2))","v":""},null,null,{"$f":"IF(JQ42=\"\",\"\",VLOOKUP(JQ42,Teilnehmer!$A$3:$C$102,2))","v":""},null,null,null,{"$f":"IF(JU42=\"\",\"\",VLOOKUP(JU42,Teilnehmer!$A$3:$C$102,2))","v":""},null,null,{"$f":"IF(JX42=\"\",\"\",VLOOKUP(JX42,Teilnehmer!$A$3:$C$102,2))","v":""},null,null,null,{"$f":"IF(KB42=\"\",\"\",VLOOKUP(KB42,Teilnehmer!$A$3:$C$102,2))","v":""},null,null,{"$f":"IF(KE42=\"\",\"\",VLOOKUP(KE42,Teilnehmer!$A$3:$C$102,2))","v":""},null,null,null,{"$f":"IF(KI42=\"\",\"\",VLOOKUP(KI42,Teilnehmer!$A$3:$C$102,2))","v":""},null,null,{"$f":"IF(KL42=\"\",\"\",VLOOKUP(KL42,Teilnehmer!$A$3:$C$102,2))","v":""},null,null,null,{"$f":"IF(KP42=\"\",\"\",VLOOKUP(KP42,Teilnehmer!$A$3:$C$102,2))","v":""},null,null,{"$f":"IF(KS42=\"\",\"\",VLOOKUP(KS42,Teilnehmer!$A$3:$C$102,2))","v":""}]
[null,{"$f":"IF(A43=\"\",\"\",VLOOKUP(A43,Teilnehmer!$A$3:$C$102,2))","v":""},null,null,{"$f":"IF(D43=\"\",\"\",VLOOKUP(D43,Teilnehmer!$A$3:$C$102,2))","v":""},null,null,null,{"$f":"IF(H43=\"\",\"\",VLOOKUP(H43,Teilnehmer!$A$3:$C$102,2))","v":""},null,null,{"$f":"IF(K43=\"\",\"\",VLOOKUP(K43,Teilnehmer!$A$3:$C$102,2))","v":""},null,null,null,{"$f":"IF(O43=\"\",\"\",VLOOKUP(O43,Teilnehmer!$A$3:$C$102,2))","v":""},null,null,{"$f":"IF(R43=\"\",\"\",VLOOKUP(R43,Teilnehmer!$A$3:$C$102,2))","v":""},null,null,null,{"$f":"IF(V43=\"\",\"\",VLOOKUP(V43,Teilnehmer!$A$3:$C$102,2))","v":""},null,null,{"$f":"IF(Y43=\"\",\"\",VLOOKUP(Y43,Teilnehmer!$A$3:$C$102,2))","v":""},null,null,null,{"$f":"IF(AC43=\"\",\"\",VLOOKUP(AC43,Teilnehmer!$A$3:$C$102,2))","v":""},null,null,{"$f":"IF(AF43=\"\",\"\",VLOOKUP(AF43,Teilnehmer!$A$3:$C$102,2))","v":""},null,null,null,{"$f":"IF(AJ43=\"\",\"\",VLOOKUP(AJ43,Teilnehmer!$A$3:$C$102,2))","v":""},null,null,{"$f":"IF(AM43=\"\",\"\",VLOOKUP(AM43,Teilnehmer!$A$3:$C$102,2))","v":""},null,null,null,{"$f":"IF(AQ43=\"\",\"\",VLOOKUP(AQ43,Teilnehmer!$A$3:$C$102,2))","v":""},null,null,{"$f":"IF(AT43=\"\",\"\",VLOOKUP(AT43,Teilnehmer!$A$3:$C$102,2))","v":""},null,null,null,{"$f":"IF(AX43=\"\",\"\",VLOOKUP(AX43,Teilnehmer!$A$3:$C$102,2))","v":""},null,null,{"$f":"IF(BA43=\"\",\"\",VLOOKUP(BA43,Teilnehmer!$A$3:$C$102,2))","v":""},null,null,null,{"$f":"IF(BE43=\"\",\"\",VLOOKUP(BE43,Teilnehmer!$A$3:$C$102,2))","v":""},null,null,{"$f":"IF(BH43=\"\",\"\",VLOOKUP(BH43,Teilnehmer!$A$3:$C$102,2))","v":""},null,null,null,{"$f":"IF(BL43=\"\",\"\",VLOOKUP(BL43,Teilnehmer!$A$3:$C$102,2))","v":""},null,null,{"$f":"IF(BO43=\"\",\"\",VLOOKUP(BO43,Teilnehmer!$A$3:$C$102,2))","v":""},null,null,null,{"$f":"IF(BS43=\"\",\"\",VLOOKUP(BS43,Teilnehmer!$A$3:$C$102,2))","v":""},null,null,{"$f":"IF(BV43=\"\",\"\",VLOOKUP(BV43,Teilnehmer!$A$3:$C$102,2))","v":""},null,null,null,{"$f":"IF(BZ43=\"\",\"\",VLOOKUP(BZ43,Teilnehmer!$A$3:$C$102,2))","v":""},null,null,{"$f":"IF(CC43=\"\",\"\",VLOOKUP(CC43,Teilnehmer!$A$3:$C$102,2))","v":""},null,null,null,{"$f":"IF(CG43=\"\",\"\",VLOOKUP(CG43,Teilnehmer!$A$3:$C$102,2))","v":""},null,null,{"$f":"IF(CJ43=\"\",\"\",VLOOKUP(CJ43,Teilnehmer!$A$3:$C$102,2))","v":""},null,null,null,{"$f":"IF(CN43=\"\",\"\",VLOOKUP(CN43,Teilnehmer!$A$3:$C$102,2))","v":""},null,null,{"$f":"IF(CQ43=\"\",\"\",VLOOKUP(CQ43,Teilnehmer!$A$3:$C$102,2))","v":""},null,null,null,{"$f":"IF(CU43=\"\",\"\",VLOOKUP(CU43,Teilnehmer!$A$3:$C$102,2))","v":""},null,null,{"$f":"IF(CX43=\"\",\"\",VLOOKUP(CX43,Teilnehmer!$A$3:$C$102,2))","v":""},null,null,null,{"$f":"IF(DB43=\"\",\"\",VLOOKUP(DB43,Teilnehmer!$A$3:$C$102,2))","v":""},null,null,{"$f":"IF(DE43=\"\",\"\",VLOOKUP(DE43,Teilnehmer!$A$3:$C$102,2))","v":""},null,null,null,{"$f":"IF(DI43=\"\",\"\",VLOOKUP(DI43,Teilnehmer!$A$3:$C$102,2))","v":""},null,null,{"$f":"IF(DL43=\"\",\"\",VLOOKUP(DL43,Teilnehmer!$A$3:$C$102,2))","v":""},null,null,null,{"$f":"IF(DP43=\"\",\"\",VLOOKUP(DP43,Teilnehmer!$A$3:$C$102,2))","v":""},null,null,{"$f":"IF(DS43=\"\",\"\",VLOOKUP(DS43,Teilnehmer!$A$3:$C$102,2))","v":""},null,null,null,{"$f":"IF(DW43=\"\",\"\",VLOOKUP(DW43,Teilnehmer!$A$3:$C$102,2))","v":""},null,null,{"$f":"IF(DZ43=\"\",\"\",VLOOKUP(DZ43,Teilnehmer!$A$3:$C$102,2))","v":""},null,null,null,{"$f":"IF(ED43=\"\",\"\",VLOOKUP(ED43,Teilnehmer!$A$3:$C$102,2))","v":""},null,null,{"$f":"IF(EG43=\"\",\"\",VLOOKUP(EG43,Teilnehmer!$A$3:$C$102,2))","v":""},null,null,null,{"$f":"IF(EK43=\"\",\"\",VLOOKUP(EK43,Teilnehmer!$A$3:$C$102,2))","v":""},null,null,{"$f":"IF(EN43=\"\",\"\",VLOOKUP(EN43,Teilnehmer!$A$3:$C$102,2))","v":""},null,null,null,{"$f":"IF(ER43=\"\",\"\",VLOOKUP(ER43,Teilnehmer!$A$3:$C$102,2))","v":""},null,null,{"$f":"IF(EU43=\"\",\"\",VLOOKUP(EU43,Teilnehmer!$A$3:$C$102,2))","v":""},null,null,null,{"$f":"IF(EY43=\"\",\"\",VLOOKUP(EY43,Teilnehmer!$A$3:$C$102,2))","v":""},null,null,{"$f":"IF(FB43=\"\",\"\",VLOOKUP(FB43,Teilnehmer!$A$3:$C$102,2))","v":""},null,null,null,{"$f":"IF(FF43=\"\",\"\",VLOOKUP(FF43,Teilnehmer!$A$3:$C$102,2))","v":""},null,null,{"$f":"IF(FI43=\"\",\"\",VLOOKUP(FI43,Teilnehmer!$A$3:$C$102,2))","v":""},null,null,null,{"$f":"IF(FM43=\"\",\"\",VLOOKUP(FM43,Teilnehmer!$A$3:$C$102,2))","v":""},null,null,{"$f":"IF(FP43=\"\",\"\",VLOOKUP(FP43,Teilnehmer!$A$3:$C$102,2))","v":""},null,null,null,{"$f":"IF(FT43=\"\",\"\",VLOOKUP(FT43,Teilnehmer!$A$3:$C$102,2))","v":""},null,null,{"$f":"IF(FW43=\"\",\"\",VLOOKUP(FW43,Teilnehmer!$A$3:$C$102,2))","v":""},null,null,null,{"$f":"IF(GA43=\"\",\"\",VLOOKUP(GA43,Teilnehmer!$A$3:$C$102,2))","v":""},null,null,{"$f":"IF(GD43=\"\",\"\",VLOOKUP(GD43,Teilnehmer!$A$3:$C$102,2))","v":""},null,null,null,{"$f":"IF(GH43=\"\",\"\",VLOOKUP(GH43,Teilnehmer!$A$3:$C$102,2))","v":""},null,null,{"$f":"IF(GK43=\"\",\"\",VLOOKUP(GK43,Teilnehmer!$A$3:$C$102,2))","v":""},null,null,null,{"$f":"IF(GO43=\"\",\"\",VLOOKUP(GO43,Teilnehmer!$A$3:$C$102,2))","v":""},null,null,{"$f":"IF(GR43=\"\",\"\",VLOOKUP(GR43,Teilnehmer!$A$3:$C$102,2))","v":""},null,null,null,{"$f":"IF(GV43=\"\",\"\",VLOOKUP(GV43,Teilnehmer!$A$3:$C$102,2))","v":""},null,null,{"$f":"IF(GY43=\"\",\"\",VLOOKUP(GY43,Teilnehmer!$A$3:$C$102,2))","v":""},null,null,null,{"$f":"IF(HC43=\"\",\"\",VLOOKUP(HC43,Teilnehmer!$A$3:$C$102,2))","v":""},null,null,{"$f":"IF(HF43=\"\",\"\",VLOOKUP(HF43,Teilnehmer!$A$3:$C$102,2))","v":""},null,null,null,{"$f":"IF(HJ43=\"\",\"\",VLOOKUP(HJ43,Teilnehmer!$A$3:$C$102,2))","v":""},null,null,{"$f":"IF(HM43=\"\",\"\",VLOOKUP(HM43,Teilnehmer!$A$3:$C$102,2))","v":""},null,null,null,{"$f":"IF(HQ43=\"\",\"\",VLOOKUP(HQ43,Teilnehmer!$A$3:$C$102,2))","v":""},null,null,{"$f":"IF(HT43=\"\",\"\",VLOOKUP(HT43,Teilnehmer!$A$3:$C$102,2))","v":""},null,null,null,{"$f":"IF(HX43=\"\",\"\",VLOOKUP(HX43,Teilnehmer!$A$3:$C$102,2))","v":""},null,null,{"$f":"IF(IA43=\"\",\"\",VLOOKUP(IA43,Teilnehmer!$A$3:$C$102,2))","v":""},null,null,null,{"$f":"IF(IE43=\"\",\"\",VLOOKUP(IE43,Teilnehmer!$A$3:$C$102,2))","v":""},null,null,{"$f":"IF(IH43=\"\",\"\",VLOOKUP(IH43,Teilnehmer!$A$3:$C$102,2))","v":""},null,null,null,{"$f":"IF(IL43=\"\",\"\",VLOOKUP(IL43,Teilnehmer!$A$3:$C$102,2))","v":""},null,null,{"$f":"IF(IO43=\"\",\"\",VLOOKUP(IO43,Teilnehmer!$A$3:$C$102,2))","v":""},null,null,null,{"$f":"IF(IS43=\"\",\"\",VLOOKUP(IS43,Teilnehmer!$A$3:$C$102,2))","v":""},null,null,{"$f":"IF(IV43=\"\",\"\",VLOOKUP(IV43,Teilnehmer!$A$3:$C$102,2))","v":""},null,null,null,{"$f":"IF(IZ43=\"\",\"\",VLOOKUP(IZ43,Teilnehmer!$A$3:$C$102,2))","v":""},null,null,{"$f":"IF(JC43=\"\",\"\",VLOOKUP(JC43,Teilnehmer!$A$3:$C$102,2))","v":""},null,null,null,{"$f":"IF(JG43=\"\",\"\",VLOOKUP(JG43,Teilnehmer!$A$3:$C$102,2))","v":""},null,null,{"$f":"IF(JJ43=\"\",\"\",VLOOKUP(JJ43,Teilnehmer!$A$3:$C$102,2))","v":""},null,null,null,{"$f":"IF(JN43=\"\",\"\",VLOOKUP(JN43,Teilnehmer!$A$3:$C$102,2))","v":""},null,null,{"$f":"IF(JQ43=\"\",\"\",VLOOKUP(JQ43,Teilnehmer!$A$3:$C$102,2))","v":""},null,null,null,{"$f":"IF(JU43=\"\",\"\",VLOOKUP(JU43,Teilnehmer!$A$3:$C$102,2))","v":""},null,null,{"$f":"IF(JX43=\"\",\"\",VLOOKUP(JX43,Teilnehmer!$A$3:$C$102,2))","v":""},null,null,null,{"$f":"IF(KB43=\"\",\"\",VLOOKUP(KB43,Teilnehmer!$A$3:$C$102,2))","v":""},null,null,{"$f":"IF(KE43=\"\",\"\",VLOOKUP(KE43,Teilnehmer!$A$3:$C$102,2))","v":""},null,null,null,{"$f":"IF(KI43=\"\",\"\",VLOOKUP(KI43,Teilnehmer!$A$3:$C$102,2))","v":""},null,null,{"$f":"IF(KL43=\"\",\"\",VLOOKUP(KL43,Teilnehmer!$A$3:$C$102,2))","v":""},null,null,null,{"$f":"IF(KP43=\"\",\"\",VLOOKUP(KP43,Teilnehmer!$A$3:$C$102,2))","v":""},null,null,{"$f":"IF(KS43=\"\",\"\",VLOOKUP(KS43,Teilnehmer!$A$3:$C$102,2))","v":""}]
[null,{"$f":"IF(A44=\"\",\"\",VLOOKUP(A44,Teilnehmer!$A$3:$C$102,2))","v":""},null,null,{"$f":"IF(D44=\"\",\"\",VLOOKUP(D44,Teilnehmer!$A$3:$C$102,2))","v":""},null,null,null,{"$f":"IF(H44=\"\",\"\",VLOOKUP(H44,Teilnehmer!$A$3:$C$102,2))","v":""},null,null,{"$f":"IF(K44=\"\",\"\",VLOOKUP(K44,Teilnehmer!$A$3:$C$102,2))","v":""},null,null,null,{"$f":"IF(O44=\"\",\"\",VLOOKUP(O44,Teilnehmer!$A$3:$C$102,2))","v":""},null,null,{"$f":"IF(R44=\"\",\"\",VLOOKUP(R44,Teilnehmer!$A$3:$C$102,2))","v":""},null,null,null,{"$f":"IF(V44=\"\",\"\",VLOOKUP(V44,Teilnehmer!$A$3:$C$102,2))","v":""},null,null,{"$f":"IF(Y44=\"\",\"\",VLOOKUP(Y44,Teilnehmer!$A$3:$C$102,2))","v":""},null,null,null,{"$f":"IF(AC44=\"\",\"\",VLOOKUP(AC44,Teilnehmer!$A$3:$C$102,2))","v":""},null,null,{"$f":"IF(AF44=\"\",\"\",VLOOKUP(AF44,Teilnehmer!$A$3:$C$102,2))","v":""},null,null,null,{"$f":"IF(AJ44=\"\",\"\",VLOOKUP(AJ44,Teilnehmer!$A$3:$C$102,2))","v":""},null,null,{"$f":"IF(AM44=\"\",\"\",VLOOKUP(AM44,Teilnehmer!$A$3:$C$102,2))","v":""},null,null,null,{"$f":"IF(AQ44=\"\",\"\",VLOOKUP(AQ44,Teilnehmer!$A$3:$C$102,2))","v":""},null,null,{"$f":"IF(AT44=\"\",\"\",VLOOKUP(AT44,Teilnehmer!$A$3:$C$102,2))","v":""},null,null,null,{"$f":"IF(AX44=\"\",\"\",VLOOKUP(AX44,Teilnehmer!$A$3:$C$102,2))","v":""},null,null,{"$f":"IF(BA44=\"\",\"\",VLOOKUP(BA44,Teilnehmer!$A$3:$C$102,2))","v":""},null,null,null,{"$f":"IF(BE44=\"\",\"\",VLOOKUP(BE44,Teilnehmer!$A$3:$C$102,2))","v":""},null,null,{"$f":"IF(BH44=\"\",\"\",VLOOKUP(BH44,Teilnehmer!$A$3:$C$102,2))","v":""},null,null,null,{"$f":"IF(BL44=\"\",\"\",VLOOKUP(BL44,Teilnehmer!$A$3:$C$102,2))","v":""},null,null,{"$f":"IF(BO44=\"\",\"\",VLOOKUP(BO44,Teilnehmer!$A$3:$C$102,2))","v":""},null,null,null,{"$f":"IF(BS44=\"\",\"\",VLOOKUP(BS44,Teilnehmer!$A$3:$C$102,2))","v":""},null,null,{"$f":"IF(BV44=\"\",\"\",VLOOKUP(BV44,Teilnehmer!$A$3:$C$102,2))","v":""},null,null,null,{"$f":"IF(BZ44=\"\",\"\",VLOOKUP(BZ44,Teilnehmer!$A$3:$C$102,2))","v":""},null,null,{"$f":"IF(CC44=\"\",\"\",VLOOKUP(CC44,Teilnehmer!$A$3:$C$102,2))","v":""},null,null,null,{"$f":"IF(CG44=\"\",\"\",VLOOKUP(CG44,Teilnehmer!$A$3:$C$102,2))","v":""},null,null,{"$f":"IF(CJ44=\"\",\"\",VLOOKUP(CJ44,Teilnehmer!$A$3:$C$102,2))","v":""},null,null,null,{"$f":"IF(CN44=\"\",\"\",VLOOKUP(CN44,Teilnehmer!$A$3:$C$102,2))","v":""},null,null,{"$f":"IF(CQ44=\"\",\"\",VLOOKUP(CQ44,Teilnehmer!$A$3:$C$102,2))","v":""},null,null,null,{"$f":"IF(CU44=\"\",\"\",VLOOKUP(CU44,Teilnehmer!$A$3:$C$102,2))","v":""},null,null,{"$f":"IF(CX44=\"\",\"\",VLOOKUP(CX44,Teilnehmer!$A$3:$C$102,2))","v":""},null,null,null,{"$f":"IF(DB44=\"\",\"\",VLOOKUP(DB44,Teilnehmer!$A$3:$C$102,2))","v":""},null,null,{"$f":"IF(DE44=\"\",\"\",VLOOKUP(DE44,Teilnehmer!$A$3:$C$102,2))","v":""},null,null,null,{"$f":"IF(DI44=\"\",\"\",VLOOKUP(DI44,Teilnehmer!$A$3:$C$102,2))","v":""},null,null,{"$f":"IF(DL44=\"\",\"\",VLOOKUP(DL44,Teilnehmer!$A$3:$C$102,2))","v":""},null,null,null,{"$f":"IF(DP44=\"\",\"\",VLOOKUP(DP44,Teilnehmer!$A$3:$C$102,2))","v":""},null,null,{"$f":"IF(DS44=\"\",\"\",VLOOKUP(DS44,Teilnehmer!$A$3:$C$102,2))","v":""},null,null,null,{"$f":"IF(DW44=\"\",\"\",VLOOKUP(DW44,Teilnehmer!$A$3:$C$102,2))","v":""},null,null,{"$f":"IF(DZ44=\"\",\"\",VLOOKUP(DZ44,Teilnehmer!$A$3:$C$102,2))","v":""},null,null,null,{"$f":"IF(ED44=\"\",\"\",VLOOKUP(ED44,Teilnehmer!$A$3:$C$102,2))","v":""},null,null,{"$f":"IF(EG44=\"\",\"\",VLOOKUP(EG44,Teilnehmer!$A$3:$C$102,2))","v":""},null,null,null,{"$f":"IF(EK44=\"\",\"\",VLOOKUP(EK44,Teilnehmer!$A$3:$C$102,2))","v":""},null,null,{"$f":"IF(EN44=\"\",\"\",VLOOKUP(EN44,Teilnehmer!$A$3:$C$102,2))","v":""},null,null,null,{"$f":"IF(ER44=\"\",\"\",VLOOKUP(ER44,Teilnehmer!$A$3:$C$102,2))","v":""},null,null,{"$f":"IF(EU44=\"\",\"\",VLOOKUP(EU44,Teilnehmer!$A$3:$C$102,2))","v":""},null,null,null,{"$f":"IF(EY44=\"\",\"\",VLOOKUP(EY44,Teilnehmer!$A$3:$C$102,2))","v":""},null,null,{"$f":"IF(FB44=\"\",\"\",VLOOKUP(FB44,Teilnehmer!$A$3:$C$102,2))","v":""},null,null,null,{"$f":"IF(FF44=\"\",\"\",VLOOKUP(FF44,Teilnehmer!$A$3:$C$102,2))","v":""},null,null,{"$f":"IF(FI44=\"\",\"\",VLOOKUP(FI44,Teilnehmer!$A$3:$C$102,2))","v":""},null,null,null,{"$f":"IF(FM44=\"\",\"\",VLOOKUP(FM44,Teilnehmer!$A$3:$C$102,2))","v":""},null,null,{"$f":"IF(FP44=\"\",\"\",VLOOKUP(FP44,Teilnehmer!$A$3:$C$102,2))","v":""},null,null,null,{"$f":"IF(FT44=\"\",\"\",VLOOKUP(FT44,Teilnehmer!$A$3:$C$102,2))","v":""},null,null,{"$f":"IF(FW44=\"\",\"\",VLOOKUP(FW44,Teilnehmer!$A$3:$C$102,2))","v":""},null,null,null,{"$f":"IF(GA44=\"\",\"\",VLOOKUP(GA44,Teilnehmer!$A$3:$C$102,2))","v":""},null,null,{"$f":"IF(GD44=\"\",\"\",VLOOKUP(GD44,Teilnehmer!$A$3:$C$102,2))","v":""},null,null,null,{"$f":"IF(GH44=\"\",\"\",VLOOKUP(GH44,Teilnehmer!$A$3:$C$102,2))","v":""},null,null,{"$f":"IF(GK44=\"\",\"\",VLOOKUP(GK44,Teilnehmer!$A$3:$C$102,2))","v":""},null,null,null,{"$f":"IF(GO44=\"\",\"\",VLOOKUP(GO44,Teilnehmer!$A$3:$C$102,2))","v":""},null,null,{"$f":"IF(GR44=\"\",\"\",VLOOKUP(GR44,Teilnehmer!$A$3:$C$102,2))","v":""},null,null,null,{"$f":"IF(GV44=\"\",\"\",VLOOKUP(GV44,Teilnehmer!$A$3:$C$102,2))","v":""},null,null,{"$f":"IF(GY44=\"\",\"\",VLOOKUP(GY44,Teilnehmer!$A$3:$C$102,2))","v":""},null,null,null,{"$f":"IF(HC44=\"\",\"\",VLOOKUP(HC44,Teilnehmer!$A$3:$C$102,2))","v":""},null,null,{"$f":"IF(HF44=\"\",\"\",VLOOKUP(HF44,Teilnehmer!$A$3:$C$102,2))","v":""},null,null,null,{"$f":"IF(HJ44=\"\",\"\",VLOOKUP(HJ44,Teilnehmer!$A$3:$C$102,2))","v":""},null,null,{"$f":"IF(HM44=\"\",\"\",VLOOKUP(HM44,Teilnehmer!$A$3:$C$102,2))","v":""},null,null,null,{"$f":"IF(HQ44=\"\",\"\",VLOOKUP(HQ44,Teilnehmer!$A$3:$C$102,2))","v":""},null,null,{"$f":"IF(HT44=\"\",\"\",VLOOKUP(HT44,Teilnehmer!$A$3:$C$102,2))","v":""},null,null,null,{"$f":"IF(HX44=\"\",\"\",VLOOKUP(HX44,Teilnehmer!$A$3:$C$102,2))","v":""},null,null,{"$f":"IF(IA44=\"\",\"\",VLOOKUP(IA44,Teilnehmer!$A$3:$C$102,2))","v":""},null,null,null,{"$f":"IF(IE44=\"\",\"\",VLOOKUP(IE44,Teilnehmer!$A$3:$C$102,2))","v":""},null,null,{"$f":"IF(IH44=\"\",\"\",VLOOKUP(IH44,Teilnehmer!$A$3:$C$102,2))","v":""},null,null,null,{"$f":"IF(IL44=\"\",\"\",VLOOKUP(IL44,Teilnehmer!$A$3:$C$102,2))","v":""},null,null,{"$f":"IF(IO44=\"\",\"\",VLOOKUP(IO44,Teilnehmer!$A$3:$C$102,2))","v":""},null,null,null,{"$f":"IF(IS44=\"\",\"\",VLOOKUP(IS44,Teilnehmer!$A$3:$C$102,2))","v":""},null,null,{"$f":"IF(IV44=\"\",\"\",VLOOKUP(IV44,Teilnehmer!$A$3:$C$102,2))","v":""},null,null,null,{"$f":"IF(IZ44=\"\",\"\",VLOOKUP(IZ44,Teilnehmer!$A$3:$C$102,2))","v":""},null,null,{"$f":"IF(JC44=\"\",\"\",VLOOKUP(JC44,Teilnehmer!$A$3:$C$102,2))","v":""},null,null,null,{"$f":"IF(JG44=\"\",\"\",VLOOKUP(JG44,Teilnehmer!$A$3:$C$102,2))","v":""},null,null,{"$f":"IF(JJ44=\"\",\"\",VLOOKUP(JJ44,Teilnehmer!$A$3:$C$102,2))","v":""},null,null,null,{"$f":"IF(JN44=\"\",\"\",VLOOKUP(JN44,Teilnehmer!$A$3:$C$102,2))","v":""},null,null,{"$f":"IF(JQ44=\"\",\"\",VLOOKUP(JQ44,Teilnehmer!$A$3:$C$102,2))","v":""},null,null,null,{"$f":"IF(JU44=\"\",\"\",VLOOKUP(JU44,Teilnehmer!$A$3:$C$102,2))","v":""},null,null,{"$f":"IF(JX44=\"\",\"\",VLOOKUP(JX44,Teilnehmer!$A$3:$C$102,2))","v":""},null,null,null,{"$f":"IF(KB44=\"\",\"\",VLOOKUP(KB44,Teilnehmer!$A$3:$C$102,2))","v":""},null,null,{"$f":"IF(KE44=\"\",\"\",VLOOKUP(KE44,Teilnehmer!$A$3:$C$102,2))","v":""},null,null,null,{"$f":"IF(KI44=\"\",\"\",VLOOKUP(KI44,Teilnehmer!$A$3:$C$102,2))","v":""},null,null,{"$f":"IF(KL44=\"\",\"\",VLOOKUP(KL44,Teilnehmer!$A$3:$C$102,2))","v":""},null,null,null,{"$f":"IF(KP44=\"\",\"\",VLOOKUP(KP44,Teilnehmer!$A$3:$C$102,2))","v":""},null,null,{"$f":"IF(KS44=\"\",\"\",VLOOKUP(KS44,Teilnehmer!$A$3:$C$102,2))","v":""}]
[null,{"$f":"IF(A45=\"\",\"\",VLOOKUP(A45,Teilnehmer!$A$3:$C$102,2))","v":""},null,null,{"$f":"IF(D45=\"\",\"\",VLOOKUP(D45,Teilnehmer!$A$3:$C$102,2))","v":""},null,null,null,{"$f":"IF(H45=\"\",\"\",VLOOKUP(H45,Teilnehmer!$A$3:$C$102,2))","v":""},null,null,{"$f":"IF(K45=\"\",\"\",VLOOKUP(K45,Teilnehmer!$A$3:$C$102,2))","v":""},null,null,null,{"$f":"IF(O45=\"\",\"\",VLOOKUP(O45,Teilnehmer!$A$3:$C$102,2))","v":""},null,null,{"$f":"IF(R45=\"\",\"\",VLOOKUP(R45,Teilnehmer!$A$3:$C$102,2))","v":""},null,null,null,{"$f":"IF(V45=\"\",\"\",VLOOKUP(V45,Teilnehmer!$A$3:$C$102,2))","v":""},null,null,{"$f":"IF(Y45=\"\",\"\",VLOOKUP(Y45,Teilnehmer!$A$3:$C$102,2))","v":""},null,null,null,{"$f":"IF(AC45=\"\",\"\",VLOOKUP(AC45,Teilnehmer!$A$3:$C$102,2))","v":""},null,null,{"$f":"IF(AF45=\"\",\"\",VLOOKUP(AF45,Teilnehmer!$A$3:$C$102,2))","v":""},null,null,null,{"$f":"IF(AJ45=\"\",\"\",VLOOKUP(AJ45,Teilnehmer!$A$3:$C$102,2))","v":""},null,null,{"$f":"IF(AM45=\"\",\"\",VLOOKUP(AM45,Teilnehmer!$A$3:$C$102,2))","v":""},null,null,null,{"$f":"IF(AQ45=\"\",\"\",VLOOKUP(AQ45,Teilnehmer!$A$3:$C$102,2))","v":""},null,null,{"$f":"IF(AT45=\"\",\"\",VLOOKUP(AT45,Teilnehmer!$A$3:$C$102,2))","v":""},null,null,null,{"$f":"IF(AX45=\"\",\"\",VLOOKUP(AX45,Teilnehmer!$A$3:$C$102,2))","v":""},null,null,{"$f":"IF(BA45=\"\",\"\",VLOOKUP(BA45,Teilnehmer!$A$3:$C$102,2))","v":""},null,null,null,{"$f":"IF(BE45=\"\",\"\",VLOOKUP(BE45,Teilnehmer!$A$3:$C$102,2))","v":""},null,null,{"$f":"IF(BH45=\"\",\"\",VLOOKUP(BH45,Teilnehmer!$A$3:$C$102,2))","v":""},null,null,null,{"$f":"IF(BL45=\"\",\"\",VLOOKUP(BL45,Teilnehmer!$A$3:$C$102,2))","v":""},null,null,{"$f":"IF(BO45=\"\",\"\",VLOOKUP(BO45,Teilnehmer!$A$3:$C$102,2))","v":""},null,null,null,{"$f":"IF(BS45=\"\",\"\",VLOOKUP(BS45,Teilnehmer!$A$3:$C$102,2))","v":""},null,null,{"$f":"IF(BV45=\"\",\"\",VLOOKUP(BV45,Teilnehmer!$A$3:$C$102,2))","v":""},null,null,null,{"$f":"IF(BZ45=\"\",\"\",VLOOKUP(BZ45,Teilnehmer!$A$3:$C$102,2))","v":""},null,null,{"$f":"IF(CC45=\"\",\"\",VLOOKUP(CC45,Teilnehmer!$A$3:$C$102,2))","v":""},null,null,null,{"$f":"IF(CG45=\"\",\"\",VLOOKUP(CG45,Teilnehmer!$A$3:$C$102,2))","v":""},null,null,{"$f":"IF(CJ45=\"\",\"\",VLOOKUP(CJ45,Teilnehmer!$A$3:$C$102,2))","v":""},null,null,null,{"$f":"IF(CN45=\"\",\"\",VLOOKUP(CN45,Teilnehmer!$A$3:$C$102,2))","v":""},null,null,{"$f":"IF(CQ45=\"\",\"\",VLOOKUP(CQ45,Teilnehmer!$A$3:$C$102,2))","v":""},null,null,null,{"$f":"IF(CU45=\"\",\"\",VLOOKUP(CU45,Teilnehmer!$A$3:$C$102,2))","v":""},null,null,{"$f":"IF(CX45=\"\",\"\",VLOOKUP(CX45,Teilnehmer!$A$3:$C$102,2))","v":""},null,null,null,{"$f":"IF(DB45=\"\",\"\",VLOOKUP(DB45,Teilnehmer!$A$3:$C$102,2))","v":""},null,null,{"$f":"IF(DE45=\"\",\"\",VLOOKUP(DE45,Teilnehmer!$A$3:$C$102,2))","v":""},null,null,null,{"$f":"IF(DI45=\"\",\"\",VLOOKUP(DI45,Teilnehmer!$A$3:$C$102,2))","v":""},null,null,{"$f":"IF(DL45=\"\",\"\",VLOOKUP(DL45,Teilnehmer!$A$3:$C$102,2))","v":""},null,null,null,{"$f":"IF(DP45=\"\",\"\",VLOOKUP(DP45,Teilnehmer!$A$3:$C$102,2))","v":""},null,null,{"$f":"IF(DS45=\"\",\"\",VLOOKUP(DS45,Teilnehmer!$A$3:$C$102,2))","v":""},null,null,null,{"$f":"IF(DW45=\"\",\"\",VLOOKUP(DW45,Teilnehmer!$A$3:$C$102,2))","v":""},null,null,{"$f":"IF(DZ45=\"\",\"\",VLOOKUP(DZ45,Teilnehmer!$A$3:$C$102,2))","v":""},null,null,null,{"$f":"IF(ED45=\"\",\"\",VLOOKUP(ED45,Teilnehmer!$A$3:$C$102,2))","v":""},null,null,{"$f":"IF(EG45=\"\",\"\",VLOOKUP(EG45,Teilnehmer!$A$3:$C$102,2))","v":""},null,null,null,{"$f":"IF(EK45=\"\",\"\",VLOOKUP(EK45,Teilnehmer!$A$3:$C$102,2))","v":""},null,null,{"$f":"IF(EN45=\"\",\"\",VLOOKUP(EN45,Teilnehmer!$A$3:$C$102,2))","v":""},null,null,null,{"$f":"IF(ER45=\"\",\"\",VLOOKUP(ER45,Teilnehmer!$A$3:$C$102,2))","v":""},null,null,{"$f":"IF(EU45=\"\",\"\",VLOOKUP(EU45,Teilnehmer!$A$3:$C$102,2))","v":""},null,null,null,{"$f":"IF(EY45=\"\",\"\",VLOOKUP(EY45,Teilnehmer!$A$3:$C$102,2))","v":""},null,null,{"$f":"IF(FB45=\"\",\"\",VLOOKUP(FB45,Teilnehmer!$A$3:$C$102,2))","v":""},null,null,null,{"$f":"IF(FF45=\"\",\"\",VLOOKUP(FF45,Teilnehmer!$A$3:$C$102,2))","v":""},null,null,{"$f":"IF(FI45=\"\",\"\",VLOOKUP(FI45,Teilnehmer!$A$3:$C$102,2))","v":""},null,null,null,{"$f":"IF(FM45=\"\",\"\",VLOOKUP(FM45,Teilnehmer!$A$3:$C$102,2))","v":""},null,null,{"$f":"IF(FP45=\"\",\"\",VLOOKUP(FP45,Teilnehmer!$A$3:$C$102,2))","v":""},null,null,null,{"$f":"IF(FT45=\"\",\"\",VLOOKUP(FT45,Teilnehmer!$A$3:$C$102,2))","v":""},null,null,{"$f":"IF(FW45=\"\",\"\",VLOOKUP(FW45,Teilnehmer!$A$3:$C$102,2))","v":""},null,null,null,{"$f":"IF(GA45=\"\",\"\",VLOOKUP(GA45,Teilnehmer!$A$3:$C$102,2))","v":""},null,null,{"$f":"IF(GD45=\"\",\"\",VLOOKUP(GD45,Teilnehmer!$A$3:$C$102,2))","v":""},null,null,null,{"$f":"IF(GH45=\"\",\"\",VLOOKUP(GH45,Teilnehmer!$A$3:$C$102,2))","v":""},null,null,{"$f":"IF(GK45=\"\",\"\",VLOOKUP(GK45,Teilnehmer!$A$3:$C$102,2))","v":""},null,null,null,{"$f":"IF(GO45=\"\",\"\",VLOOKUP(GO45,Teilnehmer!$A$3:$C$102,2))","v":""},null,null,{"$f":"IF(GR45=\"\",\"\",VLOOKUP(GR45,Teilnehmer!$A$3:$C$102,2))","v":""},null,null,null,{"$f":"IF(GV45=\"\",\"\",VLOOKUP(GV45,Teilnehmer!$A$3:$C$102,2))","v":""},null,null,{"$f":"IF(GY45=\"\",\"\",VLOOKUP(GY45,Teilnehmer!$A$3:$C$102,2))","v":""},null,null,null,{"$f":"IF(HC45=\"\",\"\",VLOOKUP(HC45,Teilnehmer!$A$3:$C$102,2))","v":""},null,null,{"$f":"IF(HF45=\"\",\"\",VLOOKUP(HF45,Teilnehmer!$A$3:$C$102,2))","v":""},null,null,null,{"$f":"IF(HJ45=\"\",\"\",VLOOKUP(HJ45,Teilnehmer!$A$3:$C$102,2))","v":""},null,null,{"$f":"IF(HM45=\"\",\"\",VLOOKUP(HM45,Teilnehmer!$A$3:$C$102,2))","v":""},null,null,null,{"$f":"IF(HQ45=\"\",\"\",VLOOKUP(HQ45,Teilnehmer!$A$3:$C$102,2))","v":""},null,null,{"$f":"IF(HT45=\"\",\"\",VLOOKUP(HT45,Teilnehmer!$A$3:$C$102,2))","v":""},null,null,null,{"$f":"IF(HX45=\"\",\"\",VLOOKUP(HX45,Teilnehmer!$A$3:$C$102,2))","v":""},null,null,{"$f":"IF(IA45=\"\",\"\",VLOOKUP(IA45,Teilnehmer!$A$3:$C$102,2))","v":""},null,null,null,{"$f":"IF(IE45=\"\",\"\",VLOOKUP(IE45,Teilnehmer!$A$3:$C$102,2))","v":""},null,null,{"$f":"IF(IH45=\"\",\"\",VLOOKUP(IH45,Teilnehmer!$A$3:$C$102,2))","v":""},null,null,null,{"$f":"IF(IL45=\"\",\"\",VLOOKUP(IL45,Teilnehmer!$A$3:$C$102,2))","v":""},null,null,{"$f":"IF(IO45=\"\",\"\",VLOOKUP(IO45,Teilnehmer!$A$3:$C$102,2))","v":""},null,null,null,{"$f":"IF(IS45=\"\",\"\",VLOOKUP(IS45,Teilnehmer!$A$3:$C$102,2))","v":""},null,null,{"$f":"IF(IV45=\"\",\"\",VLOOKUP(IV45,Teilnehmer!$A$3:$C$102,2))","v":""},null,null,null,{"$f":"IF(IZ45=\"\",\"\",VLOOKUP(IZ45,Teilnehmer!$A$3:$C$102,2))","v":""},null,null,{"$f":"IF(JC45=\"\",\"\",VLOOKUP(JC45,Teilnehmer!$A$3:$C$102,2))","v":""},null,null,null,{"$f":"IF(JG45=\"\",\"\",VLOOKUP(JG45,Teilnehmer!$A$3:$C$102,2))","v":""},null,null,{"$f":"IF(JJ45=\"\",\"\",VLOOKUP(JJ45,Teilnehmer!$A$3:$C$102,2))","v":""},null,null,null,{"$f":"IF(JN45=\"\",\"\",VLOOKUP(JN45,Teilnehmer!$A$3:$C$102,2))","v":""},null,null,{"$f":"IF(JQ45=\"\",\"\",VLOOKUP(JQ45,Teilnehmer!$A$3:$C$102,2))","v":""},null,null,null,{"$f":"IF(JU45=\"\",\"\",VLOOKUP(JU45,Teilnehmer!$A$3:$C$102,2))","v":""},null,null,{"$f":"IF(JX45=\"\",\"\",VLOOKUP(JX45,Teilnehmer!$A$3:$C$102,2))","v":""},null,null,null,{"$f":"IF(KB45=\"\",\"\",VLOOKUP(KB45,Teilnehmer!$A$3:$C$102,2))","v":""},null,null,{"$f":"IF(KE45=\"\",\"\",VLOOKUP(KE45,Teilnehmer!$A$3:$C$102,2))","v":""},null,null,null,{"$f":"IF(KI45=\"\",\"\",VLOOKUP(KI45,Teilnehmer!$A$3:$C$102,2))","v":""},null,null,{"$f":"IF(KL45=\"\",\"\",VLOOKUP(KL45,Teilnehmer!$A$3:$C$102,2))","v":""},null,null,null,{"$f":"IF(KP45=\"\",\"\",VLOOKUP(KP45,Teilnehmer!$A$3:$C$102,2))","v":""},null,null,{"$f":"IF(KS45=\"\",\"\",VLOOKUP(KS45,Teilnehmer!$A$3:$C$102,2))","v":""}]
[null,{"$f":"IF(A46=\"\",\"\",VLOOKUP(A46,Teilnehmer!$A$3:$C$102,2))","v":""},null,null,{"$f":"IF(D46=\"\",\"\",VLOOKUP(D46,Teilnehmer!$A$3:$C$102,2))","v":""},null,null,null,{"$f":"IF(H46=\"\",\"\",VLOOKUP(H46,Teilnehmer!$A$3:$C$102,2))","v":""},null,null,{"$f":"IF(K46=\"\",\"\",VLOOKUP(K46,Teilnehmer!$A$3:$C$102,2))","v":""},null,null,null,{"$f":"IF(O46=\"\",\"\",VLOOKUP(O46,Teilnehmer!$A$3:$C$102,2))","v":""},null,null,{"$f":"IF(R46=\"\",\"\",VLOOKUP(R46,Teilnehmer!$A$3:$C$102,2))","v":""},null,null,null,{"$f":"IF(V46=\"\",\"\",VLOOKUP(V46,Teilnehmer!$A$3:$C$102,2))","v":""},null,null,{"$f":"IF(Y46=\"\",\"\",VLOOKUP(Y46,Teilnehmer!$A$3:$C$102,2))","v":""},null,null,null,{"$f":"IF(AC46=\"\",\"\",VLOOKUP(AC46,Teilnehmer!$A$3:$C$102,2))","v":""},null,null,{"$f":"IF(AF46=\"\",\"\",VLOOKUP(AF46,Teilnehmer!$A$3:$C$102,2))","v":""},null,null,null,{"$f":"IF(AJ46=\"\",\"\",VLOOKUP(AJ46,Teilnehmer!$A$3:$C$102,2))","v":""},null,null,{"$f":"IF(AM46=\"\",\"\",VLOOKUP(AM46,Teilnehmer!$A$3:$C$102,2))","v":""},null,null,null,{"$f":"IF(AQ46=\"\",\"\",VLOOKUP(AQ46,Teilnehmer!$A$3:$C$102,2))","v":""},null,null,{"$f":"IF(AT46=\"\",\"\",VLOOKUP(AT46,Teilnehmer!$A$3:$C$102,2))","v":""},null,null,null,{"$f":"IF(AX46=\"\",\"\",VLOOKUP(AX46,Teilnehmer!$A$3:$C$102,2))","v":""},null,null,{"$f":"IF(BA46=\"\",\"\",VLOOKUP(BA46,Teilnehmer!$A$3:$C$102,2))","v":""},null,null,null,{"$f":"IF(BE46=\"\",\"\",VLOOKUP(BE46,Teilnehmer!$A$3:$C$102,2))","v":""},null,null,{"$f":"IF(BH46=\"\",\"\",VLOOKUP(BH46,Teilnehmer!$A$3:$C$102,2))","v":""},null,null,null,{"$f":"IF(BL46=\"\",\"\",VLOOKUP(BL46,Teilnehmer!$A$3:$C$102,2))","v":""},null,null,{"$f":"IF(BO46=\"\",\"\",VLOOKUP(BO46,Teilnehmer!$A$3:$C$102,2))","v":""},null,null,null,{"$f":"IF(BS46=\"\",\"\",VLOOKUP(BS46,Teilnehmer!$A$3:$C$102,2))","v":""},null,null,{"$f":"IF(BV46=\"\",\"\",VLOOKUP(BV46,Teilnehmer!$A$3:$C$102,2))","v":""},null,null,null,{"$f":"IF(BZ46=\"\",\"\",VLOOKUP(BZ46,Teilnehmer!$A$3:$C$102,2))","v":""},null,null,{"$f":"IF(CC46=\"\",\"\",VLOOKUP(CC46,Teilnehmer!$A$3:$C$102,2))","v":""},null,null,null,{"$f":"IF(CG46=\"\",\"\",VLOOKUP(CG46,Teilnehmer!$A$3:$C$102,2))","v":""},null,null,{"$f":"IF(CJ46=\"\",\"\",VLOOKUP(CJ46,Teilnehmer!$A$3:$C$102,2))","v":""},null,null,null,{"$f":"IF(CN46=\"\",\"\",VLOOKUP(CN46,Teilnehmer!$A$3:$C$102,2))","v":""},null,null,{"$f":"IF(CQ46=\"\",\"\",VLOOKUP(CQ46,Teilnehmer!$A$3:$C$102,2))","v":""},null,null,null,{"$f":"IF(CU46=\"\",\"\",VLOOKUP(CU46,Teilnehmer!$A$3:$C$102,2))","v":""},null,null,{"$f":"IF(CX46=\"\",\"\",VLOOKUP(CX46,Teilnehmer!$A$3:$C$102,2))","v":""},null,null,null,{"$f":"IF(DB46=\"\",\"\",VLOOKUP(DB46,Teilnehmer!$A$3:$C$102,2))","v":""},null,null,{"$f":"IF(DE46=\"\",\"\",VLOOKUP(DE46,Teilnehmer!$A$3:$C$102,2))","v":""},null,null,null,{"$f":"IF(DI46=\"\",\"\",VLOOKUP(DI46,Teilnehmer!$A$3:$C$102,2))","v":""},null,null,{"$f":"IF(DL46=\"\",\"\",VLOOKUP(DL46,Teilnehmer!$A$3:$C$102,2))","v":""},null,null,null,{"$f":"IF(DP46=\"\",\"\",VLOOKUP(DP46,Teilnehmer!$A$3:$C$102,2))","v":""},null,null,{"$f":"IF(DS46=\"\",\"\",VLOOKUP(DS46,Teilnehmer!$A$3:$C$102,2))","v":""},null,null,null,{"$f":"IF(DW46=\"\",\"\",VLOOKUP(DW46,Teilnehmer!$A$3:$C$102,2))","v":""},null,null,{"$f":"IF(DZ46=\"\",\"\",VLOOKUP(DZ46,Teilnehmer!$A$3:$C$102,2))","v":""},null,null,null,{"$f":"IF(ED46=\"\",\"\",VLOOKUP(ED46,Teilnehmer!$A$3:$C$102,2))","v":""},null,null,{"$f":"IF(EG46=\"\",\"\",VLOOKUP(EG46,Teilnehmer!$A$3:$C$102,2))","v":""},null,null,null,{"$f":"IF(EK46=\"\",\"\",VLOOKUP(EK46,Teilnehmer!$A$3:$C$102,2))","v":""},null,null,{"$f":"IF(EN46=\"\",\"\",VLOOKUP(EN46,Teilnehmer!$A$3:$C$102,2))","v":""},null,null,null,{"$f":"IF(ER46=\"\",\"\",VLOOKUP(ER46,Teilnehmer!$A$3:$C$102,2))","v":""},null,null,{"$f":"IF(EU46=\"\",\"\",VLOOKUP(EU46,Teilnehmer!$A$3:$C$102,2))","v":""},null,null,null,{"$f":"IF(EY46=\"\",\"\",VLOOKUP(EY46,Teilnehmer!$A$3:$C$102,2))","v":""},null,null,{"$f":"IF(FB46=\"\",\"\",VLOOKUP(FB46,Teilnehmer!$A$3:$C$102,2))","v":""},null,null,null,{"$f":"IF(FF46=\"\",\"\",VLOOKUP(FF46,Teilnehmer!$A$3:$C$102,2))","v":""},null,null,{"$f":"IF(FI46=\"\",\"\",VLOOKUP(FI46,Teilnehmer!$A$3:$C$102,2))","v":""},null,null,null,{"$f":"IF(FM46=\"\",\"\",VLOOKUP(FM46,Teilnehmer!$A$3:$C$102,2))","v":""},null,null,{"$f":"IF(FP46=\"\",\"\",VLOOKUP(FP46,Teilnehmer!$A$3:$C$102,2))","v":""},null,null,null,{"$f":"IF(FT46=\"\",\"\",VLOOKUP(FT46,Teilnehmer!$A$3:$C$102,2))","v":""},null,null,{"$f":"IF(FW46=\"\",\"\",VLOOKUP(FW46,Teilnehmer!$A$3:$C$102,2))","v":""},null,null,null,{"$f":"IF(GA46=\"\",\"\",VLOOKUP(GA46,Teilnehmer!$A$3:$C$102,2))","v":""},null,null,{"$f":"IF(GD46=\"\",\"\",VLOOKUP(GD46,Teilnehmer!$A$3:$C$102,2))","v":""},null,null,null,{"$f":"IF(GH46=\"\",\"\",VLOOKUP(GH46,Teilnehmer!$A$3:$C$102,2))","v":""},null,null,{"$f":"IF(GK46=\"\",\"\",VLOOKUP(GK46,Teilnehmer!$A$3:$C$102,2))","v":""},null,null,null,{"$f":"IF(GO46=\"\",\"\",VLOOKUP(GO46,Teilnehmer!$A$3:$C$102,2))","v":""},null,null,{"$f":"IF(GR46=\"\",\"\",VLOOKUP(GR46,Teilnehmer!$A$3:$C$102,2))","v":""},null,null,null,{"$f":"IF(GV46=\"\",\"\",VLOOKUP(GV46,Teilnehmer!$A$3:$C$102,2))","v":""},null,null,{"$f":"IF(GY46=\"\",\"\",VLOOKUP(GY46,Teilnehmer!$A$3:$C$102,2))","v":""},null,null,null,{"$f":"IF(HC46=\"\",\"\",VLOOKUP(HC46,Teilnehmer!$A$3:$C$102,2))","v":""},null,null,{"$f":"IF(HF46=\"\",\"\",VLOOKUP(HF46,Teilnehmer!$A$3:$C$102,2))","v":""},null,null,null,{"$f":"IF(HJ46=\"\",\"\",VLOOKUP(HJ46,Teilnehmer!$A$3:$C$102,2))","v":""},null,null,{"$f":"IF(HM46=\"\",\"\",VLOOKUP(HM46,Teilnehmer!$A$3:$C$102,2))","v":""},null,null,null,{"$f":"IF(HQ46=\"\",\"\",VLOOKUP(HQ46,Teilnehmer!$A$3:$C$102,2))","v":""},null,null,{"$f":"IF(HT46=\"\",\"\",VLOOKUP(HT46,Teilnehmer!$A$3:$C$102,2))","v":""},null,null,null,{"$f":"IF(HX46=\"\",\"\",VLOOKUP(HX46,Teilnehmer!$A$3:$C$102,2))","v":""},null,null,{"$f":"IF(IA46=\"\",\"\",VLOOKUP(IA46,Teilnehmer!$A$3:$C$102,2))","v":""},null,null,null,{"$f":"IF(IE46=\"\",\"\",VLOOKUP(IE46,Teilnehmer!$A$3:$C$102,2))","v":""},null,null,{"$f":"IF(IH46=\"\",\"\",VLOOKUP(IH46,Teilnehmer!$A$3:$C$102,2))","v":""},null,null,null,{"$f":"IF(IL46=\"\",\"\",VLOOKUP(IL46,Teilnehmer!$A$3:$C$102,2))","v":""},null,null,{"$f":"IF(IO46=\"\",\"\",VLOOKUP(IO46,Teilnehmer!$A$3:$C$102,2))","v":""},null,null,null,{"$f":"IF(IS46=\"\",\"\",VLOOKUP(IS46,Teilnehmer!$A$3:$C$102,2))","v":""},null,null,{"$f":"IF(IV46=\"\",\"\",VLOOKUP(IV46,Teilnehmer!$A$3:$C$102,2))","v":""},null,null,null,{"$f":"IF(IZ46=\"\",\"\",VLOOKUP(IZ46,Teilnehmer!$A$3:$C$102,2))","v":""},null,null,{"$f":"IF(JC46=\"\",\"\",VLOOKUP(JC46,Teilnehmer!$A$3:$C$102,2))","v":""},null,null,null,{"$f":"IF(JG46=\"\",\"\",VLOOKUP(JG46,Teilnehmer!$A$3:$C$102,2))","v":""},null,null,{"$f":"IF(JJ46=\"\",\"\",VLOOKUP(JJ46,Teilnehmer!$A$3:$C$102,2))","v":""},null,null,null,{"$f":"IF(JN46=\"\",\"\",VLOOKUP(JN46,Teilnehmer!$A$3:$C$102,2))","v":""},null,null,{"$f":"IF(JQ46=\"\",\"\",VLOOKUP(JQ46,Teilnehmer!$A$3:$C$102,2))","v":""},null,null,null,{"$f":"IF(JU46=\"\",\"\",VLOOKUP(JU46,Teilnehmer!$A$3:$C$102,2))","v":""},null,null,{"$f":"IF(JX46=\"\",\"\",VLOOKUP(JX46,Teilnehmer!$A$3:$C$102,2))","v":""},null,null,null,{"$f":"IF(KB46=\"\",\"\",VLOOKUP(KB46,Teilnehmer!$A$3:$C$102,2))","v":""},null,null,{"$f":"IF(KE46=\"\",\"\",VLOOKUP(KE46,Teilnehmer!$A$3:$C$102,2))","v":""},null,null,null,{"$f":"IF(KI46=\"\",\"\",VLOOKUP(KI46,Teilnehmer!$A$3:$C$102,2))","v":""},null,null,{"$f":"IF(KL46=\"\",\"\",VLOOKUP(KL46,Teilnehmer!$A$3:$C$102,2))","v":""},null,null,null,{"$f":"IF(KP46=\"\",\"\",VLOOKUP(KP46,Teilnehmer!$A$3:$C$102,2))","v":""},null,null,{"$f":"IF(KS46=\"\",\"\",VLOOKUP(KS46,Teilnehmer!$A$3:$C$102,2))","v":""}]
[null,{"$f":"IF(A47=\"\",\"\",VLOOKUP(A47,Teilnehmer!$A$3:$C$102,2))","v":""},null,null,{"$f":"IF(D47=\"\",\"\",VLOOKUP(D47,Teilnehmer!$A$3:$C$102,2))","v":""},null,null,null,{"$f":"IF(H47=\"\",\"\",VLOOKUP(H47,Teilnehmer!$A$3:$C$102,2))","v":""},null,null,{"$f":"IF(K47=\"\",\"\",VLOOKUP(K47,Teilnehmer!$A$3:$C$102,2))","v":""},null,null,null,{"$f":"IF(O47=\"\",\"\",VLOOKUP(O47,Teilnehmer!$A$3:$C$102,2))","v":""},null,null,{"$f":"IF(R47=\"\",\"\",VLOOKUP(R47,Teilnehmer!$A$3:$C$102,2))","v":""},null,null,null,{"$f":"IF(V47=\"\",\"\",VLOOKUP(V47,Teilnehmer!$A$3:$C$102,2))","v":""},null,null,{"$f":"IF(Y47=\"\",\"\",VLOOKUP(Y47,Teilnehmer!$A$3:$C$102,2))","v":""},null,null,null,{"$f":"IF(AC47=\"\",\"\",VLOOKUP(AC47,Teilnehmer!$A$3:$C$102,2))","v":""},null,null,{"$f":"IF(AF47=\"\",\"\",VLOOKUP(AF47,Teilnehmer!$A$3:$C$102,2))","v":""},null,null,null,{"$f":"IF(AJ47=\"\",\"\",VLOOKUP(AJ47,Teilnehmer!$A$3:$C$102,2))","v":""},null,null,{"$f":"IF(AM47=\"\",\"\",VLOOKUP(AM47,Teilnehmer!$A$3:$C$102,2))","v":""},null,null,null,{"$f":"IF(AQ47=\"\",\"\",VLOOKUP(AQ47,Teilnehmer!$A$3:$C$102,2))","v":""},null,null,{"$f":"IF(AT47=\"\",\"\",VLOOKUP(AT47,Teilnehmer!$A$3:$C$102,2))","v":""},null,null,null,{"$f":"IF(AX47=\"\",\"\",VLOOKUP(AX47,Teilnehmer!$A$3:$C$102,2))","v":""},null,null,{"$f":"IF(BA47=\"\",\"\",VLOOKUP(BA47,Teilnehmer!$A$3:$C$102,2))","v":""},null,null,null,{"$f":"IF(BE47=\"\",\"\",VLOOKUP(BE47,Teilnehmer!$A$3:$C$102,2))","v":""},null,null,{"$f":"IF(BH47=\"\",\"\",VLOOKUP(BH47,Teilnehmer!$A$3:$C$102,2))","v":""},null,null,null,{"$f":"IF(BL47=\"\",\"\",VLOOKUP(BL47,Teilnehmer!$A$3:$C$102,2))","v":""},null,null,{"$f":"IF(BO47=\"\",\"\",VLOOKUP(BO47,Teilnehmer!$A$3:$C$102,2))","v":""},null,null,null,{"$f":"IF(BS47=\"\",\"\",VLOOKUP(BS47,Teilnehmer!$A$3:$C$102,2))","v":""},null,null,{"$f":"IF(BV47=\"\",\"\",VLOOKUP(BV47,Teilnehmer!$A$3:$C$102,2))","v":""},null,null,null,{"$f":"IF(BZ47=\"\",\"\",VLOOKUP(BZ47,Teilnehmer!$A$3:$C$102,2))","v":""},null,null,{"$f":"IF(CC47=\"\",\"\",VLOOKUP(CC47,Teilnehmer!$A$3:$C$102,2))","v":""},null,null,null,{"$f":"IF(CG47=\"\",\"\",VLOOKUP(CG47,Teilnehmer!$A$3:$C$102,2))","v":""},null,null,{"$f":"IF(CJ47=\"\",\"\",VLOOKUP(CJ47,Teilnehmer!$A$3:$C$102,2))","v":""},null,null,null,{"$f":"IF(CN47=\"\",\"\",VLOOKUP(CN47,Teilnehmer!$A$3:$C$102,2))","v":""},null,null,{"$f":"IF(CQ47=\"\",\"\",VLOOKUP(CQ47,Teilnehmer!$A$3:$C$102,2))","v":""},null,null,null,{"$f":"IF(CU47=\"\",\"\",VLOOKUP(CU47,Teilnehmer!$A$3:$C$102,2))","v":""},null,null,{"$f":"IF(CX47=\"\",\"\",VLOOKUP(CX47,Teilnehmer!$A$3:$C$102,2))","v":""},null,null,null,{"$f":"IF(DB47=\"\",\"\",VLOOKUP(DB47,Teilnehmer!$A$3:$C$102,2))","v":""},null,null,{"$f":"IF(DE47=\"\",\"\",VLOOKUP(DE47,Teilnehmer!$A$3:$C$102,2))","v":""},null,null,null,{"$f":"IF(DI47=\"\",\"\",VLOOKUP(DI47,Teilnehmer!$A$3:$C$102,2))","v":""},null,null,{"$f":"IF(DL47=\"\",\"\",VLOOKUP(DL47,Teilnehmer!$A$3:$C$102,2))","v":""},null,null,null,{"$f":"IF(DP47=\"\",\"\",VLOOKUP(DP47,Teilnehmer!$A$3:$C$102,2))","v":""},null,null,{"$f":"IF(DS47=\"\",\"\",VLOOKUP(DS47,Teilnehmer!$A$3:$C$102,2))","v":""},null,null,null,{"$f":"IF(DW47=\"\",\"\",VLOOKUP(DW47,Teilnehmer!$A$3:$C$102,2))","v":""},null,null,{"$f":"IF(DZ47=\"\",\"\",VLOOKUP(DZ47,Teilnehmer!$A$3:$C$102,2))","v":""},null,null,null,{"$f":"IF(ED47=\"\",\"\",VLOOKUP(ED47,Teilnehmer!$A$3:$C$102,2))","v":""},null,null,{"$f":"IF(EG47=\"\",\"\",VLOOKUP(EG47,Teilnehmer!$A$3:$C$102,2))","v":""},null,null,null,{"$f":"IF(EK47=\"\",\"\",VLOOKUP(EK47,Teilnehmer!$A$3:$C$102,2))","v":""},null,null,{"$f":"IF(EN47=\"\",\"\",VLOOKUP(EN47,Teilnehmer!$A$3:$C$102,2))","v":""},null,null,null,{"$f":"IF(ER47=\"\",\"\",VLOOKUP(ER47,Teilnehmer!$A$3:$C$102,2))","v":""},null,null,{"$f":"IF(EU47=\"\",\"\",VLOOKUP(EU47,Teilnehmer!$A$3:$C$102,2))","v":""},null,null,null,{"$f":"IF(EY47=\"\",\"\",VLOOKUP(EY47,Teilnehmer!$A$3:$C$102,2))","v":""},null,null,{"$f":"IF(FB47=\"\",\"\",VLOOKUP(FB47,Teilnehmer!$A$3:$C$102,2))","v":""},null,null,null,{"$f":"IF(FF47=\"\",\"\",VLOOKUP(FF47,Teilnehmer!$A$3:$C$102,2))","v":""},null,null,{"$f":"IF(FI47=\"\",\"\",VLOOKUP(FI47,Teilnehmer!$A$3:$C$102,2))","v":""},null,null,null,{"$f":"IF(FM47=\"\",\"\",VLOOKUP(FM47,Teilnehmer!$A$3:$C$102,2))","v":""},null,null,{"$f":"IF(FP47=\"\",\"\",VLOOKUP(FP47,Teilnehmer!$A$3:$C$102,2))","v":""},null,null,null,{"$f":"IF(FT47=\"\",\"\",VLOOKUP(FT47,Teilnehmer!$A$3:$C$102,2))","v":""},null,null,{"$f":"IF(FW47=\"\",\"\",VLOOKUP(FW47,Teilnehmer!$A$3:$C$102,2))","v":""},null,null,null,{"$f":"IF(GA47=\"\",\"\",VLOOKUP(GA47,Teilnehmer!$A$3:$C$102,2))","v":""},null,null,{"$f":"IF(GD47=\"\",\"\",VLOOKUP(GD47,Teilnehmer!$A$3:$C$102,2))","v":""},null,null,null,{"$f":"IF(GH47=\"\",\"\",VLOOKUP(GH47,Teilnehmer!$A$3:$C$102,2))","v":""},null,null,{"$f":"IF(GK47=\"\",\"\",VLOOKUP(GK47,Teilnehmer!$A$3:$C$102,2))","v":""},null,null,null,{"$f":"IF(GO47=\"\",\"\",VLOOKUP(GO47,Teilnehmer!$A$3:$C$102,2))","v":""},null,null,{"$f":"IF(GR47=\"\",\"\",VLOOKUP(GR47,Teilnehmer!$A$3:$C$102,2))","v":""},null,null,null,{"$f":"IF(GV47=\"\",\"\",VLOOKUP(GV47,Teilnehmer!$A$3:$C$102,2))","v":""},null,null,{"$f":"IF(GY47=\"\",\"\",VLOOKUP(GY47,Teilnehmer!$A$3:$C$102,2))","v":""},null,null,null,{"$f":"IF(HC47=\"\",\"\",VLOOKUP(HC47,Teilnehmer!$A$3:$C$102,2))","v":""},null,null,{"$f":"IF(HF47=\"\",\"\",VLOOKUP(HF47,Teilnehmer!$A$3:$C$102,2))","v":""},null,null,null,{"$f":"IF(HJ47=\"\",\"\",VLOOKUP(HJ47,Teilnehmer!$A$3:$C$102,2))","v":""},null,null,{"$f":"IF(HM47=\"\",\"\",VLOOKUP(HM47,Teilnehmer!$A$3:$C$102,2))","v":""},null,null,null,{"$f":"IF(HQ47=\"\",\"\",VLOOKUP(HQ47,Teilnehmer!$A$3:$C$102,2))","v":""},null,null,{"$f":"IF(HT47=\"\",\"\",VLOOKUP(HT47,Teilnehmer!$A$3:$C$102,2))","v":""},null,null,null,{"$f":"IF(HX47=\"\",\"\",VLOOKUP(HX47,Teilnehmer!$A$3:$C$102,2))","v":""},null,null,{"$f":"IF(IA47=\"\",\"\",VLOOKUP(IA47,Teilnehmer!$A$3:$C$102,2))","v":""},null,null,null,{"$f":"IF(IE47=\"\",\"\",VLOOKUP(IE47,Teilnehmer!$A$3:$C$102,2))","v":""},null,null,{"$f":"IF(IH47=\"\",\"\",VLOOKUP(IH47,Teilnehmer!$A$3:$C$102,2))","v":""},null,null,null,{"$f":"IF(IL47=\"\",\"\",VLOOKUP(IL47,Teilnehmer!$A$3:$C$102,2))","v":""},null,null,{"$f":"IF(IO47=\"\",\"\",VLOOKUP(IO47,Teilnehmer!$A$3:$C$102,2))","v":""},null,null,null,{"$f":"IF(IS47=\"\",\"\",VLOOKUP(IS47,Teilnehmer!$A$3:$C$102,2))","v":""},null,null,{"$f":"IF(IV47=\"\",\"\",VLOOKUP(IV47,Teilnehmer!$A$3:$C$102,2))","v":""},null,null,null,{"$f":"IF(IZ47=\"\",\"\",VLOOKUP(IZ47,Teilnehmer!$A$3:$C$102,2))","v":""},null,null,{"$f":"IF(JC47=\"\",\"\",VLOOKUP(JC47,Teilnehmer!$A$3:$C$102,2))","v":""},null,null,null,{"$f":"IF(JG47=\"\",\"\",VLOOKUP(JG47,Teilnehmer!$A$3:$C$102,2))","v":""},null,null,{"$f":"IF(JJ47=\"\",\"\",VLOOKUP(JJ47,Teilnehmer!$A$3:$C$102,2))","v":""},null,null,null,{"$f":"IF(JN47=\"\",\"\",VLOOKUP(JN47,Teilnehmer!$A$3:$C$102,2))","v":""},null,null,{"$f":"IF(JQ47=\"\",\"\",VLOOKUP(JQ47,Teilnehmer!$A$3:$C$102,2))","v":""},null,null,null,{"$f":"IF(JU47=\"\",\"\",VLOOKUP(JU47,Teilnehmer!$A$3:$C$102,2))","v":""},null,null,{"$f":"IF(JX47=\"\",\"\",VLOOKUP(JX47,Teilnehmer!$A$3:$C$102,2))","v":""},null,null,null,{"$f":"IF(KB47=\"\",\"\",VLOOKUP(KB47,Teilnehmer!$A$3:$C$102,2))","v":""},null,null,{"$f":"IF(KE47=\"\",\"\",VLOOKUP(KE47,Teilnehmer!$A$3:$C$102,2))","v":""},null,null,null,{"$f":"IF(KI47=\"\",\"\",VLOOKUP(KI47,Teilnehmer!$A$3:$C$102,2))","v":""},null,null,{"$f":"IF(KL47=\"\",\"\",VLOOKUP(KL47,Teilnehmer!$A$3:$C$102,2))","v":""},null,null,null,{"$f":"IF(KP47=\"\",\"\",VLOOKUP(KP47,Teilnehmer!$A$3:$C$102,2))","v":""},null,null,{"$f":"IF(KS47=\"\",\"\",VLOOKUP(KS47,Teilnehmer!$A$3:$C$102,2))","v":""}]
[null,{"$f":"IF(A48=\"\",\"\",VLOOKUP(A48,Teilnehmer!$A$3:$C$102,2))","v":""},null,null,{"$f":"IF(D48=\"\",\"\",VLOOKUP(D48,Teilnehmer!$A$3:$C$102,2))","v":""},null,null,null,{"$f":"IF(H48=\"\",\"\",VLOOKUP(H48,Teilnehmer!$A$3:$C$102,2))","v":""},null,null,{"$f":"IF(K48=\"\",\"\",VLOOKUP(K48,Teilnehmer!$A$3:$C$102,2))","v":""},null,null,null,{"$f":"IF(O48=\"\",\"\",VLOOKUP(O48,Teilnehmer!$A$3:$C$102,2))","v":""},null,null,{"$f":"IF(R48=\"\",\"\",VLOOKUP(R48,Teilnehmer!$A$3:$C$102,2))","v":""},null,null,null,{"$f":"IF(V48=\"\",\"\",VLOOKUP(V48,Teilnehmer!$A$3:$C$102,2))","v":""},null,null,{"$f":"IF(Y48=\"\",\"\",VLOOKUP(Y48,Teilnehmer!$A$3:$C$102,2))","v":""},null,null,null,{"$f":"IF(AC48=\"\",\"\",VLOOKUP(AC48,Teilnehmer!$A$3:$C$102,2))","v":""},null,null,{"$f":"IF(AF48=\"\",\"\",VLOOKUP(AF48,Teilnehmer!$A$3:$C$102,2))","v":""},null,null,null,{"$f":"IF(AJ48=\"\",\"\",VLOOKUP(AJ48,Teilnehmer!$A$3:$C$102,2))","v":""},null,null,{"$f":"IF(AM48=\"\",\"\",VLOOKUP(AM48,Teilnehmer!$A$3:$C$102,2))","v":""},null,null,null,{"$f":"IF(AQ48=\"\",\"\",VLOOKUP(AQ48,Teilnehmer!$A$3:$C$102,2))","v":""},null,null,{"$f":"IF(AT48=\"\",\"\",VLOOKUP(AT48,Teilnehmer!$A$3:$C$102,2))","v":""},null,null,null,{"$f":"IF(AX48=\"\",\"\",VLOOKUP(AX48,Teilnehmer!$A$3:$C$102,2))","v":""},null,null,{"$f":"IF(BA48=\"\",\"\",VLOOKUP(BA48,Teilnehmer!$A$3:$C$102,2))","v":""},null,null,null,{"$f":"IF(BE48=\"\",\"\",VLOOKUP(BE48,Teilnehmer!$A$3:$C$102,2))","v":""},null,null,{"$f":"IF(BH48=\"\",\"\",VLOOKUP(BH48,Teilnehmer!$A$3:$C$102,2))","v":""},null,null,null,{"$f":"IF(BL48=\"\",\"\",VLOOKUP(BL48,Teilnehmer!$A$3:$C$102,2))","v":""},null,null,{"$f":"IF(BO48=\"\",\"\",VLOOKUP(BO48,Teilnehmer!$A$3:$C$102,2))","v":""},null,null,null,{"$f":"IF(BS48=\"\",\"\",VLOOKUP(BS48,Teilnehmer!$A$3:$C$102,2))","v":""},null,null,{"$f":"IF(BV48=\"\",\"\",VLOOKUP(BV48,Teilnehmer!$A$3:$C$102,2))","v":""},null,null,null,{"$f":"IF(BZ48=\"\",\"\",VLOOKUP(BZ48,Teilnehmer!$A$3:$C$102,2))","v":""},null,null,{"$f":"IF(CC48=\"\",\"\",VLOOKUP(CC48,Teilnehmer!$A$3:$C$102,2))","v":""},null,null,null,{"$f":"IF(CG48=\"\",\"\",VLOOKUP(CG48,Teilnehmer!$A$3:$C$102,2))","v":""},null,null,{"$f":"IF(CJ48=\"\",\"\",VLOOKUP(CJ48,Teilnehmer!$A$3:$C$102,2))","v":""},null,null,null,{"$f":"IF(CN48=\"\",\"\",VLOOKUP(CN48,Teilnehmer!$A$3:$C$102,2))","v":""},null,null,{"$f":"IF(CQ48=\"\",\"\",VLOOKUP(CQ48,Teilnehmer!$A$3:$C$102,2))","v":""},null,null,null,{"$f":"IF(CU48=\"\",\"\",VLOOKUP(CU48,Teilnehmer!$A$3:$C$102,2))","v":""},null,null,{"$f":"IF(CX48=\"\",\"\",VLOOKUP(CX48,Teilnehmer!$A$3:$C$102,2))","v":""},null,null,null,{"$f":"IF(DB48=\"\",\"\",VLOOKUP(DB48,Teilnehmer!$A$3:$C$102,2))","v":""},null,null,{"$f":"IF(DE48=\"\",\"\",VLOOKUP(DE48,Teilnehmer!$A$3:$C$102,2))","v":""},null,null,null,{"$f":"IF(DI48=\"\",\"\",VLOOKUP(DI48,Teilnehmer!$A$3:$C$102,2))","v":""},null,null,{"$f":"IF(DL48=\"\",\"\",VLOOKUP(DL48,Teilnehmer!$A$3:$C$102,2))","v":""},null,null,null,{"$f":"IF(DP48=\"\",\"\",VLOOKUP(DP48,Teilnehmer!$A$3:$C$102,2))","v":""},null,null,{"$f":"IF(DS48=\"\",\"\",VLOOKUP(DS48,Teilnehmer!$A$3:$C$102,2))","v":""},null,null,null,{"$f":"IF(DW48=\"\",\"\",VLOOKUP(DW48,Teilnehmer!$A$3:$C$102,2))","v":""},null,null,{"$f":"IF(DZ48=\"\",\"\",VLOOKUP(DZ48,Teilnehmer!$A$3:$C$102,2))","v":""},null,null,null,{"$f":"IF(ED48=\"\",\"\",VLOOKUP(ED48,Teilnehmer!$A$3:$C$102,2))","v":""},null,null,{"$f":"IF(EG48=\"\",\"\",VLOOKUP(EG48,Teilnehmer!$A$3:$C$102,2))","v":""},null,null,null,{"$f":"IF(EK48=\"\",\"\",VLOOKUP(EK48,Teilnehmer!$A$3:$C$102,2))","v":""},null,null,{"$f":"IF(EN48=\"\",\"\",VLOOKUP(EN48,Teilnehmer!$A$3:$C$102,2))","v":""},null,null,null,{"$f":"IF(ER48=\"\",\"\",VLOOKUP(ER48,Teilnehmer!$A$3:$C$102,2))","v":""},null,null,{"$f":"IF(EU48=\"\",\"\",VLOOKUP(EU48,Teilnehmer!$A$3:$C$102,2))","v":""},null,null,null,{"$f":"IF(EY48=\"\",\"\",VLOOKUP(EY48,Teilnehmer!$A$3:$C$102,2))","v":""},null,null,{"$f":"IF(FB48=\"\",\"\",VLOOKUP(FB48,Teilnehmer!$A$3:$C$102,2))","v":""},null,null,null,{"$f":"IF(FF48=\"\",\"\",VLOOKUP(FF48,Teilnehmer!$A$3:$C$102,2))","v":""},null,null,{"$f":"IF(FI48=\"\",\"\",VLOOKUP(FI48,Teilnehmer!$A$3:$C$102,2))","v":""},null,null,null,{"$f":"IF(FM48=\"\",\"\",VLOOKUP(FM48,Teilnehmer!$A$3:$C$102,2))","v":""},null,null,{"$f":"IF(FP48=\"\",\"\",VLOOKUP(FP48,Teilnehmer!$A$3:$C$102,2))","v":""},null,null,null,{"$f":"IF(FT48=\"\",\"\",VLOOKUP(FT48,Teilnehmer!$A$3:$C$102,2))","v":""},null,null,{"$f":"IF(FW48=\"\",\"\",VLOOKUP(FW48,Teilnehmer!$A$3:$C$102,2))","v":""},null,null,null,{"$f":"IF(GA48=\"\",\"\",VLOOKUP(GA48,Teilnehmer!$A$3:$C$102,2))","v":""},null,null,{"$f":"IF(GD48=\"\",\"\",VLOOKUP(GD48,Teilnehmer!$A$3:$C$102,2))","v":""},null,null,null,{"$f":"IF(GH48=\"\",\"\",VLOOKUP(GH48,Teilnehmer!$A$3:$C$102,2))","v":""},null,null,{"$f":"IF(GK48=\"\",\"\",VLOOKUP(GK48,Teilnehmer!$A$3:$C$102,2))","v":""},null,null,null,{"$f":"IF(GO48=\"\",\"\",VLOOKUP(GO48,Teilnehmer!$A$3:$C$102,2))","v":""},null,null,{"$f":"IF(GR48=\"\",\"\",VLOOKUP(GR48,Teilnehmer!$A$3:$C$102,2))","v":""},null,null,null,{"$f":"IF(GV48=\"\",\"\",VLOOKUP(GV48,Teilnehmer!$A$3:$C$102,2))","v":""},null,null,{"$f":"IF(GY48=\"\",\"\",VLOOKUP(GY48,Teilnehmer!$A$3:$C$102,2))","v":""},null,null,null,{"$f":"IF(HC48=\"\",\"\",VLOOKUP(HC48,Teilnehmer!$A$3:$C$102,2))","v":""},null,null,{"$f":"IF(HF48=\"\",\"\",VLOOKUP(HF48,Teilnehmer!$A$3:$C$102,2))","v":""},null,null,null,{"$f":"IF(HJ48=\"\",\"\",VLOOKUP(HJ48,Teilnehmer!$A$3:$C$102,2))","v":""},null,null,{"$f":"IF(HM48=\"\",\"\",VLOOKUP(HM48,Teilnehmer!$A$3:$C$102,2))","v":""},null,null,null,{"$f":"IF(HQ48=\"\",\"\",VLOOKUP(HQ48,Teilnehmer!$A$3:$C$102,2))","v":""},null,null,{"$f":"IF(HT48=\"\",\"\",VLOOKUP(HT48,Teilnehmer!$A$3:$C$102,2))","v":""},null,null,null,{"$f":"IF(HX48=\"\",\"\",VLOOKUP(HX48,Teilnehmer!$A$3:$C$102,2))","v":""},null,null,{"$f":"IF(IA48=\"\",\"\",VLOOKUP(IA48,Teilnehmer!$A$3:$C$102,2))","v":""},null,null,null,{"$f":"IF(IE48=\"\",\"\",VLOOKUP(IE48,Teilnehmer!$A$3:$C$102,2))","v":""},null,null,{"$f":"IF(IH48=\"\",\"\",VLOOKUP(IH48,Teilnehmer!$A$3:$C$102,2))","v":""},null,null,null,{"$f":"IF(IL48=\"\",\"\",VLOOKUP(IL48,Teilnehmer!$A$3:$C$102,2))","v":""},null,null,{"$f":"IF(IO48=\"\",\"\",VLOOKUP(IO48,Teilnehmer!$A$3:$C$102,2))","v":""},null,null,null,{"$f":"IF(IS48=\"\",\"\",VLOOKUP(IS48,Teilnehmer!$A$3:$C$102,2))","v":""},null,null,{"$f":"IF(IV48=\"\",\"\",VLOOKUP(IV48,Teilnehmer!$A$3:$C$102,2))","v":""},null,null,null,{"$f":"IF(IZ48=\"\",\"\",VLOOKUP(IZ48,Teilnehmer!$A$3:$C$102,2))","v":""},null,null,{"$f":"IF(JC48=\"\",\"\",VLOOKUP(JC48,Teilnehmer!$A$3:$C$102,2))","v":""},null,null,null,{"$f":"IF(JG48=\"\",\"\",VLOOKUP(JG48,Teilnehmer!$A$3:$C$102,2))","v":""},null,null,{"$f":"IF(JJ48=\"\",\"\",VLOOKUP(JJ48,Teilnehmer!$A$3:$C$102,2))","v":""},null,null,null,{"$f":"IF(JN48=\"\",\"\",VLOOKUP(JN48,Teilnehmer!$A$3:$C$102,2))","v":""},null,null,{"$f":"IF(JQ48=\"\",\"\",VLOOKUP(JQ48,Teilnehmer!$A$3:$C$102,2))","v":""},null,null,null,{"$f":"IF(JU48=\"\",\"\",VLOOKUP(JU48,Teilnehmer!$A$3:$C$102,2))","v":""},null,null,{"$f":"IF(JX48=\"\",\"\",VLOOKUP(JX48,Teilnehmer!$A$3:$C$102,2))","v":""},null,null,null,{"$f":"IF(KB48=\"\",\"\",VLOOKUP(KB48,Teilnehmer!$A$3:$C$102,2))","v":""},null,null,{"$f":"IF(KE48=\"\",\"\",VLOOKUP(KE48,Teilnehmer!$A$3:$C$102,2))","v":""},null,null,null,{"$f":"IF(KI48=\"\",\"\",VLOOKUP(KI48,Teilnehmer!$A$3:$C$102,2))","v":""},null,null,{"$f":"IF(KL48=\"\",\"\",VLOOKUP(KL48,Teilnehmer!$A$3:$C$102,2))","v":""},null,null,null,{"$f":"IF(KP48=\"\",\"\",VLOOKUP(KP48,Teilnehmer!$A$3:$C$102,2))","v":""},null,null,{"$f":"IF(KS48=\"\",\"\",VLOOKUP(KS48,Teilnehmer!$A$3:$C$102,2))","v":""}]
[null,{"$f":"IF(A49=\"\",\"\",VLOOKUP(A49,Teilnehmer!$A$3:$C$102,2))","v":""},null,null,{"$f":"IF(D49=\"\",\"\",VLOOKUP(D49,Teilnehmer!$A$3:$C$102,2))","v":""},null,null,null,{"$f":"IF(H49=\"\",\"\",VLOOKUP(H49,Teilnehmer!$A$3:$C$102,2))","v":""},null,null,{"$f":"IF(K49=\"\",\"\",VLOOKUP(K49,Teilnehmer!$A$3:$C$102,2))","v":""},null,null,null,{"$f":"IF(O49=\"\",\"\",VLOOKUP(O49,Teilnehmer!$A$3:$C$102,2))","v":""},null,null,{"$f":"IF(R49=\"\",\"\",VLOOKUP(R49,Teilnehmer!$A$3:$C$102,2))","v":""},null,null,null,{"$f":"IF(V49=\"\",\"\",VLOOKUP(V49,Teilnehmer!$A$3:$C$102,2))","v":""},null,null,{"$f":"IF(Y49=\"\",\"\",VLOOKUP(Y49,Teilnehmer!$A$3:$C$102,2))","v":""},null,null,null,{"$f":"IF(AC49=\"\",\"\",VLOOKUP(AC49,Teilnehmer!$A$3:$C$102,2))","v":""},null,null,{"$f":"IF(AF49=\"\",\"\",VLOOKUP(AF49,Teilnehmer!$A$3:$C$102,2))","v":""},null,null,null,{"$f":"IF(AJ49=\"\",\"\",VLOOKUP(AJ49,Teilnehmer!$A$3:$C$102,2))","v":""},null,null,{"$f":"IF(AM49=\"\",\"\",VLOOKUP(AM49,Teilnehmer!$A$3:$C$102,2))","v":""},null,null,null,{"$f":"IF(AQ49=\"\",\"\",VLOOKUP(AQ49,Teilnehmer!$A$3:$C$102,2))","v":""},null,null,{"$f":"IF(AT49=\"\",\"\",VLOOKUP(AT49,Teilnehmer!$A$3:$C$102,2))","v":""},null,null,null,{"$f":"IF(AX49=\"\",\"\",VLOOKUP(AX49,Teilnehmer!$A$3:$C$102,2))","v":""},null,null,{"$f":"IF(BA49=\"\",\"\",VLOOKUP(BA49,Teilnehmer!$A$3:$C$102,2))","v":""},null,null,null,{"$f":"IF(BE49=\"\",\"\",VLOOKUP(BE49,Teilnehmer!$A$3:$C$102,2))","v":""},null,null,{"$f":"IF(BH49=\"\",\"\",VLOOKUP(BH49,Teilnehmer!$A$3:$C$102,2))","v":""},null,null,null,{"$f":"IF(BL49=\"\",\"\",VLOOKUP(BL49,Teilnehmer!$A$3:$C$102,2))","v":""},null,null,{"$f":"IF(BO49=\"\",\"\",VLOOKUP(BO49,Teilnehmer!$A$3:$C$102,2))","v":""},null,null,null,{"$f":"IF(BS49=\"\",\"\",VLOOKUP(BS49,Teilnehmer!$A$3:$C$102,2))","v":""},null,null,{"$f":"IF(BV49=\"\",\"\",VLOOKUP(BV49,Teilnehmer!$A$3:$C$102,2))","v":""},null,null,null,{"$f":"IF(BZ49=\"\",\"\",VLOOKUP(BZ49,Teilnehmer!$A$3:$C$102,2))","v":""},null,null,{"$f":"IF(CC49=\"\",\"\",VLOOKUP(CC49,Teilnehmer!$A$3:$C$102,2))","v":""},null,null,null,{"$f":"IF(CG49=\"\",\"\",VLOOKUP(CG49,Teilnehmer!$A$3:$C$102,2))","v":""},null,null,{"$f":"IF(CJ49=\"\",\"\",VLOOKUP(CJ49,Teilnehmer!$A$3:$C$102,2))","v":""},null,null,null,{"$f":"IF(CN49=\"\",\"\",VLOOKUP(CN49,Teilnehmer!$A$3:$C$102,2))","v":""},null,null,{"$f":"IF(CQ49=\"\",\"\",VLOOKUP(CQ49,Teilnehmer!$A$3:$C$102,2))","v":""},null,null,null,{"$f":"IF(CU49=\"\",\"\",VLOOKUP(CU49,Teilnehmer!$A$3:$C$102,2))","v":""},null,null,{"$f":"IF(CX49=\"\",\"\",VLOOKUP(CX49,Teilnehmer!$A$3:$C$102,2))","v":""},null,null,null,{"$f":"IF(DB49=\"\",\"\",VLOOKUP(DB49,Teilnehmer!$A$3:$C$102,2))","v":""},null,null,{"$f":"IF(DE49=\"\",\"\",VLOOKUP(DE49,Teilnehmer!$A$3:$C$102,2))","v":""},null,null,null,{"$f":"IF(DI49=\"\",\"\",VLOOKUP(DI49,Teilnehmer!$A$3:$C$102,2))","v":""},null,null,{"$f":"IF(DL49=\"\",\"\",VLOOKUP(DL49,Teilnehmer!$A$3:$C$102,2))","v":""},null,null,null,{"$f":"IF(DP49=\"\",\"\",VLOOKUP(DP49,Teilnehmer!$A$3:$C$102,2))","v":""},null,null,{"$f":"IF(DS49=\"\",\"\",VLOOKUP(DS49,Teilnehmer!$A$3:$C$102,2))","v":""},null,null,null,{"$f":"IF(DW49=\"\",\"\",VLOOKUP(DW49,Teilnehmer!$A$3:$C$102,2))","v":""},null,null,{"$f":"IF(DZ49=\"\",\"\",VLOOKUP(DZ49,Teilnehmer!$A$3:$C$102,2))","v":""},null,null,null,{"$f":"IF(ED49=\"\",\"\",VLOOKUP(ED49,Teilnehmer!$A$3:$C$102,2))","v":""},null,null,{"$f":"IF(EG49=\"\",\"\",VLOOKUP(EG49,Teilnehmer!$A$3:$C$102,2))","v":""},null,null,null,{"$f":"IF(EK49=\"\",\"\",VLOOKUP(EK49,Teilnehmer!$A$3:$C$102,2))","v":""},null,null,{"$f":"IF(EN49=\"\",\"\",VLOOKUP(EN49,Teilnehmer!$A$3:$C$102,2))","v":""},null,null,null,{"$f":"IF(ER49=\"\",\"\",VLOOKUP(ER49,Teilnehmer!$A$3:$C$102,2))","v":""},null,null,{"$f":"IF(EU49=\"\",\"\",VLOOKUP(EU49,Teilnehmer!$A$3:$C$102,2))","v":""},null,null,null,{"$f":"IF(EY49=\"\",\"\",VLOOKUP(EY49,Teilnehmer!$A$3:$C$102,2))","v":""},null,null,{"$f":"IF(FB49=\"\",\"\",VLOOKUP(FB49,Teilnehmer!$A$3:$C$102,2))","v":""},null,null,null,{"$f":"IF(FF49=\"\",\"\",VLOOKUP(FF49,Teilnehmer!$A$3:$C$102,2))","v":""},null,null,{"$f":"IF(FI49=\"\",\"\",VLOOKUP(FI49,Teilnehmer!$A$3:$C$102,2))","v":""},null,null,null,{"$f":"IF(FM49=\"\",\"\",VLOOKUP(FM49,Teilnehmer!$A$3:$C$102,2))","v":""},null,null,{"$f":"IF(FP49=\"\",\"\",VLOOKUP(FP49,Teilnehmer!$A$3:$C$102,2))","v":""},null,null,null,{"$f":"IF(FT49=\"\",\"\",VLOOKUP(FT49,Teilnehmer!$A$3:$C$102,2))","v":""},null,null,{"$f":"IF(FW49=\"\",\"\",VLOOKUP(FW49,Teilnehmer!$A$3:$C$102,2))","v":""},null,null,null,{"$f":"IF(GA49=\"\",\"\",VLOOKUP(GA49,Teilnehmer!$A$3:$C$102,2))","v":""},null,null,{"$f":"IF(GD49=\"\",\"\",VLOOKUP(GD49,Teilnehmer!$A$3:$C$102,2))","v":""},null,null,null,{"$f":"IF(GH49=\"\",\"\",VLOOKUP(GH49,Teilnehmer!$A$3:$C$102,2))","v":""},null,null,{"$f":"IF(GK49=\"\",\"\",VLOOKUP(GK49,Teilnehmer!$A$3:$C$102,2))","v":""},null,null,null,{"$f":"IF(GO49=\"\",\"\",VLOOKUP(GO49,Teilnehmer!$A$3:$C$102,2))","v":""},null,null,{"$f":"IF(GR49=\"\",\"\",VLOOKUP(GR49,Teilnehmer!$A$3:$C$102,2))","v":""},null,null,null,{"$f":"IF(GV49=\"\",\"\",VLOOKUP(GV49,Teilnehmer!$A$3:$C$102,2))","v":""},null,null,{"$f":"IF(GY49=\"\",\"\",VLOOKUP(GY49,Teilnehmer!$A$3:$C$102,2))","v":""},null,null,null,{"$f":"IF(HC49=\"\",\"\",VLOOKUP(HC49,Teilnehmer!$A$3:$C$102,2))","v":""},null,null,{"$f":"IF(HF49=\"\",\"\",VLOOKUP(HF49,Teilnehmer!$A$3:$C$102,2))","v":""},null,null,null,{"$f":"IF(HJ49=\"\",\"\",VLOOKUP(HJ49,Teilnehmer!$A$3:$C$102,2))","v":""},null,null,{"$f":"IF(HM49=\"\",\"\",VLOOKUP(HM49,Teilnehmer!$A$3:$C$102,2))","v":""},null,null,null,{"$f":"IF(HQ49=\"\",\"\",VLOOKUP(HQ49,Teilnehmer!$A$3:$C$102,2))","v":""},null,null,{"$f":"IF(HT49=\"\",\"\",VLOOKUP(HT49,Teilnehmer!$A$3:$C$102,2))","v":""},null,null,null,{"$f":"IF(HX49=\"\",\"\",VLOOKUP(HX49,Teilnehmer!$A$3:$C$102,2))","v":""},null,null,{"$f":"IF(IA49=\"\",\"\",VLOOKUP(IA49,Teilnehmer!$A$3:$C$102,2))","v":""},null,null,null,{"$f":"IF(IE49=\"\",\"\",VLOOKUP(IE49,Teilnehmer!$A$3:$C$102,2))","v":""},null,null,{"$f":"IF(IH49=\"\",\"\",VLOOKUP(IH49,Teilnehmer!$A$3:$C$102,2))","v":""},null,null,null,{"$f":"IF(IL49=\"\",\"\",VLOOKUP(IL49,Teilnehmer!$A$3:$C$102,2))","v":""},null,null,{"$f":"IF(IO49=\"\",\"\",VLOOKUP(IO49,Teilnehmer!$A$3:$C$102,2))","v":""},null,null,null,{"$f":"IF(IS49=\"\",\"\",VLOOKUP(IS49,Teilnehmer!$A$3:$C$102,2))","v":""},null,null,{"$f":"IF(IV49=\"\",\"\",VLOOKUP(IV49,Teilnehmer!$A$3:$C$102,2))","v":""},null,null,null,{"$f":"IF(IZ49=\"\",\"\",VLOOKUP(IZ49,Teilnehmer!$A$3:$C$102,2))","v":""},null,null,{"$f":"IF(JC49=\"\",\"\",VLOOKUP(JC49,Teilnehmer!$A$3:$C$102,2))","v":""},null,null,null,{"$f":"IF(JG49=\"\",\"\",VLOOKUP(JG49,Teilnehmer!$A$3:$C$102,2))","v":""},null,null,{"$f":"IF(JJ49=\"\",\"\",VLOOKUP(JJ49,Teilnehmer!$A$3:$C$102,2))","v":""},null,null,null,{"$f":"IF(JN49=\"\",\"\",VLOOKUP(JN49,Teilnehmer!$A$3:$C$102,2))","v":""},null,null,{"$f":"IF(JQ49=\"\",\"\",VLOOKUP(JQ49,Teilnehmer!$A$3:$C$102,2))","v":""},null,null,null,{"$f":"IF(JU49=\"\",\"\",VLOOKUP(JU49,Teilnehmer!$A$3:$C$102,2))","v":""},null,null,{"$f":"IF(JX49=\"\",\"\",VLOOKUP(JX49,Teilnehmer!$A$3:$C$102,2))","v":""},null,null,null,{"$f":"IF(KB49=\"\",\"\",VLOOKUP(KB49,Teilnehmer!$A$3:$C$102,2))","v":""},null,null,{"$f":"IF(KE49=\"\",\"\",VLOOKUP(KE49,Teilnehmer!$A$3:$C$102,2))","v":""},null,null,null,{"$f":"IF(KI49=\"\",\"\",VLOOKUP(KI49,Teilnehmer!$A$3:$C$102,2))","v":""},null,null,{"$f":"IF(KL49=\"\",\"\",VLOOKUP(KL49,Teilnehmer!$A$3:$C$102,2))","v":""},null,null,null,{"$f":"IF(KP49=\"\",\"\",VLOOKUP(KP49,Teilnehmer!$A$3:$C$102,2))","v":""},null,null,{"$f":"IF(KS49=\"\",\"\",VLOOKUP(KS49,Teilnehmer!$A$3:$C$102,2))","v":""}]
[null,{"$f":"IF(A50=\"\",\"\",VLOOKUP(A50,Teilnehmer!$A$3:$C$102,2))","v":""},null,null,{"$f":"IF(D50=\"\",\"\",VLOOKUP(D50,Teilnehmer!$A$3:$C$102,2))","v":""},null,null,null,{"$f":"IF(H50=\"\",\"\",VLOOKUP(H50,Teilnehmer!$A$3:$C$102,2))","v":""},null,null,{"$f":"IF(K50=\"\",\"\",VLOOKUP(K50,Teilnehmer!$A$3:$C$102,2))","v":""},null,null,null,{"$f":"IF(O50=\"\",\"\",VLOOKUP(O50,Teilnehmer!$A$3:$C$102,2))","v":""},null,null,{"$f":"IF(R50=\"\",\"\",VLOOKUP(R50,Teilnehmer!$A$3:$C$102,2))","v":""},null,null,null,{"$f":"IF(V50=\"\",\"\",VLOOKUP(V50,Teilnehmer!$A$3:$C$102,2))","v":""},null,null,{"$f":"IF(Y50=\"\",\"\",VLOOKUP(Y50,Teilnehmer!$A$3:$C$102,2))","v":""},null,null,null,{"$f":"IF(AC50=\"\",\"\",VLOOKUP(AC50,Teilnehmer!$A$3:$C$102,2))","v":""},null,null,{"$f":"IF(AF50=\"\",\"\",VLOOKUP(AF50,Teilnehmer!$A$3:$C$102,2))","v":""},null,null,null,{"$f":"IF(AJ50=\"\",\"\",VLOOKUP(AJ50,Teilnehmer!$A$3:$C$102,2))","v":""},null,null,{"$f":"IF(AM50=\"\",\"\",VLOOKUP(AM50,Teilnehmer!$A$3:$C$102,2))","v":""},null,null,null,{"$f":"IF(AQ50=\"\",\"\",VLOOKUP(AQ50,Teilnehmer!$A$3:$C$102,2))","v":""},null,null,{"$f":"IF(AT50=\"\",\"\",VLOOKUP(AT50,Teilnehmer!$A$3:$C$102,2))","v":""},null,null,null,{"$f":"IF(AX50=\"\",\"\",VLOOKUP(AX50,Teilnehmer!$A$3:$C$102,2))","v":""},null,null,{"$f":"IF(BA50=\"\",\"\",VLOOKUP(BA50,Teilnehmer!$A$3:$C$102,2))","v":""},null,null,null,{"$f":"IF(BE50=\"\",\"\",VLOOKUP(BE50,Teilnehmer!$A$3:$C$102,2))","v":""},null,null,{"$f":"IF(BH50=\"\",\"\",VLOOKUP(BH50,Teilnehmer!$A$3:$C$102,2))","v":""},null,null,null,{"$f":"IF(BL50=\"\",\"\",VLOOKUP(BL50,Teilnehmer!$A$3:$C$102,2))","v":""},null,null,{"$f":"IF(BO50=\"\",\"\",VLOOKUP(BO50,Teilnehmer!$A$3:$C$102,2))","v":""},null,null,null,{"$f":"IF(BS50=\"\",\"\",VLOOKUP(BS50,Teilnehmer!$A$3:$C$102,2))","v":""},null,null,{"$f":"IF(BV50=\"\",\"\",VLOOKUP(BV50,Teilnehmer!$A$3:$C$102,2))","v":""},null,null,null,{"$f":"IF(BZ50=\"\",\"\",VLOOKUP(BZ50,Teilnehmer!$A$3:$C$102,2))","v":""},null,null,{"$f":"IF(CC50=\"\",\"\",VLOOKUP(CC50,Teilnehmer!$A$3:$C$102,2))","v":""},null,null,null,{"$f":"IF(CG50=\"\",\"\",VLOOKUP(CG50,Teilnehmer!$A$3:$C$102,2))","v":""},null,null,{"$f":"IF(CJ50=\"\",\"\",VLOOKUP(CJ50,Teilnehmer!$A$3:$C$102,2))","v":""},null,null,null,{"$f":"IF(CN50=\"\",\"\",VLOOKUP(CN50,Teilnehmer!$A$3:$C$102,2))","v":""},null,null,{"$f":"IF(CQ50=\"\",\"\",VLOOKUP(CQ50,Teilnehmer!$A$3:$C$102,2))","v":""},null,null,null,{"$f":"IF(CU50=\"\",\"\",VLOOKUP(CU50,Teilnehmer!$A$3:$C$102,2))","v":""},null,null,{"$f":"IF(CX50=\"\",\"\",VLOOKUP(CX50,Teilnehmer!$A$3:$C$102,2))","v":""},null,null,null,{"$f":"IF(DB50=\"\",\"\",VLOOKUP(DB50,Teilnehmer!$A$3:$C$102,2))","v":""},null,null,{"$f":"IF(DE50=\"\",\"\",VLOOKUP(DE50,Teilnehmer!$A$3:$C$102,2))","v":""},null,null,null,{"$f":"IF(DI50=\"\",\"\",VLOOKUP(DI50,Teilnehmer!$A$3:$C$102,2))","v":""},null,null,{"$f":"IF(DL50=\"\",\"\",VLOOKUP(DL50,Teilnehmer!$A$3:$C$102,2))","v":""},null,null,null,{"$f":"IF(DP50=\"\",\"\",VLOOKUP(DP50,Teilnehmer!$A$3:$C$102,2))","v":""},null,null,{"$f":"IF(DS50=\"\",\"\",VLOOKUP(DS50,Teilnehmer!$A$3:$C$102,2))","v":""},null,null,null,{"$f":"IF(DW50=\"\",\"\",VLOOKUP(DW50,Teilnehmer!$A$3:$C$102,2))","v":""},null,null,{"$f":"IF(DZ50=\"\",\"\",VLOOKUP(DZ50,Teilnehmer!$A$3:$C$102,2))","v":""},null,null,null,{"$f":"IF(ED50=\"\",\"\",VLOOKUP(ED50,Teilnehmer!$A$3:$C$102,2))","v":""},null,null,{"$f":"IF(EG50=\"\",\"\",VLOOKUP(EG50,Teilnehmer!$A$3:$C$102,2))","v":""},null,null,null,{"$f":"IF(EK50=\"\",\"\",VLOOKUP(EK50,Teilnehmer!$A$3:$C$102,2))","v":""},null,null,{"$f":"IF(EN50=\"\",\"\",VLOOKUP(EN50,Teilnehmer!$A$3:$C$102,2))","v":""},null,null,null,{"$f":"IF(ER50=\"\",\"\",VLOOKUP(ER50,Teilnehmer!$A$3:$C$102,2))","v":""},null,null,{"$f":"IF(EU50=\"\",\"\",VLOOKUP(EU50,Teilnehmer!$A$3:$C$102,2))","v":""},null,null,null,{"$f":"IF(EY50=\"\",\"\",VLOOKUP(EY50,Teilnehmer!$A$3:$C$102,2))","v":""},null,null,{"$f":"IF(FB50=\"\",\"\",VLOOKUP(FB50,Teilnehmer!$A$3:$C$102,2))","v":""},null,null,null,{"$f":"IF(FF50=\"\",\"\",VLOOKUP(FF50,Teilnehmer!$A$3:$C$102,2))","v":""},null,null,{"$f":"IF(FI50=\"\",\"\",VLOOKUP(FI50,Teilnehmer!$A$3:$C$102,2))","v":""},null,null,null,{"$f":"IF(FM50=\"\",\"\",VLOOKUP(FM50,Teilnehmer!$A$3:$C$102,2))","v":""},null,null,{"$f":"IF(FP50=\"\",\"\",VLOOKUP(FP50,Teilnehmer!$A$3:$C$102,2))","v":""},null,null,null,{"$f":"IF(FT50=\"\",\"\",VLOOKUP(FT50,Teilnehmer!$A$3:$C$102,2))","v":""},null,null,{"$f":"IF(FW50=\"\",\"\",VLOOKUP(FW50,Teilnehmer!$A$3:$C$102,2))","v":""},null,null,null,{"$f":"IF(GA50=\"\",\"\",VLOOKUP(GA50,Teilnehmer!$A$3:$C$102,2))","v":""},null,null,{"$f":"IF(GD50=\"\",\"\",VLOOKUP(GD50,Teilnehmer!$A$3:$C$102,2))","v":""},null,null,null,{"$f":"IF(GH50=\"\",\"\",VLOOKUP(GH50,Teilnehmer!$A$3:$C$102,2))","v":""},null,null,{"$f":"IF(GK50=\"\",\"\",VLOOKUP(GK50,Teilnehmer!$A$3:$C$102,2))","v":""},null,null,null,{"$f":"IF(GO50=\"\",\"\",VLOOKUP(GO50,Teilnehmer!$A$3:$C$102,2))","v":""},null,null,{"$f":"IF(GR50=\"\",\"\",VLOOKUP(GR50,Teilnehmer!$A$3:$C$102,2))","v":""},null,null,null,{"$f":"IF(GV50=\"\",\"\",VLOOKUP(GV50,Teilnehmer!$A$3:$C$102,2))","v":""},null,null,{"$f":"IF(GY50=\"\",\"\",VLOOKUP(GY50,Teilnehmer!$A$3:$C$102,2))","v":""},null,null,null,{"$f":"IF(HC50=\"\",\"\",VLOOKUP(HC50,Teilnehmer!$A$3:$C$102,2))","v":""},null,null,{"$f":"IF(HF50=\"\",\"\",VLOOKUP(HF50,Teilnehmer!$A$3:$C$102,2))","v":""},null,null,null,{"$f":"IF(HJ50=\"\",\"\",VLOOKUP(HJ50,Teilnehmer!$A$3:$C$102,2))","v":""},null,null,{"$f":"IF(HM50=\"\",\"\",VLOOKUP(HM50,Teilnehmer!$A$3:$C$102,2))","v":""},null,null,null,{"$f":"IF(HQ50=\"\",\"\",VLOOKUP(HQ50,Teilnehmer!$A$3:$C$102,2))","v":""},null,null,{"$f":"IF(HT50=\"\",\"\",VLOOKUP(HT50,Teilnehmer!$A$3:$C$102,2))","v":""},null,null,null,{"$f":"IF(HX50=\"\",\"\",VLOOKUP(HX50,Teilnehmer!$A$3:$C$102,2))","v":""},null,null,{"$f":"IF(IA50=\"\",\"\",VLOOKUP(IA50,Teilnehmer!$A$3:$C$102,2))","v":""},null,null,null,{"$f":"IF(IE50=\"\",\"\",VLOOKUP(IE50,Teilnehmer!$A$3:$C$102,2))","v":""},null,null,{"$f":"IF(IH50=\"\",\"\",VLOOKUP(IH50,Teilnehmer!$A$3:$C$102,2))","v":""},null,null,null,{"$f":"IF(IL50=\"\",\"\",VLOOKUP(IL50,Teilnehmer!$A$3:$C$102,2))","v":""},null,null,{"$f":"IF(IO50=\"\",\"\",VLOOKUP(IO50,Teilnehmer!$A$3:$C$102,2))","v":""},null,null,null,{"$f":"IF(IS50=\"\",\"\",VLOOKUP(IS50,Teilnehmer!$A$3:$C$102,2))","v":""},null,null,{"$f":"IF(IV50=\"\",\"\",VLOOKUP(IV50,Teilnehmer!$A$3:$C$102,2))","v":""},null,null,null,{"$f":"IF(IZ50=\"\",\"\",VLOOKUP(IZ50,Teilnehmer!$A$3:$C$102,2))","v":""},null,null,{"$f":"IF(JC50=\"\",\"\",VLOOKUP(JC50,Teilnehmer!$A$3:$C$102,2))","v":""},null,null,null,{"$f":"IF(JG50=\"\",\"\",VLOOKUP(JG50,Teilnehmer!$A$3:$C$102,2))","v":""},null,null,{"$f":"IF(JJ50=\"\",\"\",VLOOKUP(JJ50,Teilnehmer!$A$3:$C$102,2))","v":""},null,null,null,{"$f":"IF(JN50=\"\",\"\",VLOOKUP(JN50,Teilnehmer!$A$3:$C$102,2))","v":""},null,null,{"$f":"IF(JQ50=\"\",\"\",VLOOKUP(JQ50,Teilnehmer!$A$3:$C$102,2))","v":""},null,null,null,{"$f":"IF(JU50=\"\",\"\",VLOOKUP(JU50,Teilnehmer!$A$3:$C$102,2))","v":""},null,null,{"$f":"IF(JX50=\"\",\"\",VLOOKUP(JX50,Teilnehmer!$A$3:$C$102,2))","v":""},null,null,null,{"$f":"IF(KB50=\"\",\"\",VLOOKUP(KB50,Teilnehmer!$A$3:$C$102,2))","v":""},null,null,{"$f":"IF(KE50=\"\",\"\",VLOOKUP(KE50,Teilnehmer!$A$3:$C$102,2))","v":""},null,null,null,{"$f":"IF(KI50=\"\",\"\",VLOOKUP(KI50,Teilnehmer!$A$3:$C$102,2))","v":""},null,null,{"$f":"IF(KL50=\"\",\"\",VLOOKUP(KL50,Teilnehmer!$A$3:$C$102,2))","v":""},null,null,null,{"$f":"IF(KP50=\"\",\"\",VLOOKUP(KP50,Teilnehmer!$A$3:$C$102,2))","v":""},null,null,{"$f":"IF(KS50=\"\",\"\",VLOOKUP(KS50,Teilnehmer!$A$3:$C$102,2))","v":""}]

{"sheet":"Vereinsmeisterergebnisse","index":5,"n_rows":78,"n_cols":9,"rows_kept":78,"cut":false,"hidden":false,"merged":[[73,7,74,7],[33,0,33,2],[33,4,33,5],[33,7,33,8],[60,0,60,5],[0,0,0,8],[2,0,2,8],[3,4,3,5],[3,7,3,8],[32,0,32,8],[3,0,3,2]]}
[{"$f":"CONCATENATE(\"Ergebnisse Vereinsmeisterschaftsschießen\",CHAR(10),\"vom\",\" \",Maske!I11,\" in Soderstorf\")","v":"Ergebnisse Vereinsmeisterschaftsschießen\nvom 07.09.2018 in Soderstorf"}]
[]
["Luftgewehr (LG)"]
[null,null,null,null,"Standauflage",null,null,"Freihand"]
["Wettkampfklasse","Kz","Alter",null,"Name","Ringe",null,"Name","Ringe"]
["Schüler männlich",20,"bis 14",null,{"$f":"IF('Eingabe-Ergebnisse VM'!E4=\"\",\"Keine Teilnahme\",'Eingabe-Ergebnisse VM'!E4)","v":"Keine Teilnahme"},{"$f":"IF('Eingabe-Ergebnisse VM'!F4=\"\",\"---\",'Eingabe-Ergebnisse VM'!F4)","v":"---"},null,{"$f":"IF('Eingabe-Ergebnisse VM'!L4=\"\",\"Keine Teilnahme\",'Eingabe-Ergebnisse VM'!L4)","v":"Keine Teilnahme"},{"$f":"IF('Eingabe-Ergebnisse VM'!M4=\"\",\"---\",'Eingabe-Ergebnisse VM'!M4)","v":"---"}]
["Schüler weiblich",21,"bis 14",null,{"$f":"IF('Eingabe-Ergebnisse VM'!B4=\"\",\"Keine Teilnahme\",'Eingabe-Ergebnisse VM'!B4)","v":"Keine Teilnahme"},{"$f":"IF('Eingabe-Ergebnisse VM'!C4=\"\",\"---\",'Eingabe-Ergebnisse VM'!C4)","v":"---"},null,{"$f":"IF('Eingabe-Ergebnisse VM'!I4=\"\",\"Keine Teilnahme\",'Eingabe-Ergebnisse VM'!I4)","v":"Keine Teilnahme"},{"$f":"IF('Eingabe-Ergebnisse VM'!J4=\"\",\"---\",'Eingabe-Ergebnisse VM'!J4)","v":"---"}]
["Jugend männlich",30,"15 - 16",null,{"$f":"IF('Eingabe-Ergebnisse VM'!S4=\"\",\"Keine Teilnahme\",'Eingabe-Ergebnisse VM'!S4)","v":"Keine Teilnahme"},{"$f":"IF('Eingabe-Ergebnisse VM'!T4=\"\",\"---\",'Eingabe-Ergebnisse VM'!T4)","v":"---"},null,{"$f":"IF('Eingabe-Ergebnisse VM'!Z4=\"\",\"Keine Teilnahme\",'Eingabe-Ergebnisse VM'!Z4)","v":"Keine Teilnahme"},{"$f":"IF('Eingabe-Ergebnisse VM'!AA4=\"\",\"---\",'Eingabe-Ergebnisse VM'!AA4)","v":"---"}]
["Jugend weiblich",31,"15 - 16",null,{"$f":"IF('Eingabe-Ergebnisse VM'!P4=\"\",\"Keine Teilnahme\",'Eingabe-Ergebnisse VM'!P4)","v":"Keine Teilnahme"},{"$f":"IF('Eingabe-Ergebnisse VM'!Q4=\"\",\"---\",'Eingabe-Ergebnisse VM'!Q4)","v":"---"},null,{"$f":"IF('Eingabe-Ergebnisse VM'!W4=\"\",\"Keine Teilnahme\",'Eingabe-Ergebnisse VM'!W4)","v":"Keine Teilnahme"},{"$f":"IF('Eingabe-Ergebnisse VM'!X4=\"\",\"---\",'Eingabe-Ergebnisse VM'!X4)","v":"---"}]
["Junioren II männlich",42,"17 - 18",null,{"$f":"IF('Eingabe-Ergebnisse VM'!AG4=\"\",\"Keine Teilnahme\",'Eingabe-Ergebnisse VM'!AG4)","v":"Keine Teilnahme"},{"$f":"IF('Eingabe-Ergebnisse VM'!AH4=\"\",\"---\",'Eingabe-Ergebnisse VM'!AH4)","v":"---"},null,{"$f":"IF('Eingabe-Ergebnisse VM'!AN4=\"\",\"Keine Teilnahme\",'Eingabe-Ergebnisse VM'!AN4)","v":"Keine Teilnahme"},{"$f":"IF('Eingabe-Ergebnisse VM'!AO4=\"\",\"---\",'Eingabe-Ergebnisse VM'!AO4)","v":"---"}]
["Junioren II weiblich",43,"17 - 18",null,{"$f":"IF('Eingabe-Ergebnisse VM'!AD4=\"\",\"Keine Teilnahme\",'Eingabe-Ergebnisse VM'!AD4)","v":"Keine Teilnahme"},{"$f":"IF('Eingabe-Ergebnisse VM'!AE4=\"\",\"---\",'Eingabe-Ergebnisse VM'!AE4)","v":"---"},null,{"$f":"IF('Eingabe-Ergebnisse VM'!AK4=\"\",\"Keine Teilnahme\",'Eingabe-Ergebnisse VM'!AK4)","v":"Keine Teilnahme"},{"$f":"IF('Eingabe-Ergebnisse VM'!AL4=\"\",\"---\",'Eingabe-Ergebnisse VM'!AL4)","v":"---"}]
["Junioren I männlich",40,"19 - 20",null,{"$f":"IF('Eingabe-Ergebnisse VM'!AU4=\"\",\"Keine Teilnahme\",'Eingabe-Ergebnisse VM'!AU4)","v":"Keine Teilnahme"},{"$f":"IF('Eingabe-Ergebnisse VM'!AV4=\"\",\"---\",'Eingabe-Ergebnisse VM'!AV4)","v":"---"},null,{"$f":"IF('Eingabe-Ergebnisse VM'!BB4=\"\",\"Keine Teilnahme\",'Eingabe-Ergebnisse VM'!BB4)","v":"Keine Teilnahme"},{"$f":"IF('Eingabe-Ergebnisse VM'!BC4=\"\",\"---\",'Eingabe-Ergebnisse VM'!BC4)","v":"---"}]
["Junioren I weiblich",41,"19 - 20",null,{"$f":"IF('Eingabe-Ergebnisse VM'!AR4=\"\",\"Keine Teilnahme\",'Eingabe-Ergebnisse VM'!AR4)","v":"Keine Teilnahme"},{"$f":"IF('Eingabe-Ergebnisse VM'!AS4=\"\",\"---\",'Eingabe-Ergebnisse VM'!AS4)","v":"---"},null,{"$f":"IF('Eingabe-Ergebnisse VM'!AY4=\"\",\"Keine Teilnahme\",'Eingabe-Ergebnisse VM'!AY4)","v":"Keine Teilnahme"},{"$f":"IF('Eingabe-Ergebnisse VM'!AZ4=\"\",\"---\",'Eingabe-Ergebnisse VM'!AZ4)","v":"---"}]
["Herren I",10,"21 - 40",null,{"$f":"IF('Eingabe-Ergebnisse VM'!BI4=\"\",\"Keine Teilnahme\",'Eingabe-Ergebnisse VM'!BI4)","v":"Keine Teilnahme"},{"$f":"IF('Eingabe-Ergebnisse VM'!BJ4=\"\",\"---\",'Eingabe-Ergebnisse VM'!BJ4)","v":"---"},null,{"$f":"IF('Eingabe-Ergebnisse VM'!BP4=\"\",\"Keine Teilnahme\",'Eingabe-Ergebnisse VM'!BP4)","v":"Keine Teilnahme"},{"$f":"IF('Eingabe-Ergebnisse VM'!BQ4=\"\",\"---\",'Eingabe-Ergebnisse VM'!BQ4)","v":"---"}]
["Damen I",11,"21 - 40",null,{"$f":"IF('Eingabe-Ergebnisse VM'!BF4=\"\",\"Keine Teilnahme\",'Eingabe-Ergebnisse VM'!BF4)","v":"Keine Teilnahme"},{"$f":"IF('Eingabe-Ergebnisse VM'!BG4=\"\",\"---\",'Eingabe-Ergebnisse VM'!BG4)","v":"---"},null,{"$f":"IF('Eingabe-Ergebnisse VM'!BM4=\"\",\"Keine Teilnahme\",'Eingabe-Ergebnisse VM'!BM4)","v":"Keine Teilnahme"},{"$f":"IF('Eingabe-Ergebnisse VM'!BN4=\"\",\"---\",'Eingabe-Ergebnisse VM'!BN4)","v":"---"}]
["Herren II",12,"41 - 50",null,{"$f":"IF('Eingabe-Ergebnisse VM'!BW4=\"\",\"Keine Teilnahme\",'Eingabe-Ergebnisse VM'!BW4)","v":"Keine Teilnahme"},{"$f":"IF('Eingabe-Ergebnisse VM'!BX4=\"\",\"---\",'Eingabe-Ergebnisse VM'!BX4)","v":"---"},null,{"$f":"IF('Eingabe-Ergebnisse VM'!CD4=\"\",\"Keine Teilnahme\",'Eingabe-Ergebnisse VM'!CD4)","v":"Keine Teilnahme"},{"$f":"IF('Eingabe-Ergebnisse VM'!CE4=\"\",\"---\",'Eingabe-Ergebnisse VM'!CE4)","v":"---"}]
["Damen II",13,"41 - 50",null,{"$f":"IF('Eingabe-Ergebnisse VM'!BT4=\"\",\"Keine Teilnahme\",'Eingabe-Ergebnisse VM'!BT4)","v":"Keine Teilnahme"},{"$f":"IF('Eingabe-Ergebnisse VM'!BU4=\"\",\"---\",'Eingabe-Ergebnisse VM'!BU4)","v":"---"},null,{"$f":"IF('Eingabe-Ergebnisse VM'!CA4=\"\",\"Keine Teilnahme\",'Eingabe-Ergebnisse VM'!CA4)","v":"Keine Teilnahme"},{"$f":"IF('Eingabe-Ergebnisse VM'!CB4=\"\",\"---\",'Eingabe-Ergebnisse VM'!CB4)","v":"---"}]
["Herren III",14,"51 - 60",null,null,null,null,{"$f":"IF('Eingabe-Ergebnisse VM'!CK4=\"\",\"Keine Teilnahme\",'Eingabe-Ergebnisse VM'!CK4)","v":"Keine Teilnahme"},{"$f":"IF('Eingabe-Ergebnisse VM'!CL4=\"\",\"---\",'Eingabe-Ergebnisse VM'!CL4)","v":"---"}]
["Damen III",15,"51 - 60",null,null,null,null,{"$f":"IF('Eingabe-Ergebnisse VM'!CH4=\"\",\"Keine Teilnahme\",'Eingabe-Ergebnisse VM'!CH4)","v":"Keine Teilnahme"},{"$f":"IF('Eingabe-Ergebnisse VM'!CI4=\"\",\"---\",'Eingabe-Ergebnisse VM'!CI4)","v":"---"}]
["Herren IV",16,"61 und älter",null,null,null,null,{"$f":"IF('Eingabe-Ergebnisse VM'!CR4=\"\",\"Keine Teilnahme\",'Eingabe-Ergebnisse VM'!CR4)","v":"Keine Teilnahme"},{"$f":"IF('Eingabe-Ergebnisse VM'!CS4=\"\",\"---\",'Eingabe-Ergebnisse VM'!CS4)","v":"---"}]
["Damen IV",17,"61 und älter",null,null,null,null,{"$f":"IF('Eingabe-Ergebnisse VM'!CO4=\"\",\"Keine Teilnahme\",'Eingabe-Ergebnisse VM'!CO4)","v":"Keine Teilnahme"},{"$f":"IF('Eingabe-Ergebnisse VM'!CP4=\"\",\"---\",'Eingabe-Ergebnisse VM'!CP4)","v":"---"}]
["Senioren I männlich",70,"51 - 60",null,{"$f":"IF('Eingabe-Ergebnisse VM'!CY4=\"\",\"Keine Teilnahme\",'Eingabe-Ergebnisse VM'!CY4)","v":"Keine Teilnahme"},{"$f":"IF('Eingabe-Ergebnisse VM'!CZ4=\"\",\"---\",'Eingabe-Ergebnisse VM'!CZ4)","v":"---"}]
["Senioren I weiblich",71,"51 - 60",null,{"$f":"IF('Eingabe-Ergebnisse VM'!CV4=\"\",\"Keine Teilnahme\",'Eingabe-Ergebnisse VM'!CV4)","v":"Keine Teilnahme"},{"$f":"IF('Eingabe-Ergebnisse VM'!CW4=\"\",\"---\",'Eingabe-Ergebnisse VM'!CW4)","v":"---"}]
["Senioren II männlich",72,"61 - 65",null,{"$f":"IF('Eingabe-Ergebnisse VM'!DF4=\"\",\"Keine Teilnahme\",'Eingabe-Ergebnisse VM'!DF4)","v":"Keine Teilnahme"},{"$f":"IF('Eingabe-Ergebnisse VM'!DG4=\"\",\"---\",'Eingabe-Ergebnisse VM'!DG4)","v":"---"},null,"Anzahl VM-Nadeln KK:"]
["Senioren II weiblich",73,"61 - 65",null,{"$f":"IF('Eingabe-Ergebnisse VM'!DC4=\"\",\"Keine Teilnahme\",'Eingabe-Ergebnisse VM'!DC4)","v":"Keine Teilnahme"},{"$f":"IF('Eingabe-Ergebnisse VM'!DD4=\"\",\"---\",'Eingabe-Ergebnisse VM'!DD4)","v":"---"},null,{"$f":"COUNT(F6:F17,I6:I21,F22:F31)","v":0}]
["Senioren III männlich",74,"66 - 70",null,{"$f":"IF('Eingabe-Ergebnisse VM'!DM4=\"\",\"Keine Teilnahme\",'Eingabe-Ergebnisse VM'!DM4)","v":"Keine Teilnahme"},{"$f":"IF('Eingabe-Ergebnisse VM'!DN4=\"\",\"---\",'Eingabe-Ergebnisse VM'!DN4)","v":"---"}]
["Senioren III weiblich",75,"66 - 70",null,{"$f":"IF('Eingabe-Ergebnisse VM'!DJ4=\"\",\"Keine Teilnahme\",'Eingabe-Ergebnisse VM'!DJ4)","v":"Keine Teilnahme"},{"$f":"IF('Eingabe-Ergebnisse VM'!DK4=\"\",\"---\",'Eingabe-Ergebnisse VM'!DK4)","v":"---"}]
["Senioren IV männlich",76,"71 - 75",null,{"$f":"IF('Eingabe-Ergebnisse VM'!DT4=\"\",\"Keine Teilnahme\",'Eingabe-Ergebnisse VM'!DT4)","v":"Keine Teilnahme"},{"$f":"IF('Eingabe-Ergebnisse VM'!DU4=\"\",\"---\",'Eingabe-Ergebnisse VM'!DU4)","v":"---"}]
["Senioren IV weiblich",77,"71 - 75",null,{"$f":"IF('Eingabe-Ergebnisse VM'!DQ4=\"\",\"Keine Teilnahme\",'Eingabe-Ergebnisse VM'!DQ4)","v":"Keine Teilnahme"},{"$f":"IF('Eingabe-Ergebnisse VM'!DR4=\"\",\"---\",'Eingabe-Ergebnisse VM'!DR4)","v":"---"}]
["Senioren V männlich",78,"76 und älter",null,{"$f":"IF('Eingabe-Ergebnisse VM'!EA4=\"\",\"Keine Teilnahme\",'Eingabe-Ergebnisse VM'!EA4)","v":"Keine Teilnahme"},{"$f":"IF('Eingabe-Ergebnisse VM'!EB4=\"\",\"---\",'Eingabe-Ergebnisse VM'!EB4)","v":"---"}]
["Senioren V weiblich",79,"76 und älter",null,{"$f":"IF('Eingabe-Ergebnisse VM'!DX4=\"\",\"Keine Teilnahme\",'Eingabe-Ergebnisse VM'!DX4)","v":"Keine Teilnahme"},{"$f":"IF('Eingabe-Ergebnisse VM'!DY4=\"\",\"---\",'Eingabe-Ergebnisse VM'!DY4)","v":"---"}]
[]
["Kleinkaliber (KK)"]
[null,null,null,null,"Standauflage",null,null,"Freihand"]
["Wettkampfklasse","Kz","Alter",null,"Name","Ringe",null,"Name","Ringe"]
["Jugend männlich",30,"15 - 16",null,{"$f":"IF('Eingabe-Ergebnisse VM'!EH4=\"\",\"Keine Teilnahme\",'Eingabe-Ergebnisse VM'!EH4)","v":"Keine Teilnahme"},{"$f":"IF('Eingabe-Ergebnisse VM'!EI4=\"\",\"---\",'Eingabe-Ergebnisse VM'!EI4)","v":"---"},null,{"$f":"IF('Eingabe-Ergebnisse VM'!EO4=\"\",\"Keine Teilnahme\",'Eingabe-Ergebnisse VM'!EO4)","v":"Keine Teilnahme"},{"$f":"IF('Eingabe-Ergebnisse VM'!EP4=\"\",\"---\",'Eingabe-Ergebnisse VM'!EP4)","v":"---"}]
["Jugend weiblich",31,"15 - 16",null,{"$f":"IF('Eingabe-Ergebnisse VM'!EE4=\"\",\"Keine Teilnahme\",'Eingabe-Ergebnisse VM'!EE4)","v":"Keine Teilnahme"},{"$f":"IF('Eingabe-Ergebnisse VM'!EF4=\"\",\"---\",'Eingabe-Ergebnisse VM'!EF4)","v":"---"},null,{"$f":"IF('Eingabe-Ergebnisse VM'!EL4=\"\",\"Keine Teilnahme\",'Eingabe-Ergebnisse VM'!EL4)","v":"Keine Teilnahme"},{"$f":"IF('Eingabe-Ergebnisse VM'!EM4=\"\",\"---\",'Eingabe-Ergebnisse VM'!EM4)","v":"---"}]
["Junioren II männlich",42,"17 - 18",null,{"$f":"IF('Eingabe-Ergebnisse VM'!EV4=\"\",\"Keine Teilnahme\",'Eingabe-Ergebnisse VM'!EV4)","v":"Keine Teilnahme"},{"$f":"IF('Eingabe-Ergebnisse VM'!EW4=\"\",\"---\",'Eingabe-Ergebnisse VM'!EW4)","v":"---"},null,{"$f":"IF('Eingabe-Ergebnisse VM'!FC4=\"\",\"Keine Teilnahme\",'Eingabe-Ergebnisse VM'!FC4)","v":"Keine Teilnahme"},{"$f":"IF('Eingabe-Ergebnisse VM'!FD4=\"\",\"---\",'Eingabe-Ergebnisse VM'!FD4)","v":"---"}]
["Junioren II weiblich",43,"17 - 18",null,{"$f":"IF('Eingabe-Ergebnisse VM'!ES4=\"\",\"Keine Teilnahme\",'Eingabe-Ergebnisse VM'!ES4)","v":"Keine Teilnahme"},{"$f":"IF('Eingabe-Ergebnisse VM'!ET4=\"\",\"---\",'Eingabe-Ergebnisse VM'!ET4)","v":"---"},null,{"$f":"IF('Eingabe-Ergebnisse VM'!EZ4=\"\",\"Keine Teilnahme\",'Eingabe-Ergebnisse VM'!EZ4)","v":"Keine Teilnahme"},{"$f":"IF('Eingabe-Ergebnisse VM'!FA4=\"\",\"---\",'Eingabe-Ergebnisse VM'!FA4)","v":"---"}]
["Junioren I männlich",40,"19 - 20",null,{"$f":"IF('Eingabe-Ergebnisse VM'!FJ4=\"\",\"Keine Teilnahme\",'Eingabe-Ergebnisse VM'!FJ4)","v":"Keine Teilnahme"},{"$f":"IF('Eingabe-Ergebnisse VM'!FK4=\"\",\"---\",'Eingabe-Ergebnisse VM'!FK4)","v":"---"},null,{"$f":"IF('Eingabe-Ergebnisse VM'!FQ4=\"\",\"Keine Teilnahme\",'Eingabe-Ergebnisse VM'!FQ4)","v":"Keine Teilnahme"},{"$f":"IF('Eingabe-Ergebnisse VM'!FR4=\"\",\"---\",'Eingabe-Ergebnisse VM'!FR4)","v":"---"}]
["Junioren I weiblich",41,"19 - 20",null,{"$f":"IF('Eingabe-Ergebnisse VM'!FG4=\"\",\"Keine Teilnahme\",'Eingabe-Ergebnisse VM'!FG4)","v":"Keine Teilnahme"},{"$f":"IF('Eingabe-Ergebnisse VM'!FH4=\"\",\"---\",'Eingabe-Ergebnisse VM'!FH4)","v":"---"},null,{"$f":"IF('Eingabe-Ergebnisse VM'!FN4=\"\",\"Keine Teilnahme\",'Eingabe-Ergebnisse VM'!FN4)","v":"Keine Teilnahme"},{"$f":"IF('Eingabe-Ergebnisse VM'!FO4=\"\",\"---\",'Eingabe-Ergebnisse VM'!FO4)","v":"---"}]
["Herren I",10,"21 - 40",null,{"$f":"IF('Eingabe-Ergebnisse VM'!FX4=\"\",\"Keine Teilnahme\",'Eingabe-Ergebnisse VM'!FX4)","v":"Keine Teilnahme"},{"$f":"IF('Eingabe-Ergebnisse VM'!FY4=\"\",\"---\",'Eingabe-Ergebnisse VM'!FY4)","v":"---"},null,{"$f":"IF('Eingabe-Ergebnisse VM'!GE4=\"\",\"Keine Teilnahme\",'Eingabe-Ergebnisse VM'!GE4)","v":"Keine Teilnahme"},{"$f":"IF('Eingabe-Ergebnisse VM'!GF4=\"\",\"---\",'Eingabe-Ergebnisse VM'!GF4)","v":"---"}]
["Damen I",11,"21 - 40",null,{"$f":"IF('Eingabe-Ergebnisse VM'!FU4=\"\",\"Keine Teilnahme\",'Eingabe-Ergebnisse VM'!FU4)","v":"Keine Teilnahme"},{"$f":"IF('Eingabe-Ergebnisse VM'!FV4=\"\",\"---\",'Eingabe-Ergebnisse VM'!FV4)","v":"---"},null,{"$f":"IF('Eingabe-Ergebnisse VM'!GB4=\"\",\"Keine Teilnahme\",'Eingabe-Ergebnisse VM'!GB4)","v":"Keine Teilnahme"},{"$f":"IF('Eingabe-Ergebnisse VM'!GC4=\"\",\"---\",'Eingabe-Ergebnisse VM'!GC4)","v":"---"}]
["Herren II",12,"41 - 50",null,{"$f":"IF('Eingabe-Ergebnisse VM'!GL4=\"\",\"Keine Teilnahme\",'Eingabe-Ergebnisse VM'!GL4)","v":"Keine Teilnahme"},{"$f":"IF('Eingabe-Ergebnisse VM'!GM4=\"\",\"---\",'Eingabe-Ergebnisse VM'!GM4)","v":"---"},null,{"$f":"IF('Eingabe-Ergebnisse VM'!GS4=\"\",\"Keine Teilnahme\",'Eingabe-Ergebnisse VM'!GS4)","v":"Keine Teilnahme"},{"$f":"IF('Eingabe-Ergebnisse VM'!GT4=\"\",\"---\",'Eingabe-Ergebnisse VM'!GT4)","v":"---"}]
["Damen II",13,"41 - 50",null,{"$f":"IF('Eingabe-Ergebnisse VM'!GI4=\"\",\"Keine Teilnahme\",'Eingabe-Ergebnisse VM'!GI4)","v":"Keine Teilnahme"},{"$f":"IF('Eingabe-Ergebnisse VM'!GJ4=\"\",\"---\",'Eingabe-Ergebnisse VM'!GJ4)","v":"---"},null,{"$f":"IF('Eingabe-Ergebnisse VM'!GP4=\"\",\"Keine Teilnahme\",'Eingabe-Ergebnisse VM'!GP4)","v":"Keine Teilnahme"},{"$f":"IF('Eingabe-Ergebnisse VM'!GQ4=\"\",\"---\",'Eingabe-Ergebnisse VM'!GQ4)","v":"---"}]
["Herren III",14,"51 - 60",null,null,null,null,{"$f":"IF('Eingabe-Ergebnisse VM'!GZ4=\"\",\"Keine Teilnahme\",'Eingabe-Ergebnisse VM'!GZ4)","v":"Keine Teilnahme"},{"$f":"IF('Eingabe-Ergebnisse VM'!HA4=\"\",\"---\",'Eingabe-Ergebnisse VM'!HA4)","v":"---"}]
["Damen III",15,"51 - 60",null,null,null,null,{"$f":"IF('Eingabe-Ergebnisse VM'!GW4=\"\",\"Keine Teilnahme\",'Eingabe-Ergebnisse VM'!GW4)","v":"Keine Teilnahme"},{"$f":"IF('Eingabe-Ergebnisse VM'!GX4=\"\",\"---\",'Eingabe-Ergebnisse VM'!GX4)","v":"---"}]
["Herren IV",16,"61 und älter",null,null,null,null,{"$f":"IF('Eingabe-Ergebnisse VM'!HG4=\"\",\"Keine Teilnahme\",'Eingabe-Ergebnisse VM'!HG4)","v":"Keine Teilnahme"},{"$f":"IF('Eingabe-Ergebnisse VM'!HH4=\"\",\"---\",'Eingabe-Ergebnisse VM'!HH4)","v":"---"}]
["Damen IV",17,"61 und älter",null,null,null,null,{"$f":"IF('Eingabe-Ergebnisse VM'!HD4=\"\",\"Keine Teilnahme\",'Eingabe-Ergebnisse VM'!HD4)","v":"Keine Teilnahme"},{"$f":"IF('Eingabe-Ergebnisse VM'!HE4=\"\",\"---\",'Eingabe-Ergebnisse VM'!HE4)","v":"---"}]
["Senioren I männlich",70,"51 - 60",null,{"$f":"IF('Eingabe-Ergebnisse VM'!HN4=\"\",\"Keine Teilnahme\",'Eingabe-Ergebnisse VM'!HN4)","v":"Keine Teilnahme"},{"$f":"IF('Eingabe-Ergebnisse VM'!HO4=\"\",\"---\",'Eingabe-Ergebnisse VM'!HO4)","v":"---"}]
["Senioren I weiblich",71,"51 - 60",null,{"$f":"IF('Eingabe-Ergebnisse VM'!HK4=\"\",\"Keine Teilnahme\",'Eingabe-Ergebnisse VM'!HK4)","v":"Keine Teilnahme"},{"$f":"IF('Eingabe-Ergebnisse VM'!HL4=\"\",\"---\",'Eingabe-Ergebnisse VM'!HL4)","v":"---"}]
["Senioren II männlich",72,"61 - 65",null,{"$f":"IF('Eingabe-Ergebnisse VM'!HU4=\"\",\"Keine Teilnahme\",'Eingabe-Ergebnisse VM'!HU4)","v":"Keine Teilnahme"},{"$f":"IF('Eingabe-Ergebnisse VM'!HV4=\"\",\"---\",'Eingabe-Ergebnisse VM'!HV4)","v":"---"},null,"Anzahl VM-Nadeln KK:"]
["Senioren II weiblich",73,"61 - 65",null,{"$f":"IF('Eingabe-Ergebnisse VM'!HR4=\"\",\"Keine Teilnahme\",'Eingabe-Ergebnisse VM'!HR4)","v":"Keine Teilnahme"},{"$f":"IF('Eingabe-Ergebnisse VM'!HS4=\"\",\"---\",'Eingabe-Ergebnisse VM'!HS4)","v":"---"},null,{"$f":"COUNT(F36:F45,I36:I49,F50:F59)","v":0}]
["Senioren III männlich",74,"66 - 70",null,{"$f":"IF('Eingabe-Ergebnisse VM'!IB4=\"\",\"Keine Teilnahme\",'Eingabe-Ergebnisse VM'!IB4)","v":"Keine Teilnahme"},{"$f":"IF('Eingabe-Ergebnisse VM'!IC4=\"\",\"---\",'Eingabe-Ergebnisse VM'!IC4)","v":"---"}]
["Senioren III weiblich",75,"66 - 70",null,{"$f":"IF('Eingabe-Ergebnisse VM'!HY4=\"\",\"Keine Teilnahme\",'Eingabe-Ergebnisse VM'!HY4)","v":"Keine Teilnahme"},{"$f":"IF('Eingabe-Ergebnisse VM'!HZ4=\"\",\"---\",'Eingabe-Ergebnisse VM'!HZ4)","v":"---"}]
["Senioren IV männlich",76,"71 - 75",null,{"$f":"IF('Eingabe-Ergebnisse VM'!II4=\"\",\"Keine Teilnahme\",'Eingabe-Ergebnisse VM'!II4)","v":"Keine Teilnahme"},{"$f":"IF('Eingabe-Ergebnisse VM'!IJ4=\"\",\"---\",'Eingabe-Ergebnisse VM'!IJ4)","v":"---"}]
["Senioren IV weiblich",77,"71 - 75",null,{"$f":"IF('Eingabe-Ergebnisse VM'!IF4=\"\",\"Keine Teilnahme\",'Eingabe-Ergebnisse VM'!IF4)","v":"Keine Teilnahme"},{"$f":"IF('Eingabe-Ergebnisse VM'!IG4=\"\",\"---\",'Eingabe-Ergebnisse VM'!IG4)","v":"---"}]
["Senioren V männlich",78,"76 und älter",null,{"$f":"IF('Eingabe-Ergebnisse VM'!IP4=\"\",\"Keine Teilnahme\",'Eingabe-Ergebnisse VM'!IP4)","v":"Keine Teilnahme"},{"$f":"IF('Eingabe-Ergebnisse VM'!IQ4=\"\",\"---\",'Eingabe-Ergebnisse VM'!IQ4)","v":"---"}]
["Senioren V weiblich",79,"76 und älter",null,{"$f":"IF('Eingabe-Ergebnisse VM'!IM4=\"\",\"Keine Teilnahme\",'Eingabe-Ergebnisse VM'!IM4)","v":"Keine Teilnahme"},{"$f":"IF('Eingabe-Ergebnisse VM'!IN4=\"\",\"---\",'Eingabe-Ergebnisse VM'!IN4)","v":"---"}]
[]
["Luftpistole (LP)"]
["Wettkampfklasse","Kz","Alter",null,"Name","Ringe"]
["Schüler männlich",20,"bis 14",null,{"$f":"IF('Eingabe-Ergebnisse VM'!IW4=\"\",\"Keine Teilnahme\",'Eingabe-Ergebnisse VM'!IW4)","v":"Keine Teilnahme"},{"$f":"IF('Eingabe-Ergebnisse VM'!IX4=\"\",\"---\",'Eingabe-Ergebnisse VM'!IX4)","v":"---"}]
["Schüler weiblich",21,"bis 14",null,{"$f":"IF('Eingabe-Ergebnisse VM'!IT4=\"\",\"Keine Teilnahme\",'Eingabe-Ergebnisse VM'!IT4)","v":"Keine Teilnahme"},{"$f":"IF('Eingabe-Ergebnisse VM'!IU4=\"\",\"---\",'Eingabe-Ergebnisse VM'!IU4)","v":"---"}]
["Jugend männlich",30,"15 - 16",null,{"$f":"IF('Eingabe-Ergebnisse VM'!JD4=\"\",\"Keine Teilnahme\",'Eingabe-Ergebnisse VM'!JD4)","v":"Keine Teilnahme"},{"$f":"IF('Eingabe-Ergebnisse VM'!JE4=\"\",\"---\",'Eingabe-Ergebnisse VM'!JE4)","v":"---"}]
["Jugend weiblich",31,"15 - 16",null,{"$f":"IF('Eingabe-Ergebnisse VM'!JA4=\"\",\"Keine Teilnahme\",'Eingabe-Ergebnisse VM'!JA4)","v":"Keine Teilnahme"},{"$f":"IF('Eingabe-Ergebnisse VM'!JB4=\"\",\"---\",'Eingabe-Ergebnisse VM'!JB4)","v":"---"}]
["Junioren II männlich",42,"17 - 18",null,{"$f":"IF('Eingabe-Ergebnisse VM'!JK4=\"\",\"Keine Teilnahme\",'Eingabe-Ergebnisse VM'!JK4)","v":"Keine Teilnahme"},{"$f":"IF('Eingabe-Ergebnisse VM'!JL4=\"\",\"---\",'Eingabe-Ergebnisse VM'!JL4)","v":"---"}]
["Junioren II weiblich",43,"17 - 18",null,{"$f":"IF('Eingabe-Ergebnisse VM'!JH4=\"\",\"Keine Teilnahme\",'Eingabe-Ergebnisse VM'!JH4)","v":"Keine Teilnahme"},{"$f":"IF('Eingabe-Ergebnisse VM'!JI4=\"\",\"---\",'Eingabe-Ergebnisse VM'!JI4)","v":"---"},null,"Anzahl VM-Nadeln LP:"]
["Junioren I männlich",40,"19 - 20",null,{"$f":"IF('Eingabe-Ergebnisse VM'!JR4=\"\",\"Keine Teilnahme\",'Eingabe-Ergebnisse VM'!JR4)","v":"Keine Teilnahme"},{"$f":"IF('Eingabe-Ergebnisse VM'!JS4=\"\",\"---\",'Eingabe-Ergebnisse VM'!JS4)","v":"---"},null,{"$f":"COUNT(F63:F78)","v":0}]
["Junioren I weiblich",41,"19 - 20",null,{"$f":"IF('Eingabe-Ergebnisse VM'!JO4=\"\",\"Keine Teilnahme\",'Eingabe-Ergebnisse VM'!JO4)","v":"Keine Teilnahme"},{"$f":"IF('Eingabe-Ergebnisse VM'!JP4=\"\",\"---\",'Eingabe-Ergebnisse VM'!JP4)","v":"---"}]
["Herren I",10,"21 - 40",null,{"$f":"IF('Eingabe-Ergebnisse VM'!JY4=\"\",\"Keine Teilnahme\",'Eingabe-Ergebnisse VM'!JY4)","v":"Keine Teilnahme"},{"$f":"IF('Eingabe-Ergebnisse VM'!JZ4=\"\",\"---\",'Eingabe-Ergebnisse VM'!JZ4)","v":"---"}]
["Damen I",11,"21 - 40",null,{"$f":"IF('Eingabe-Ergebnisse VM'!JV4=\"\",\"Keine Teilnahme\",'Eingabe-Ergebnisse VM'!JV4)","v":"Keine Teilnahme"},{"$f":"IF('Eingabe-Ergebnisse VM'!JW4=\"\",\"---\",'Eingabe-Ergebnisse VM'!JW4)","v":"---"}]
["Herren II",12,"41 - 50",null,{"$f":"IF('Eingabe-Ergebnisse VM'!KF4=\"\",\"Keine Teilnahme\",'Eingabe-Ergebnisse VM'!KF4)","v":"Keine Teilnahme"},{"$f":"IF('Eingabe-Ergebnisse VM'!KG4=\"\",\"---\",'Eingabe-Ergebnisse VM'!KG4)","v":"---"},null,"Anzahl VM-Nadel gesamt:"]
["Damen II",13,"41 - 50",null,{"$f":"IF('Eingabe-Ergebnisse VM'!KC4=\"\",\"Keine Teilnahme\",'Eingabe-Ergebnisse VM'!KC4)","v":"Keine Teilnahme"},{"$f":"IF('Eingabe-Ergebnisse VM'!KD4=\"\",\"---\",'Eingabe-Ergebnisse VM'!KD4)","v":"---"},null,{"$f":"SUM(H25,H53,H69)","v":0}]
["Herren III",14,"51 - 60",null,{"$f":"IF('Eingabe-Ergebnisse VM'!KM4=\"\",\"Keine Teilnahme\",'Eingabe-Ergebnisse VM'!KM4)","v":"Keine Teilnahme"},{"$f":"IF('Eingabe-Ergebnisse VM'!KN4=\"\",\"---\",'Eingabe-Ergebnisse VM'!KN4)","v":"---"}]
["Damen III",15,"51 - 60",null,{"$f":"IF('Eingabe-Ergebnisse VM'!KJ4=\"\",\"Keine Teilnahme\",'Eingabe-Ergebnisse VM'!KJ4)","v":"Keine Teilnahme"},{"$f":"IF('Eingabe-Ergebnisse VM'!KK4=\"\",\"---\",'Eingabe-Ergebnisse VM'!KK4)","v":"---"}]
["Herren IV",16,"61 und älter",null,{"$f":"IF('Eingabe-Ergebnisse VM'!KT4=\"\",\"Keine Teilnahme\",'Eingabe-Ergebnisse VM'!KT4)","v":"Keine Teilnahme"},{"$f":"IF('Eingabe-Ergebnisse VM'!KU4=\"\",\"---\",'Eingabe-Ergebnisse VM'!KU4)","v":"---"}]
["Damen IV",17,"61 und älter",null,{"$f":"IF('Eingabe-Ergebnisse VM'!KQ4=\"\",\"Keine Teilnahme\",'Eingabe-Ergebnisse VM'!KQ4)","v":"Keine Teilnahme"},{"$f":"IF('Eingabe-Ergebnisse VM'!KR4=\"\",\"---\",'Eingabe-Ergebnisse VM'!KR4)","v":"---"}]

{"sheet":"Preisschießen Ergebnisse","index":6,"n_rows":36,"n_cols":9,"rows_kept":36,"cut":false,"hidden":false,"merged":[[0,0,0,2],[0,5,0,7]]}
[{"$f":"CONCATENATE(\"Vereinsmeisterschaftspreisschießen\",CHAR(10),\"KK\",\" vom\",\" \",Maske!I11)","v":"Vereinsmeisterschaftspreisschießen\nKK vom 07.09.2018"},null,null,null,null,{"$f":"CONCATENATE(\"Vereinsmeisterschaftspreisschießen\",CHAR(10), \"LG\",\" vom\",\" \",Maske!I11)","v":"Vereinsmeisterschaftspreisschießen\nLG vom 07.09.2018"}]
["Platz:","Name:","Teiler:",null,null,"Platz:","Name:","Teiler:"]
[{"$f":"IF(D3=\"\",\"\",1)","v":""},{"$f":"IF('Preisschießen KK'!E3=\"\",\"\",'Preisschießen KK'!E3)","v":""},{"$f":"IF('Preisschießen KK'!F3=\"\",\"\",'Preisschießen KK'!F3)","v":""},{"$f":"IF(C3=\"\",\"\",C3)","v":""},null,{"$f":"IF(I3=\"\",\"\",1)","v":""},{"$f":"IF('Preisschießen LG'!E3=\"\",\"\",'Preisschießen LG'!E3)","v":""},{"$f":"IF('Preisschießen LG'!F3=\"\",\"\",'Preisschießen LG'!F3)","v":""},{"$f":"IF(H3=\"\",\"\",H3)","v":""}]
[{"$f":"IF(D4=\"\",\"\",A3+1)","v":""},{"$f":"IF('Preisschießen KK'!E4=\"\",\"\",'Preisschießen KK'!E4)","v":""},{"$f":"IF('Preisschießen KK'!F4=\"\",\"\",'Preisschießen KK'!F4)","v":""},{"$f":"IF(C4=\"\",\"\",C4)","v":""},null,{"$f":"IF(I4=\"\",\"\",F3+1)","v":""},{"$f":"IF('Preisschießen LG'!E4=\"\",\"\",'Preisschießen LG'!E4)","v":""},{"$f":"IF('Preisschießen LG'!F4=\"\",\"\",'Preisschießen LG'!F4)","v":""},{"$f":"IF(H4=\"\",\"\",H4)","v":""}]
[{"$f":"IF(D5=\"\",\"\",A4+1)","v":""},{"$f":"IF('Preisschießen KK'!E5=\"\",\"\",'Preisschießen KK'!E5)","v":""},{"$f":"IF('Preisschießen KK'!F5=\"\",\"\",'Preisschießen KK'!F5)","v":""},"",null,{"$f":"IF(I5=\"\",\"\",F4+1)","v":""},{"$f":"IF('Preisschießen LG'!E5=\"\",\"\",'Preisschießen LG'!E5)","v":""},{"$f":"IF('Preisschießen LG'!F5=\"\",\"\",'Preisschießen LG'!F5)","v":""},""]
["",{"$f":"IF('Preisschießen KK'!E6=\"\",\"\",'Preisschießen KK'!E6)","v":""},{"$f":"IF('Preisschießen KK'!F6=\"\",\"\",'Preisschießen KK'!F6)","v":""},"",null,"",{"$f":"IF('Preisschießen LG'!E6=\"\",\"\",'Preisschießen LG'!E6)","v":""},{"$f":"IF('Preisschießen LG'!F6=\"\",\"\",'Preisschießen LG'!F6)","v":""},""]
["",{"$f":"IF('Preisschießen KK'!E7=\"\",\"\",'Preisschießen KK'!E7)","v":""},{"$f":"IF('Preisschießen KK'!F7=\"\",\"\",'Preisschießen KK'!F7)","v":""},"",null,"",{"$f":"IF('Preisschießen LG'!E7=\"\",\"\",'Preisschießen LG'!E7)","v":""},{"$f":"IF('Preisschießen LG'!F7=\"\",\"\",'Preisschießen LG'!F7)","v":""},""]
["",{"$f":"IF('Preisschießen KK'!E8=\"\",\"\",'Preisschießen KK'!E8)","v":""},{"$f":"IF('Preisschießen KK'!F8=\"\",\"\",'Preisschießen KK'!F8)","v":""},"",null,"",{"$f":"IF('Preisschießen LG'!E8=\"\",\"\",'Preisschießen LG'!E8)","v":""},{"$f":"IF('Preisschießen LG'!F8=\"\",\"\",'Preisschießen LG'!F8)","v":""},""]
["",{"$f":"IF('Preisschießen KK'!E9=\"\",\"\",'Preisschießen KK'!E9)","v":""},{"$f":"IF('Preisschießen KK'!F9=\"\",\"\",'Preisschießen KK'!F9)","v":""},"",null,"",{"$f":"IF('Preisschießen LG'!E9=\"\",\"\",'Preisschießen LG'!E9)","v":""},{"$f":"IF('Preisschießen LG'!F9=\"\",\"\",'Preisschießen LG'!F9)","v":""},""]
["",{"$f":"IF('Preisschießen KK'!E10=\"\",\"\",'Preisschießen KK'!E10)","v":""},{"$f":"IF('Preisschießen KK'!F10=\"\",\"\",'Preisschießen KK'!F10)","v":""},"",null,"",{"$f":"IF('Preisschießen LG'!E10=\"\",\"\",'Preisschießen LG'!E10)","v":""},{"$f":"IF('Preisschießen LG'!F10=\"\",\"\",'Preisschießen LG'!F10)","v":""},""]
["",{"$f":"IF('Preisschießen KK'!E11=\"\",\"\",'Preisschießen KK'!E11)","v":""},{"$f":"IF('Preisschießen KK'!F11=\"\",\"\",'Preisschießen KK'!F11)","v":""},"",null,"",{"$f":"IF('Preisschießen LG'!E11=\"\",\"\",'Preisschießen LG'!E11)","v":""},{"$f":"IF('Preisschießen LG'!F11=\"\",\"\",'Preisschießen LG'!F11)","v":""},""]
["",{"$f":"IF('Preisschießen KK'!E12=\"\",\"\",'Preisschießen KK'!E12)","v":""},{"$f":"IF('Preisschießen KK'!F12=\"\",\"\",'Preisschießen KK'!F12)","v":""},"",null,"",{"$f":"IF('Preisschießen LG'!E12=\"\",\"\",'Preisschießen LG'!E12)","v":""},{"$f":"IF('Preisschießen LG'!F12=\"\",\"\",'Preisschießen LG'!F12)","v":""},""]
["",{"$f":"IF('Preisschießen KK'!E13=\"\",\"\",'Preisschießen KK'!E13)","v":""},{"$f":"IF('Preisschießen KK'!F13=\"\",\"\",'Preisschießen KK'!F13)","v":""},"",null,"",{"$f":"IF('Preisschießen LG'!E13=\"\",\"\",'Preisschießen LG'!E13)","v":""},{"$f":"IF('Preisschießen LG'!F13=\"\",\"\",'Preisschießen LG'!F13)","v":""},""]
["",{"$f":"IF('Preisschießen KK'!E14=\"\",\"\",'Preisschießen KK'!E14)","v":""},{"$f":"IF('Preisschießen KK'!F14=\"\",\"\",'Preisschießen KK'!F14)","v":""},"",null,"",{"$f":"IF('Preisschießen LG'!E14=\"\",\"\",'Preisschießen LG'!E14)","v":""},{"$f":"IF('Preisschießen LG'!F14=\"\",\"\",'Preisschießen LG'!F14)","v":""},""]
["",{"$f":"IF('Preisschießen KK'!E15=\"\",\"\",'Preisschießen KK'!E15)","v":""},{"$f":"IF('Preisschießen KK'!F15=\"\",\"\",'Preisschießen KK'!F15)","v":""},"",null,"",{"$f":"IF('Preisschießen LG'!E15=\"\",\"\",'Preisschießen LG'!E15)","v":""},{"$f":"IF('Preisschießen LG'!F15=\"\",\"\",'Preisschießen LG'!F15)","v":""},""]
["",{"$f":"IF('Preisschießen KK'!E16=\"\",\"\",'Preisschießen KK'!E16)","v":""},{"$f":"IF('Preisschießen KK'!F16=\"\",\"\",'Preisschießen KK'!F16)","v":""},"",null,"",{"$f":"IF('Preisschießen LG'!E16=\"\",\"\",'Preisschießen LG'!E16)","v":""},{"$f":"IF('Preisschießen LG'!F16=\"\",\"\",'Preisschießen LG'!F16)","v":""},""]
["",{"$f":"IF('Preisschießen KK'!E17=\"\",\"\",'Preisschießen KK'!E17)","v":""},{"$f":"IF('Preisschießen KK'!F17=\"\",\"\",'Preisschießen KK'!F17)","v":""},"",null,"",{"$f":"IF('Preisschießen LG'!E17=\"\",\"\",'Preisschießen LG'!E17)","v":""},{"$f":"IF('Preisschießen LG'!F17=\"\",\"\",'Preisschießen LG'!F17)","v":""},""]
["",{"$f":"IF('Preisschießen KK'!E18=\"\",\"\",'Preisschießen KK'!E18)","v":""},{"$f":"IF('Preisschießen KK'!F18=\"\",\"\",'Preisschießen KK'!F18)","v":""},"",null,"",{"$f":"IF('Preisschießen LG'!E18=\"\",\"\",'Preisschießen LG'!E18)","v":""},{"$f":"IF('Preisschießen LG'!F18=\"\",\"\",'Preisschießen LG'!F18)","v":""},""]
["",{"$f":"IF('Preisschießen KK'!E19=\"\",\"\",'Preisschießen KK'!E19)","v":""},{"$f":"IF('Preisschießen KK'!F19=\"\",\"\",'Preisschießen KK'!F19)","v":""},"",null,"",{"$f":"IF('Preisschießen LG'!E19=\"\",\"\",'Preisschießen LG'!E19)","v":""},{"$f":"IF('Preisschießen LG'!F19=\"\",\"\",'Preisschießen LG'!F19)","v":""},""]
["",{"$f":"IF('Preisschießen KK'!E20=\"\",\"\",'Preisschießen KK'!E20)","v":""},{"$f":"IF('Preisschießen KK'!F20=\"\",\"\",'Preisschießen KK'!F20)","v":""},"",null,"",{"$f":"IF('Preisschießen LG'!E20=\"\",\"\",'Preisschießen LG'!E20)","v":""},{"$f":"IF('Preisschießen LG'!F20=\"\",\"\",'Preisschießen LG'!F20)","v":""},""]
["",{"$f":"IF('Preisschießen KK'!E21=\"\",\"\",'Preisschießen KK'!E21)","v":""},{"$f":"IF('Preisschießen KK'!F21=\"\",\"\",'Preisschießen KK'!F21)","v":""},"",null,"",{"$f":"IF('Preisschießen LG'!E21=\"\",\"\",'Preisschießen LG'!E21)","v":""},{"$f":"IF('Preisschießen LG'!F21=\"\",\"\",'Preisschießen LG'!F21)","v":""},""]
["",{"$f":"IF('Preisschießen KK'!E22=\"\",\"\",'Preisschießen KK'!E22)","v":""},{"$f":"IF('Preisschießen KK'!F22=\"\",\"\",'Preisschießen KK'!F22)","v":""},"",null,"",{"$f":"IF('Preisschießen LG'!E22=\"\",\"\",'Preisschießen LG'!E22)","v":""},{"$f":"IF('Preisschießen LG'!F22=\"\",\"\",'Preisschießen LG'!F22)","v":""},""]
["",{"$f":"IF('Preisschießen KK'!E23=\"\",\"\",'Preisschießen KK'!E23)","v":""},{"$f":"IF('Preisschießen KK'!F23=\"\",\"\",'Preisschießen KK'!F23)","v":""},"",null,"",{"$f":"IF('Preisschießen LG'!E23=\"\",\"\",'Preisschießen LG'!E23)","v":""},{"$f":"IF('Preisschießen LG'!F23=\"\",\"\",'Preisschießen LG'!F23)","v":""},""]
["",{"$f":"IF('Preisschießen KK'!E24=\"\",\"\",'Preisschießen KK'!E24)","v":""},{"$f":"IF('Preisschießen KK'!F24=\"\",\"\",'Preisschießen KK'!F24)","v":""},"",null,"",{"$f":"IF('Preisschießen LG'!E24=\"\",\"\",'Preisschießen LG'!E24)","v":""},{"$f":"IF('Preisschießen LG'!F24=\"\",\"\",'Preisschießen LG'!F24)","v":""},""]
["",{"$f":"IF('Preisschießen KK'!E25=\"\",\"\",'Preisschießen KK'!E25)","v":""},{"$f":"IF('Preisschießen KK'!F25=\"\",\"\",'Preisschießen KK'!F25)","v":""},"",null,"",{"$f":"IF('Preisschießen LG'!E25=\"\",\"\",'Preisschießen LG'!E25)","v":""},{"$f":"IF('Preisschießen LG'!F25=\"\",\"\",'Preisschießen LG'!F25)","v":""},""]
["",{"$f":"IF('Preisschießen KK'!E26=\"\",\"\",'Preisschießen KK'!E26)","v":""},{"$f":"IF('Preisschießen KK'!F26=\"\",\"\",'Preisschießen KK'!F26)","v":""},"",null,"",{"$f":"IF('Preisschießen LG'!E26=\"\",\"\",'Preisschießen LG'!E26)","v":""},{"$f":"IF('Preisschießen LG'!F26=\"\",\"\",'Preisschießen LG'!F26)","v":""},""]
["",{"$f":"IF('Preisschießen KK'!E27=\"\",\"\",'Preisschießen KK'!E27)","v":""},{"$f":"IF('Preisschießen KK'!F27=\"\",\"\",'Preisschießen KK'!F27)","v":""},"",null,"",{"$f":"IF('Preisschießen LG'!E27=\"\",\"\",'Preisschießen LG'!E27)","v":""},{"$f":"IF('Preisschießen LG'!F27=\"\",\"\",'Preisschießen LG'!F27)","v":""},""]
["",{"$f":"IF('Preisschießen KK'!E28=\"\",\"\",'Preisschießen KK'!E28)","v":""},{"$f":"IF('Preisschießen KK'!F28=\"\",\"\",'Preisschießen KK'!F28)","v":""},"",null,"",{"$f":"IF('Preisschießen LG'!E28=\"\",\"\",'Preisschießen LG'!E28)","v":""},{"$f":"IF('Preisschießen LG'!F28=\"\",\"\",'Preisschießen LG'!F28)","v":""},""]
["",{"$f":"IF('Preisschießen KK'!E29=\"\",\"\",'Preisschießen KK'!E29)","v":""},{"$f":"IF('Preisschießen KK'!F29=\"\",\"\",'Preisschießen KK'!F29)","v":""},"",null,"",{"$f":"IF('Preisschießen LG'!E29=\"\",\"\",'Preisschießen LG'!E29)","v":""},{"$f":"IF('Preisschießen LG'!F29=\"\",\"\",'Preisschießen LG'!F29)","v":""},""]
["",{"$f":"IF('Preisschießen KK'!E30=\"\",\"\",'Preisschießen KK'!E30)","v":""},{"$f":"IF('Preisschießen KK'!F30=\"\",\"\",'Preisschießen KK'!F30)","v":""},"",null,"",{"$f":"IF('Preisschießen LG'!E30=\"\",\"\",'Preisschießen LG'!E30)","v":""},{"$f":"IF('Preisschießen LG'!F30=\"\",\"\",'Preisschießen LG'!F30)","v":""},""]
["",{"$f":"IF('Preisschießen KK'!E31=\"\",\"\",'Preisschießen KK'!E31)","v":""},{"$f":"IF('Preisschießen KK'!F31=\"\",\"\",'Preisschießen KK'!F31)","v":""},"",null,"",{"$f":"IF('Preisschießen LG'!E31=\"\",\"\",'Preisschießen LG'!E31)","v":""},{"$f":"IF('Preisschießen LG'!F31=\"\",\"\",'Preisschießen LG'!F31)","v":""},""]
["",{"$f":"IF('Preisschießen KK'!E32=\"\",\"\",'Preisschießen KK'!E32)","v":""},{"$f":"IF('Preisschießen KK'!F32=\"\",\"\",'Preisschießen KK'!F32)","v":""},"",null,"",{"$f":"IF('Preisschießen LG'!E32=\"\",\"\",'Preisschießen LG'!E32)","v":""},{"$f":"IF('Preisschießen LG'!F32=\"\",\"\",'Preisschießen LG'!F32)","v":""},""]
["",{"$f":"IF('Preisschießen KK'!E33=\"\",\"\",'Preisschießen KK'!E33)","v":""},{"$f":"IF('Preisschießen KK'!F33=\"\",\"\",'Preisschießen KK'!F33)","v":""},"",null,"",{"$f":"IF('Preisschießen LG'!E33=\"\",\"\",'Preisschießen LG'!E33)","v":""},{"$f":"IF('Preisschießen LG'!F33=\"\",\"\",'Preisschießen LG'!F33)","v":""},""]
["",{"$f":"IF('Preisschießen KK'!E34=\"\",\"\",'Preisschießen KK'!E34)","v":""},{"$f":"IF('Preisschießen KK'!F34=\"\",\"\",'Preisschießen KK'!F34)","v":""},"",null,"",{"$f":"IF('Preisschießen LG'!E34=\"\",\"\",'Preisschießen LG'!E34)","v":""},{"$f":"IF('Preisschießen LG'!F34=\"\",\"\",'Preisschießen LG'!F34)","v":""},""]
["",{"$f":"IF('Preisschießen KK'!E35=\"\",\"\",'Preisschießen KK'!E35)","v":""},{"$f":"IF('Preisschießen KK'!F35=\"\",\"\",'Preisschießen KK'!F35)","v":""},"",null,"",{"$f":"IF('Preisschießen LG'!E35=\"\",\"\",'Preisschießen LG'!E35)","v":""},{"$f":"IF('Preisschießen LG'!F35=\"\",\"\",'Preisschießen LG'!F35)","v":""},""]
["",{"$f":"IF('Preisschießen KK'!E36=\"\",\"\",'Preisschießen KK'!E36)","v":""},{"$f":"IF('Preisschießen KK'!F36=\"\",\"\",'Preisschießen KK'!F36)","v":""},"",null,"",{"$f":"IF('Preisschießen LG'!E36=\"\",\"\",'Preisschießen LG'!E36)","v":""},{"$f":"IF('Preisschießen LG'!F36=\"\",\"\",'Preisschießen LG'!F36)","v":""},""]

{"sheet":"Mitgliederliste","index":7,"n_rows":159,"n_cols":6,"rows_kept":159,"cut":false,"hidden":false,"merged":[]}
["Vor-/ Nachname","Geb.","Alter",null,null,"Stand: 22.08.2018"]
["Albert Thies","1936-01-17",{"$f":"IF(B2=\"\",\"\",DATEDIF(B2,TODAY(),\"Y\"))","v":82}]
["Alexandra Sadrinna","1948-08-07",{"$f":"IF(B3=\"\",\"\",DATEDIF(B3,TODAY(),\"Y\"))","v":70}]
["Andrea Westermann","1973-12-15",44]
["Andreas Crepon","1963-10-09",54]
["Andreas Peper","1979-12-13",38]
["Angela Adomeit","1960-02-15",58]
["Angelika Kreschinski","1957-03-19",61]
["Anna Culemann","1989-02-16",29]
["Anne Jornitz","1943-02-04",75]
["Armin Bruns","1936-11-12",81]
["Benno Reher","1928-04-27",90]
["Bernd Karsten","1961-08-30",57]
["Bernd Weidmann","1962-04-29",56]
["Christian Müller-Vogt","1968-12-31",49]
["Christina Marie Lüders","2008-07-25",10]
["Christina Schimmelpfennig","1952-09-29",65]
["Cord-Jürgen Vogt","1955-02-26",63]
["Dana Winkelmann","1988-07-23",30]
["Daniel Marquardt","1998-06-13",20]
["Dirk Oedding","1972-04-25",46]
["Eckard Kaiser","1951-11-02",66]
["Eckhard Krohne","1943-02-06",75]
["Edith Meyer-Jacob","1952-09-12",65]
["Elke Frohberg","1967-03-28",51]
["Elke Karsten","1962-02-27",56]
["Elli Solle","1926-04-19",92]
["Ewald Matern","1927-07-17",91]
["Florian Adomeit","1981-01-21",37]
["Florian Beck","1989-02-07",29]
["Florian Müller","1979-06-18",39]
["Frank Classen","1963-02-05",55]
["Frank Hinrichs","1970-02-20",48]
["Franziska Meyer","1943-05-12",75]
["Fritz Elsner","1935-07-16",83]
["Fritz Weit","1997-03-28",21]
["Georg Hinrichs","1942-09-14",75]
["Günter Oedding","1939-06-27",79]
["Günther Schubert","1939-06-08",79]
["Gustav Wunder","1931-08-07",87]
["Hans-Hermann Müller","1947-01-26",71]
["Hans-Joachim Schön","1938-11-19",79]
["Hartmut Winkelmann","1941-03-03",77]
["Hauke Nolte","1998-07-01",20]
["Heike Hinrichs","1945-06-02",73]
["Heiner Bienko","1955-03-05",63]
["Heinrich Meyer","1943-03-26",75]
["Heinrich Meyer","1925-02-04",93]
["Heinrich Schlemme","1938-12-23",79]
["Helga Behr","1933-12-13",84]
["Hendrik Bienko","1985-08-25",33]
["Hermann von Appen","1935-09-28",82]
["Holger Schmidt","1964-07-26",54]
["Horst Rüther","1940-08-16",78]
["Ilse Wandelt","1958-03-11",60]
["Imke Winkelmann","1990-04-13",28]
["Ina Culemann","1986-05-21",32]
["Irene  Perz","1938-05-05",80]
["Jan-Christoph Eckelmann","1983-01-31",35]
["Jannes Lüders","2015-02-09",3]
["Jens Westermann","1971-04-30",47]
["Joachim Rörup","1972-03-14",46]
["Joachim Wind","1968-12-27",49]
["Jonas Böttjer","1996-08-18",22]
["Jörg Eberitzsch","1967-02-23",51]
["Jörg Mehring","1965-07-13",53]
["Kai Müller","1974-08-14",{"$f":"IF(B67=\"\",\"\",DATEDIF(B67,TODAY(),\"Y\"))","v":44}]
["Kai Winkelmann","1982-03-17",36]
["Karola Schönwald","1957-04-27",61]
["Karsten Meyer-Frohberg","1965-07-27",53]
["Katrin Eckelmann","1955-02-26",63]
["Katrin Pfaffenbach","1981-04-01",37]
["Kimberly Wolf ","1996-11-12",21]
["Klaus Meister","1963-11-19",54]
["Klaus Wandelt","1949-05-31",69]
["Klaus-Peter Neumann","1942-04-03",76]
["Laines Krohne","1997-01-24",21]
["Lars Lüders","1970-05-14",48]
["Lars Nowoitnick","1977-01-17",41]
["Lowes Böttcher","2004-06-25",14]
["Luka Haubner",null,""]
["Manfred Meyer","1950-06-24",68]
["Manfred Schallenberg","1946-05-16",72]
["Marianne Vorwerk ","1957-02-19",61]
["Mariechen Vogt","1926-10-23",91]
["Marius Aevermann","1999-03-04",19]
["Markus Müller","1968-01-04",50]
["Marlies Culemann","1958-05-22",60]
["Martin Bauer","1950-11-13",67]
["Martina Meister","1971-02-28",47]
["Marwen Klaebe","2001-09-20",16]
["Mathias Martin ","1965-12-16",52]
["Melanie Ott","1989-01-01",29]
["Michael Garbers","1969-03-03",49]
["Michael Höpner","1998-09-28",19]
["Michael Lühr","1972-03-11",46]
["Nils Müller","1981-06-10",37]
["Nora Wolfeil","1997-10-27",20]
["Norman Schröder","2000-07-23",18]
["Ole Otmar Sievert","2003-12-03",14]
["Otmar Sievert","1966-12-19",51]
["Otto Peper","1950-08-11",68]
["Paul Kucklick","1996-07-29",22]
["Paul Meister","2000-05-08",18]
["Peter Adomeit","1955-02-12",63]
["Peter Böttjer","1967-07-13",51]
["Peter Höpner","1971-09-10",46]
["Peter Ott","1958-12-17",59]
["Petra Classen","1971-09-20",46]
["Petra Garbers","1966-11-29",51]
["Raphael Perdylla","1982-11-09",35]
["Renate Bauer","1950-06-07",68]
["Rene-Marc Witthöft","2002-12-27",15]
["Robert Eckelmann","1953-05-16",65]
["Rolf Marquardt","1966-11-30",51]
["Sigrid Lüttge","1956-01-12",62]
["Sigrid Marquardt","1967-11-26",50]
["Steffen Brautlecht","1960-05-19",58]
["Stephan Müller","1971-12-07",46]
["Stephanie Ott","1990-08-06",28]
["Stine Sievert","2005-10-04",12]
["Susanne Wolf ","1964-04-16",54]
["Tanja Neske","1969-09-14",48]
["Thomas Jornitz","1967-04-22",51]
["Thorsten Knobbe","1965-07-05",53]
["Tilmann Imort","1990-06-23",28]
["Torre Hinsch","1999-06-27",19]
["Torsten Wolfeil","1964-09-29",53]
["Ulrike Winkelmann","1959-06-21",59]
["Ursula Fiedler","1954-10-18",63]
["Ursula Krohne","1946-02-02",{"$f":"IF(B131=\"\",\"\",DATEDIF(B131,TODAY(),\"Y\"))","v":72}]
["Uwe Kreschinski","1956-05-04",62]
["Volker Culemann","1958-12-29",59]
["Werner Bauer","1947-10-24",70]
["Werner Jornitz","1939-07-26",79]
["Werner Koslowski","1926-01-06",92]
["Werner Müller ","1963-02-21",55]
["Werner Winkelmann","1956-01-30",62]
["Wolfgang Lüttge","1940-02-05",78]
["Wolfgang Marten","1951-11-20",66]
["Wolfgang Streich","1950-09-01",68]
[null,null,""]
[null,null,""]
[null,null,""]
[null,null,""]
[null,null,""]
[null,null,""]
[null,null,""]
[null,null,""]
[null,null,""]
[null,null,""]
[null,null,""]
[null,null,""]
[null,null,""]
[null,null,""]
[null,null,""]
[null,null,""]
[null,null,""]
[null,null,""]

{"sheet":"Wettkampfklassen ab 01.01.2018","index":8,"n_rows":30,"n_cols":9,"rows_kept":30,"cut":false,"hidden":false,"merged":[[0,0,0,8],[1,0,1,2],[1,4,1,5],[1,6,1,7],[29,0,30,8]]}
[]
["Disziplin =>",null,null,null,"Luftgewehr",null,"Kleinkaliber",null,"Luftpistole"]
["Wettkampfklasse","WK","Alter",null,"Auflage","Freihand","Auflage","Freihand","Freihand"]
["Schüler männlich",20,"bis 14",null,"X (20)","X (20)",null,null,"X (20)"]
["Schüler weiblich",21,"bis 14",null,"X (20)","X (20)",null,null,"X (20)"]
["Jugend männlich",30,"15 - 16",null,"X (20)","X (40)","X (10)","X (10)","X (20)"]
["Jugend weiblich",31,"15 - 16",null,"X (20)","X (40)","X (10)","X (10)","X (20)"]
["Junioren II männlich",42,"17 - 18",null,"X (20)","X (40)","X (10)","X (10)","X (20)"]
["Junioren II weiblich",43,"17 - 18",null,"X (20)","X (40)","X (10)","X (10)","X (20)"]
["Junioren I männlich",40,"19 - 20",null,"X (20)","X (40)","X (10)","X (10)","X (20)"]
["Junioren I weiblich",41,"19 - 20",null,"X (20)","X (40)","X (10)","X (10)","X (20)"]
["Herren I",10,"21 - 40",null,"X (20)","X (20)","X (10)","X (10)","X (40)"]
["Damen I",11,"21 - 40",null,"X (20)","X (20)","X (10)","X (10)","X (40)"]
["Herren II",12,"41 - 50",null,"X (20)","X (20)","X (10)","X (10)","X (40)"]
["Damen II",13,"41 - 50",null,"X (20)","X (20)","X (10)","X (10)","X (40)"]
["Herren III",14,"51 - 60",null,null,"X (20)",null,"X (10)","X (40)"]
["Damen III",15,"51 - 60",null,null,"X (20)",null,"X (10)","X (40)"]
["Herren IV",16,"61 und älter",null,null,"X (20)",null,"X (10)","X (20)"]
["Damen IV",17,"61 und älter",null,null,"X (20)",null,"X (10)","X (20)"]
["Senioren I männlich",70,"51 - 60",null,"X (20)",null,"X (10)"]
["Senioren I weiblich",71,"51 - 60",null,"X (20)",null,"X (10)"]
["Senioren II männlich",72,"61 - 65",null,"X (20)",null,"X (10)"]
["Senioren II weiblich",73,"61 - 65",null,"X (20)",null,"X (10)"]
["Senioren III männlich",74,"66 - 70",null,"X (20)",null,"X (10)"]
["Senioren III weiblich",75,"66 - 70",null,"X (20)",null,"X (10)"]
["Senioren IV männlich",76,"71 - 75",null,"X (20)",null,"X (10)"]
["Senioren IV weiblich",77,"71 - 75",null,"X (20)",null,"X (10)"]
["Senioren V männlich",78,"76 und älter",null,"X (20)",null,"X (10)"]
["Senioren V weiblich",79,"76 und älter",null,"X (20)",null,"X (10)"]
["X (10) = startberechtigt u. Anzahl Schuss,        leeres Feld = nicht startberechtigt,     AL = Auflage,       FH = Freihand"]