{"text_format":"1","workbook":"xlsx","n_sheets":34,"sheets":["Druckmenü","Stammdaten","Hauptmaske","Datensammler","Daten","Urkunde individuell","Ergebnis mit Klassen","Ergebnis Klasse 1","K1 Urkunde-Platz 1","K1 Urkunde-Platz 2","K1 Urkunde-Platz 3","Ergebnis Klasse 2","K2 Urkunde-Platz 1","K2 Urkunde-Platz 2","K2 Urkunde-Platz 3","Ergebnis Klasse 3","K3 Urkunde-Platz 1","K3 Urkunde-Platz 2","K3 Urkunde-Platz 3","Ergebnis Klasse 4","K4 Urkunde-Platz 1","K4 Urkunde-Platz 2","K4 Urkunde-Platz 3","Ergebnis Klasse 5","K5 Urkunde-Platz 1","K5 Urkunde-Platz 2","K5 Urkunde-Platz 3","Ergebnis ohne Klassen","Urkunde-Platz 1","Urkunde-Platz 2","Urkunde-Platz 3","Wanderfliese","Turniervorlage (1)","Turniervorlage (2)"],"not_rendered":{"charts":0,"images":81,"macros":1,"external_links":0,"defined_names":30,"comments":3,"pivot_tables":0},"unopened":[],"bounds":{"document_bytes":16777216,"sheet_cells":100000,"rows_first":2000,"rows_last":500,"rows_between":2000,"halvings":0,"cell_chars":16384,"cell_head_chars":4096},"cells_cut":0,"cells_raw":0,"read":"whole","date_system":"1900"}

{"sheet":"Druckmenü","index":0,"n_rows":29,"n_cols":5,"rows_kept":29,"cut":false,"hidden":false,"merged":[[28,4,28,6]]}
[null,null,"Reitername","Drucken\n\"x\""]
[null,"Alle Teilnehmer   ","Hauptmaske","x"]
[null,"Gesamtergebnis nach Klassen   ","Ergebnis mit Klassen","x"]
[null,"Gesamtergebnis Klasse 1","Ergebnis Klasse 1"]
[null,"1. Platz Urkunde Klasse 1   ","K1 Urkunde-Platz 1","x"]
[null,"2. Platz Urkunde Klasse 1   ","K1 Urkunde-Platz 2","x"]
[null,"3. Platz Urkunde Klasse 1   ","K1 Urkunde-Platz 3","x"]
[null,"Gesamtergebnis Klasse 2","Ergebnis Klasse 2"]
[null,"1. Platz Urkunde Klasse 2   ","K2 Urkunde-Platz 1","x"]
[null,"2. Platz Urkunde Klasse 2   ","K2 Urkunde-Platz 2","x"]
[null,"3. Platz Urkunde Klasse 2   ","K2 Urkunde-Platz 3","x"]
[null,"Gesamtergebnis Klasse 3","Ergebnis Klasse 3"]
[null,"1. Platz Urkunde Klasse 3   ","K3 Urkunde-Platz 1"]
[null,"2. Platz Urkunde Klasse 3   ","K3 Urkunde-Platz 2"]
[null,"3. Platz Urkunde Klasse 3   ","K3 Urkunde-Platz 3"]
[null,"Gesamtergebnis Klasse 4","Ergebnis Klasse 4"]
[null,"1. Platz Urkunde Klasse 4   ","K4 Urkunde-Platz 1"]
[null,"2. Platz Urkunde Klasse 4   ","K4 Urkunde-Platz 2"]
[null,"3. Platz Urkunde Klasse 4   ","K4 Urkunde-Platz 3"]
[null,"Gesamtergebnis Klasse 5","Ergebnis Klasse 5"]
[null,"1. Platz Urkunde Klasse 5   ","K5 Urkunde-Platz 1"]
[null,"2. Platz Urkunde Klasse 5   ","K5 Urkunde-Platz 2"]
[null,"3. Platz Urkunde Klasse 5   ","K5 Urkunde-Platz 3"]
[null,"Gesamtergebnis ohne Klassen   ","Ergebnis ohne Klassen","x"]
[null,"1. Platz Urkunde ohne Klassen   ","Urkunde-Platz 1"]
[null,"2. Platz Urkunde ohne Klassen   ","Urkunde-Platz 2"]
[null,"3. Platz Urkunde ohne Klassen   ","Urkunde-Platz 3"]
[null,"Wanderfliese   ","Wanderfliese","x"]
[null,null,null,{"$f":"COUNTA(D2:D28)","v":10},"Seiten ausgewählt !"]

{"sheet":"Stammdaten","index":1,"n_rows":10,"n_cols":15,"rows_kept":10,"cut":false,"hidden":false,"merged":[[9,9,9,10],[1,12,2,12],[1,1,1,2],[5,3,7,3],[6,4,6,5],[1,14,2,14],[0,0,1,0],[1,6,2,6],[5,4,5,5],[1,10,2,10],[1,11,2,11],[1,13,2,13]]}
[{"$f":"IF(COUNTA(C4:C9)=6,\"OK\",\"NIO\")","v":"NIO"}]
[null,"      Eingabe der Stammdaten",null,null,null,null,"Beispieldaten",null,null,null,"Beispieldaten","Zeichen","MAX","max. \nmögliche \nPunkte","Durchgänge"]
[null,null,null,null,null,null,null,null,"Klassen","Text für Urkunden"]
[null,"Datum:  ",null,null,null,null,"2020-10-08",null,1,"Klasse \"mit Prellschlag\"","HFT Klasse 1",{"$f":"LEN(J4)","v":24},21,160,2]
[null,"Ort:  ","Soderstorf",null,null,null,"Soderstorf",null,2,"Klasse \"ohne Prellschlag\"","HFT Klasse 2",{"$f":"LEN(J5)","v":25},21,160,2]
[null,"Name Auswertung:  ",null,null,null,null,"Kai Müller",null,3,null,"HFT Klasse 3",0,21,160,2]
[null,"Name für Unterschrift Urkunde:  ","Rolf Marquardt",null,null,null,"Rolf Marquardt",null,4,null,"HFT Klasse 4",0,21,160,2]
[null,"Name der Veranstaltung:  ","Dat Groote Püüster Scheeten",null,null,null,"Dat groote Püster scheeten",null,5,null,"HFT Klasse 5",0,21,160,2]
[null,"Bonuspunkte bei Prellern: ",0,null,null,null,0,null,null,"Urkundentext"]
[null,null,null,null,null,null,null,null,null,"Hiermit verleiht der SV-Soderstorf",null,34,45]

{"sheet":"Hauptmaske","index":2,"n_rows":154,"n_cols":13,"rows_kept":154,"cut":false,"hidden":false,"merged":[[2,0,2,1]]}
[]
[null,null,"Datum:"]
[{"$f":"IF(Stammdaten!A1=\"OK\",\"Stammdaten sind vollständig\",\"Bitte Stammdaten pflegen !\")","v":"Bitte Stammdaten pflegen !"},null,{"$f":"TODAY()","v":"2023-07-25"},null,null,null,"Bitte nur die \"weißen Felder\" befüllen!"]
["Lfd. \nNr.","Name:","1. Durchgang\n(Anzahl Treffer)","2. Durchgang\n(Anzahl Treffer)","3. Durchgang\n(Anzahl Treffer)","4. Durchgang\n(Anzahl Treffer)","5. Durchgang\n(Anzahl Treffer)","Bonus","Klasse","Summe:","%"]
["01.",null,null,null,null,null,null,{"$f":"IF(Stammdaten!$C$9=0,\"\",IF(I5=4,Stammdaten!$C$9,\"\"))","v":""},null,{"$f":"IF(SUM(C5:H5)=0,\"\",SUM(C5:H5))","v":""},{"$f":"IF(B5=\"\",\"\",IF(M5<>COUNTA(C5:G5),\"\",IF(I5=1,Hauptmaske!J5/Stammdaten!$N$4,IF(I5=2,Hauptmaske!J5/Stammdaten!$N$5,IF(I5=3,Hauptmaske!J5/Stammdaten!$N$6,IF(I5=4,Hauptmaske!J5/Stammdaten!$N$7,IF(I5=5,Hauptmaske!J5/Stammdaten!$N$8,\"\")))))))","v":""},{"$f":"COUNTA(C5:G5)","v":0},{"$f":"IF(I5=1,Stammdaten!$O$4,IF(Hauptmaske!I5=2,Stammdaten!$O$5,IF(Hauptmaske!I5=3,Stammdaten!$O$6,IF(Hauptmaske!I5=4,Stammdaten!$O$7,IF(Hauptmaske!I5=5,Stammdaten!$O$8,\"\")))))","v":""}]
["02.",null,null,null,null,null,null,{"$f":"IF(Stammdaten!$C$9=0,\"\",IF(I6=4,Stammdaten!$C$9,\"\"))","v":""},null,"",{"$f":"IF(B6=\"\",\"\",IF(M6<>COUNTA(C6:G6),\"\",IF(I6=1,Hauptmaske!J6/Stammdaten!$N$4,IF(I6=2,Hauptmaske!J6/Stammdaten!$N$5,IF(I6=3,Hauptmaske!J6/Stammdaten!$N$6,IF(I6=4,Hauptmaske!J6/Stammdaten!$N$7,IF(I6=5,Hauptmaske!J6/Stammdaten!$N$8,\"\")))))))","v":""},{"$f":"COUNTA(C6:G6)","v":0},{"$f":"IF(I6=1,Stammdaten!$O$4,IF(Hauptmaske!I6=2,Stammdaten!$O$5,IF(Hauptmaske!I6=3,Stammdaten!$O$6,IF(Hauptmaske!I6=4,Stammdaten!$O$7,IF(Hauptmaske!I6=5,Stammdaten!$O$8,\"\")))))","v":""}]
["03.",null,null,null,null,null,null,{"$f":"IF(Stammdaten!$C$9=0,\"\",IF(I7=4,Stammdaten!$C$9,\"\"))","v":""},null,"",{"$f":"IF(B7=\"\",\"\",IF(M7<>COUNTA(C7:G7),\"\",IF(I7=1,Hauptmaske!J7/Stammdaten!$N$4,IF(I7=2,Hauptmaske!J7/Stammdaten!$N$5,IF(I7=3,Hauptmaske!J7/Stammdaten!$N$6,IF(I7=4,Hauptmaske!J7/Stammdaten!$N$7,IF(I7=5,Hauptmaske!J7/Stammdaten!$N$8,\"\")))))))","v":""},0,{"$f":"IF(I7=1,Stammdaten!$O$4,IF(Hauptmaske!I7=2,Stammdaten!$O$5,IF(Hauptmaske!I7=3,Stammdaten!$O$6,IF(Hauptmaske!I7=4,Stammdaten!$O$7,IF(Hauptmaske!I7=5,Stammdaten!$O$8,\"\")))))","v":""}]
["04.",null,null,null,null,null,null,{"$f":"IF(Stammdaten!$C$9=0,\"\",IF(I8=4,Stammdaten!$C$9,\"\"))","v":""},null,"",{"$f":"IF(B8=\"\",\"\",IF(M8<>COUNTA(C8:G8),\"\",IF(I8=1,Hauptmaske!J8/Stammdaten!$N$4,IF(I8=2,Hauptmaske!J8/Stammdaten!$N$5,IF(I8=3,Hauptmaske!J8/Stammdaten!$N$6,IF(I8=4,Hauptmaske!J8/Stammdaten!$N$7,IF(I8=5,Hauptmaske!J8/Stammdaten!$N$8,\"\")))))))","v":""},0,{"$f":"IF(I8=1,Stammdaten!$O$4,IF(Hauptmaske!I8=2,Stammdaten!$O$5,IF(Hauptmaske!I8=3,Stammdaten!$O$6,IF(Hauptmaske!I8=4,Stammdaten!$O$7,IF(Hauptmaske!I8=5,Stammdaten!$O$8,\"\")))))","v":""}]
["05.",null,null,null,null,null,null,{"$f":"IF(Stammdaten!$C$9=0,\"\",IF(I9=4,Stammdaten!$C$9,\"\"))","v":""},null,"",{"$f":"IF(B9=\"\",\"\",IF(M9<>COUNTA(C9:G9),\"\",IF(I9=1,Hauptmaske!J9/Stammdaten!$N$4,IF(I9=2,Hauptmaske!J9/Stammdaten!$N$5,IF(I9=3,Hauptmaske!J9/Stammdaten!$N$6,IF(I9=4,Hauptmaske!J9/Stammdaten!$N$7,IF(I9=5,Hauptmaske!J9/Stammdaten!$N$8,\"\")))))))","v":""},0,{"$f":"IF(I9=1,Stammdaten!$O$4,IF(Hauptmaske!I9=2,Stammdaten!$O$5,IF(Hauptmaske!I9=3,Stammdaten!$O$6,IF(Hauptmaske!I9=4,Stammdaten!$O$7,IF(Hauptmaske!I9=5,Stammdaten!$O$8,\"\")))))","v":""}]
["06.",null,null,null,null,null,null,{"$f":"IF(Stammdaten!$C$9=0,\"\",IF(I10=4,Stammdaten!$C$9,\"\"))","v":""},null,"",{"$f":"IF(B10=\"\",\"\",IF(M10<>COUNTA(C10:G10),\"\",IF(I10=1,Hauptmaske!J10/Stammdaten!$N$4,IF(I10=2,Hauptmaske!J10/Stammdaten!$N$5,IF(I10=3,Hauptmaske!J10/Stammdaten!$N$6,IF(I10=4,Hauptmaske!J10/Stammdaten!$N$7,IF(I10=5,Hauptmaske!J10/Stammdaten!$N$8,\"\")))))))","v":""},0,{"$f":"IF(I10=1,Stammdaten!$O$4,IF(Hauptmaske!I10=2,Stammdaten!$O$5,IF(Hauptmaske!I10=3,Stammdaten!$O$6,IF(Hauptmaske!I10=4,Stammdaten!$O$7,IF(Hauptmaske!I10=5,Stammdaten!$O$8,\"\")))))","v":""}]
["07.",null,null,null,null,null,null,{"$f":"IF(Stammdaten!$C$9=0,\"\",IF(I11=4,Stammdaten!$C$9,\"\"))","v":""},null,"",{"$f":"IF(B11=\"\",\"\",IF(M11<>COUNTA(C11:G11),\"\",IF(I11=1,Hauptmaske!J11/Stammdaten!$N$4,IF(I11=2,Hauptmaske!J11/Stammdaten!$N$5,IF(I11=3,Hauptmaske!J11/Stammdaten!$N$6,IF(I11=4,Hauptmaske!J11/Stammdaten!$N$7,IF(I11=5,Hauptmaske!J11/Stammdaten!$N$8,\"\")))))))","v":""},0,{"$f":"IF(I11=1,Stammdaten!$O$4,IF(Hauptmaske!I11=2,Stammdaten!$O$5,IF(Hauptmaske!I11=3,Stammdaten!$O$6,IF(Hauptmaske!I11=4,Stammdaten!$O$7,IF(Hauptmaske!I11=5,Stammdaten!$O$8,\"\")))))","v":""}]
["08.",null,null,null,null,null,null,{"$f":"IF(Stammdaten!$C$9=0,\"\",IF(I12=4,Stammdaten!$C$9,\"\"))","v":""},null,"",{"$f":"IF(B12=\"\",\"\",IF(M12<>COUNTA(C12:G12),\"\",IF(I12=1,Hauptmaske!J12/Stammdaten!$N$4,IF(I12=2,Hauptmaske!J12/Stammdaten!$N$5,IF(I12=3,Hauptmaske!J12/Stammdaten!$N$6,IF(I12=4,Hauptmaske!J12/Stammdaten!$N$7,IF(I12=5,Hauptmaske!J12/Stammdaten!$N$8,\"\")))))))","v":""},0,{"$f":"IF(I12=1,Stammdaten!$O$4,IF(Hauptmaske!I12=2,Stammdaten!$O$5,IF(Hauptmaske!I12=3,Stammdaten!$O$6,IF(Hauptmaske!I12=4,Stammdaten!$O$7,IF(Hauptmaske!I12=5,Stammdaten!$O$8,\"\")))))","v":""}]
["09.",null,null,null,null,null,null,{"$f":"IF(Stammdaten!$C$9=0,\"\",IF(I13=4,Stammdaten!$C$9,\"\"))","v":""},null,"",{"$f":"IF(B13=\"\",\"\",IF(M13<>COUNTA(C13:G13),\"\",IF(I13=1,Hauptmaske!J13/Stammdaten!$N$4,IF(I13=2,Hauptmaske!J13/Stammdaten!$N$5,IF(I13=3,Hauptmaske!J13/Stammdaten!$N$6,IF(I13=4,Hauptmaske!J13/Stammdaten!$N$7,IF(I13=5,Hauptmaske!J13/Stammdaten!$N$8,\"\")))))))","v":""},0,{"$f":"IF(I13=1,Stammdaten!$O$4,IF(Hauptmaske!I13=2,Stammdaten!$O$5,IF(Hauptmaske!I13=3,Stammdaten!$O$6,IF(Hauptmaske!I13=4,Stammdaten!$O$7,IF(Hauptmaske!I13=5,Stammdaten!$O$8,\"\")))))","v":""}]
["10.",null,null,null,null,null,null,{"$f":"IF(Stammdaten!$C$9=0,\"\",IF(I14=4,Stammdaten!$C$9,\"\"))","v":""},null,"",{"$f":"IF(B14=\"\",\"\",IF(M14<>COUNTA(C14:G14),\"\",IF(I14=1,Hauptmaske!J14/Stammdaten!$N$4,IF(I14=2,Hauptmaske!J14/Stammdaten!$N$5,IF(I14=3,Hauptmaske!J14/Stammdaten!$N$6,IF(I14=4,Hauptmaske!J14/Stammdaten!$N$7,IF(I14=5,Hauptmaske!J14/Stammdaten!$N$8,\"\")))))))","v":""},0,{"$f":"IF(I14=1,Stammdaten!$O$4,IF(Hauptmaske!I14=2,Stammdaten!$O$5,IF(Hauptmaske!I14=3,Stammdaten!$O$6,IF(Hauptmaske!I14=4,Stammdaten!$O$7,IF(Hauptmaske!I14=5,Stammdaten!$O$8,\"\")))))","v":""}]
["11.",null,null,null,null,null,null,{"$f":"IF(Stammdaten!$C$9=0,\"\",IF(I15=4,Stammdaten!$C$9,\"\"))","v":""},null,"",{"$f":"IF(B15=\"\",\"\",IF(M15<>COUNTA(C15:G15),\"\",IF(I15=1,Hauptmaske!J15/Stammdaten!$N$4,IF(I15=2,Hauptmaske!J15/Stammdaten!$N$5,IF(I15=3,Hauptmaske!J15/Stammdaten!$N$6,IF(I15=4,Hauptmaske!J15/Stammdaten!$N$7,IF(I15=5,Hauptmaske!J15/Stammdaten!$N$8,\"\")))))))","v":""},0,{"$f":"IF(I15=1,Stammdaten!$O$4,IF(Hauptmaske!I15=2,Stammdaten!$O$5,IF(Hauptmaske!I15=3,Stammdaten!$O$6,IF(Hauptmaske!I15=4,Stammdaten!$O$7,IF(Hauptmaske!I15=5,Stammdaten!$O$8,\"\")))))","v":""}]
["12.",null,null,null,null,null,null,{"$f":"IF(Stammdaten!$C$9=0,\"\",IF(I16=4,Stammdaten!$C$9,\"\"))","v":""},null,"",{"$f":"IF(B16=\"\",\"\",IF(M16<>COUNTA(C16:G16),\"\",IF(I16=1,Hauptmaske!J16/Stammdaten!$N$4,IF(I16=2,Hauptmaske!J16/Stammdaten!$N$5,IF(I16=3,Hauptmaske!J16/Stammdaten!$N$6,IF(I16=4,Hauptmaske!J16/Stammdaten!$N$7,IF(I16=5,Hauptmaske!J16/Stammdaten!$N$8,\"\")))))))","v":""},0,{"$f":"IF(I16=1,Stammdaten!$O$4,IF(Hauptmaske!I16=2,Stammdaten!$O$5,IF(Hauptmaske!I16=3,Stammdaten!$O$6,IF(Hauptmaske!I16=4,Stammdaten!$O$7,IF(Hauptmaske!I16=5,Stammdaten!$O$8,\"\")))))","v":""}]
["13.",null,null,null,null,null,null,{"$f":"IF(Stammdaten!$C$9=0,\"\",IF(I17=4,Stammdaten!$C$9,\"\"))","v":""},null,"",{"$f":"IF(B17=\"\",\"\",IF(M17<>COUNTA(C17:G17),\"\",IF(I17=1,Hauptmaske!J17/Stammdaten!$N$4,IF(I17=2,Hauptmaske!J17/Stammdaten!$N$5,IF(I17=3,Hauptmaske!J17/Stammdaten!$N$6,IF(I17=4,Hauptmaske!J17/Stammdaten!$N$7,IF(I17=5,Hauptmaske!J17/Stammdaten!$N$8,\"\")))))))","v":""},0,{"$f":"IF(I17=1,Stammdaten!$O$4,IF(Hauptmaske!I17=2,Stammdaten!$O$5,IF(Hauptmaske!I17=3,Stammdaten!$O$6,IF(Hauptmaske!I17=4,Stammdaten!$O$7,IF(Hauptmaske!I17=5,Stammdaten!$O$8,\"\")))))","v":""}]
["14.",null,null,null,null,null,null,{"$f":"IF(Stammdaten!$C$9=0,\"\",IF(I18=4,Stammdaten!$C$9,\"\"))","v":""},null,{"$f":"IF(SUM(C18:H18)=0,\"\",SUM(C18:H18))","v":""},{"$f":"IF(B18=\"\",\"\",IF(M18<>COUNTA(C18:G18),\"\",IF(I18=1,Hauptmaske!J18/Stammdaten!$N$4,IF(I18=2,Hauptmaske!J18/Stammdaten!$N$5,IF(I18=3,Hauptmaske!J18/Stammdaten!$N$6,IF(I18=4,Hauptmaske!J18/Stammdaten!$N$7,IF(I18=5,Hauptmaske!J18/Stammdaten!$N$8,\"\")))))))","v":""},0,{"$f":"IF(I18=1,Stammdaten!$O$4,IF(Hauptmaske!I18=2,Stammdaten!$O$5,IF(Hauptmaske!I18=3,Stammdaten!$O$6,IF(Hauptmaske!I18=4,Stammdaten!$O$7,IF(Hauptmaske!I18=5,Stammdaten!$O$8,\"\")))))","v":""}]
["15.",null,null,null,null,null,null,{"$f":"IF(Stammdaten!$C$9=0,\"\",IF(I19=4,Stammdaten!$C$9,\"\"))","v":""},null,"",{"$f":"IF(B19=\"\",\"\",IF(M19<>COUNTA(C19:G19),\"\",IF(I19=1,Hauptmaske!J19/Stammdaten!$N$4,IF(I19=2,Hauptmaske!J19/Stammdaten!$N$5,IF(I19=3,Hauptmaske!J19/Stammdaten!$N$6,IF(I19=4,Hauptmaske!J19/Stammdaten!$N$7,IF(I19=5,Hauptmaske!J19/Stammdaten!$N$8,\"\")))))))","v":""},0,{"$f":"IF(I19=1,Stammdaten!$O$4,IF(Hauptmaske!I19=2,Stammdaten!$O$5,IF(Hauptmaske!I19=3,Stammdaten!$O$6,IF(Hauptmaske!I19=4,Stammdaten!$O$7,IF(Hauptmaske!I19=5,Stammdaten!$O$8,\"\")))))","v":""}]
["16.",null,null,null,null,null,null,{"$f":"IF(Stammdaten!$C$9=0,\"\",IF(I20=4,Stammdaten!$C$9,\"\"))","v":""},null,"",{"$f":"IF(B20=\"\",\"\",IF(M20<>COUNTA(C20:G20),\"\",IF(I20=1,Hauptmaske!J20/Stammdaten!$N$4,IF(I20=2,Hauptmaske!J20/Stammdaten!$N$5,IF(I20=3,Hauptmaske!J20/Stammdaten!$N$6,IF(I20=4,Hauptmaske!J20/Stammdaten!$N$7,IF(I20=5,Hauptmaske!J20/Stammdaten!$N$8,\"\")))))))","v":""},0,{"$f":"IF(I20=1,Stammdaten!$O$4,IF(Hauptmaske!I20=2,Stammdaten!$O$5,IF(Hauptmaske!I20=3,Stammdaten!$O$6,IF(Hauptmaske!I20=4,Stammdaten!$O$7,IF(Hauptmaske!I20=5,Stammdaten!$O$8,\"\")))))","v":""}]
["17.",null,null,null,null,null,null,{"$f":"IF(Stammdaten!$C$9=0,\"\",IF(I21=4,Stammdaten!$C$9,\"\"))","v":""},null,"",{"$f":"IF(B21=\"\",\"\",IF(M21<>COUNTA(C21:G21),\"\",IF(I21=1,Hauptmaske!J21/Stammdaten!$N$4,IF(I21=2,Hauptmaske!J21/Stammdaten!$N$5,IF(I21=3,Hauptmaske!J21/Stammdaten!$N$6,IF(I21=4,Hauptmaske!J21/Stammdaten!$N$7,IF(I21=5,Hauptmaske!J21/Stammdaten!$N$8,\"\")))))))","v":""},0,{"$f":"IF(I21=1,Stammdaten!$O$4,IF(Hauptmaske!I21=2,Stammdaten!$O$5,IF(Hauptmaske!I21=3,Stammdaten!$O$6,IF(Hauptmaske!I21=4,Stammdaten!$O$7,IF(Hauptmaske!I21=5,Stammdaten!$O$8,\"\")))))","v":""}]
["18.",null,null,null,null,null,null,{"$f":"IF(Stammdaten!$C$9=0,\"\",IF(I22=4,Stammdaten!$C$9,\"\"))","v":""},null,"",{"$f":"IF(B22=\"\",\"\",IF(M22<>COUNTA(C22:G22),\"\",IF(I22=1,Hauptmaske!J22/Stammdaten!$N$4,IF(I22=2,Hauptmaske!J22/Stammdaten!$N$5,IF(I22=3,Hauptmaske!J22/Stammdaten!$N$6,IF(I22=4,Hauptmaske!J22/Stammdaten!$N$7,IF(I22=5,Hauptmaske!J22/Stammdaten!$N$8,\"\")))))))","v":""},0,{"$f":"IF(I22=1,Stammdaten!$O$4,IF(Hauptmaske!I22=2,Stammdaten!$O$5,IF(Hauptmaske!I22=3,Stammdaten!$O$6,IF(Hauptmaske!I22=4,Stammdaten!$O$7,IF(Hauptmaske!I22=5,Stammdaten!$O$8,\"\")))))","v":""}]
["19.",null,null,null,null,null,null,{"$f":"IF(Stammdaten!$C$9=0,\"\",IF(I23=4,Stammdaten!$C$9,\"\"))","v":""},null,"",{"$f":"IF(B23=\"\",\"\",IF(M23<>COUNTA(C23:G23),\"\",IF(I23=1,Hauptmaske!J23/Stammdaten!$N$4,IF(I23=2,Hauptmaske!J23/Stammdaten!$N$5,IF(I23=3,Hauptmaske!J23/Stammdaten!$N$6,IF(I23=4,Hauptmaske!J23/Stammdaten!$N$7,IF(I23=5,Hauptmaske!J23/Stammdaten!$N$8,\"\")))))))","v":""},0,{"$f":"IF(I23=1,Stammdaten!$O$4,IF(Hauptmaske!I23=2,Stammdaten!$O$5,IF(Hauptmaske!I23=3,Stammdaten!$O$6,IF(Hauptmaske!I23=4,Stammdaten!$O$7,IF(Hauptmaske!I23=5,Stammdaten!$O$8,\"\")))))","v":""}]
["20.",null,null,null,null,null,null,{"$f":"IF(Stammdaten!$C$9=0,\"\",IF(I24=4,Stammdaten!$C$9,\"\"))","v":""},null,"",{"$f":"IF(B24=\"\",\"\",IF(M24<>COUNTA(C24:G24),\"\",IF(I24=1,Hauptmaske!J24/Stammdaten!$N$4,IF(I24=2,Hauptmaske!J24/Stammdaten!$N$5,IF(I24=3,Hauptmaske!J24/Stammdaten!$N$6,IF(I24=4,Hauptmaske!J24/Stammdaten!$N$7,IF(I24=5,Hauptmaske!J24/Stammdaten!$N$8,\"\")))))))","v":""},0,{"$f":"IF(I24=1,Stammdaten!$O$4,IF(Hauptmaske!I24=2,Stammdaten!$O$5,IF(Hauptmaske!I24=3,Stammdaten!$O$6,IF(Hauptmaske!I24=4,Stammdaten!$O$7,IF(Hauptmaske!I24=5,Stammdaten!$O$8,\"\")))))","v":""}]
["21.",null,null,null,null,null,null,{"$f":"IF(Stammdaten!$C$9=0,\"\",IF(I25=4,Stammdaten!$C$9,\"\"))","v":""},null,"",{"$f":"IF(B25=\"\",\"\",IF(M25<>COUNTA(C25:G25),\"\",IF(I25=1,Hauptmaske!J25/Stammdaten!$N$4,IF(I25=2,Hauptmaske!J25/Stammdaten!$N$5,IF(I25=3,Hauptmaske!J25/Stammdaten!$N$6,IF(I25=4,Hauptmaske!J25/Stammdaten!$N$7,IF(I25=5,Hauptmaske!J25/Stammdaten!$N$8,\"\")))))))","v":""},0,{"$f":"IF(I25=1,Stammdaten!$O$4,IF(Hauptmaske!I25=2,Stammdaten!$O$5,IF(Hauptmaske!I25=3,Stammdaten!$O$6,IF(Hauptmaske!I25=4,Stammdaten!$O$7,IF(Hauptmaske!I25=5,Stammdaten!$O$8,\"\")))))","v":""}]
["22.",null,null,null,null,null,null,{"$f":"IF(Stammdaten!$C$9=0,\"\",IF(I26=4,Stammdaten!$C$9,\"\"))","v":""},null,"",{"$f":"IF(B26=\"\",\"\",IF(M26<>COUNTA(C26:G26),\"\",IF(I26=1,Hauptmaske!J26/Stammdaten!$N$4,IF(I26=2,Hauptmaske!J26/Stammdaten!$N$5,IF(I26=3,Hauptmaske!J26/Stammdaten!$N$6,IF(I26=4,Hauptmaske!J26/Stammdaten!$N$7,IF(I26=5,Hauptmaske!J26/Stammdaten!$N$8,\"\")))))))","v":""},0,{"$f":"IF(I26=1,Stammdaten!$O$4,IF(Hauptmaske!I26=2,Stammdaten!$O$5,IF(Hauptmaske!I26=3,Stammdaten!$O$6,IF(Hauptmaske!I26=4,Stammdaten!$O$7,IF(Hauptmaske!I26=5,Stammdaten!$O$8,\"\")))))","v":""}]
["23.",null,null,null,null,null,null,{"$f":"IF(Stammdaten!$C$9=0,\"\",IF(I27=4,Stammdaten!$C$9,\"\"))","v":""},null,"",{"$f":"IF(B27=\"\",\"\",IF(M27<>COUNTA(C27:G27),\"\",IF(I27=1,Hauptmaske!J27/Stammdaten!$N$4,IF(I27=2,Hauptmaske!J27/Stammdaten!$N$5,IF(I27=3,Hauptmaske!J27/Stammdaten!$N$6,IF(I27=4,Hauptmaske!J27/Stammdaten!$N$7,IF(I27=5,Hauptmaske!J27/Stammdaten!$N$8,\"\")))))))","v":""},0,{"$f":"IF(I27=1,Stammdaten!$O$4,IF(Hauptmaske!I27=2,Stammdaten!$O$5,IF(Hauptmaske!I27=3,Stammdaten!$O$6,IF(Hauptmaske!I27=4,Stammdaten!$O$7,IF(Hauptmaske!I27=5,Stammdaten!$O$8,\"\")))))","v":""}]
["24.",null,null,null,null,null,null,{"$f":"IF(Stammdaten!$C$9=0,\"\",IF(I28=4,Stammdaten!$C$9,\"\"))","v":""},null,"",{"$f":"IF(B28=\"\",\"\",IF(M28<>COUNTA(C28:G28),\"\",IF(I28=1,Hauptmaske!J28/Stammdaten!$N$4,IF(I28=2,Hauptmaske!J28/Stammdaten!$N$5,IF(I28=3,Hauptmaske!J28/Stammdaten!$N$6,IF(I28=4,Hauptmaske!J28/Stammdaten!$N$7,IF(I28=5,Hauptmaske!J28/Stammdaten!$N$8,\"\")))))))","v":""},0,{"$f":"IF(I28=1,Stammdaten!$O$4,IF(Hauptmaske!I28=2,Stammdaten!$O$5,IF(Hauptmaske!I28=3,Stammdaten!$O$6,IF(Hauptmaske!I28=4,Stammdaten!$O$7,IF(Hauptmaske!I28=5,Stammdaten!$O$8,\"\")))))","v":""}]
["25.",null,null,null,null,null,null,{"$f":"IF(Stammdaten!$C$9=0,\"\",IF(I29=4,Stammdaten!$C$9,\"\"))","v":""},null,"",{"$f":"IF(B29=\"\",\"\",IF(M29<>COUNTA(C29:G29),\"\",IF(I29=1,Hauptmaske!J29/Stammdaten!$N$4,IF(I29=2,Hauptmaske!J29/Stammdaten!$N$5,IF(I29=3,Hauptmaske!J29/Stammdaten!$N$6,IF(I29=4,Hauptmaske!J29/Stammdaten!$N$7,IF(I29=5,Hauptmaske!J29/Stammdaten!$N$8,\"\")))))))","v":""},0,{"$f":"IF(I29=1,Stammdaten!$O$4,IF(Hauptmaske!I29=2,Stammdaten!$O$5,IF(Hauptmaske!I29=3,Stammdaten!$O$6,IF(Hauptmaske!I29=4,Stammdaten!$O$7,IF(Hauptmaske!I29=5,Stammdaten!$O$8,\"\")))))","v":""}]
["26.",null,null,null,null,null,null,{"$f":"IF(Stammdaten!$C$9=0,\"\",IF(I30=4,Stammdaten!$C$9,\"\"))","v":""},null,"",{"$f":"IF(B30=\"\",\"\",IF(M30<>COUNTA(C30:G30),\"\",IF(I30=1,Hauptmaske!J30/Stammdaten!$N$4,IF(I30=2,Hauptmaske!J30/Stammdaten!$N$5,IF(I30=3,Hauptmaske!J30/Stammdaten!$N$6,IF(I30=4,Hauptmaske!J30/Stammdaten!$N$7,IF(I30=5,Hauptmaske!J30/Stammdaten!$N$8,\"\")))))))","v":""},0,{"$f":"IF(I30=1,Stammdaten!$O$4,IF(Hauptmaske!I30=2,Stammdaten!$O$5,IF(Hauptmaske!I30=3,Stammdaten!$O$6,IF(Hauptmaske!I30=4,Stammdaten!$O$7,IF(Hauptmaske!I30=5,Stammdaten!$O$8,\"\")))))","v":""}]
["27.",null,null,null,null,null,null,{"$f":"IF(Stammdaten!$C$9=0,\"\",IF(I31=4,Stammdaten!$C$9,\"\"))","v":""},null,"",{"$f":"IF(B31=\"\",\"\",IF(M31<>COUNTA(C31:G31),\"\",IF(I31=1,Hauptmaske!J31/Stammdaten!$N$4,IF(I31=2,Hauptmaske!J31/Stammdaten!$N$5,IF(I31=3,Hauptmaske!J31/Stammdaten!$N$6,IF(I31=4,Hauptmaske!J31/Stammdaten!$N$7,IF(I31=5,Hauptmaske!J31/Stammdaten!$N$8,\"\")))))))","v":""},0,{"$f":"IF(I31=1,Stammdaten!$O$4,IF(Hauptmaske!I31=2,Stammdaten!$O$5,IF(Hauptmaske!I31=3,Stammdaten!$O$6,IF(Hauptmaske!I31=4,Stammdaten!$O$7,IF(Hauptmaske!I31=5,Stammdaten!$O$8,\"\")))))","v":""}]
["28.",null,null,null,null,null,null,{"$f":"IF(Stammdaten!$C$9=0,\"\",IF(I32=4,Stammdaten!$C$9,\"\"))","v":""},null,"",{"$f":"IF(B32=\"\",\"\",IF(M32<>COUNTA(C32:G32),\"\",IF(I32=1,Hauptmaske!J32/Stammdaten!$N$4,IF(I32=2,Hauptmaske!J32/Stammdaten!$N$5,IF(I32=3,Hauptmaske!J32/Stammdaten!$N$6,IF(I32=4,Hauptmaske!J32/Stammdaten!$N$7,IF(I32=5,Hauptmaske!J32/Stammdaten!$N$8,\"\")))))))","v":""},0,{"$f":"IF(I32=1,Stammdaten!$O$4,IF(Hauptmaske!I32=2,Stammdaten!$O$5,IF(Hauptmaske!I32=3,Stammdaten!$O$6,IF(Hauptmaske!I32=4,Stammdaten!$O$7,IF(Hauptmaske!I32=5,Stammdaten!$O$8,\"\")))))","v":""}]
["29.",null,null,null,null,null,null,{"$f":"IF(Stammdaten!$C$9=0,\"\",IF(I33=4,Stammdaten!$C$9,\"\"))","v":""},null,"",{"$f":"IF(B33=\"\",\"\",IF(M33<>COUNTA(C33:G33),\"\",IF(I33=1,Hauptmaske!J33/Stammdaten!$N$4,IF(I33=2,Hauptmaske!J33/Stammdaten!$N$5,IF(I33=3,Hauptmaske!J33/Stammdaten!$N$6,IF(I33=4,Hauptmaske!J33/Stammdaten!$N$7,IF(I33=5,Hauptmaske!J33/Stammdaten!$N$8,\"\")))))))","v":""},0,{"$f":"IF(I33=1,Stammdaten!$O$4,IF(Hauptmaske!I33=2,Stammdaten!$O$5,IF(Hauptmaske!I33=3,Stammdaten!$O$6,IF(Hauptmaske!I33=4,Stammdaten!$O$7,IF(Hauptmaske!I33=5,Stammdaten!$O$8,\"\")))))","v":""}]
["30.",null,null,null,null,null,null,{"$f":"IF(Stammdaten!$C$9=0,\"\",IF(I34=4,Stammdaten!$C$9,\"\"))","v":""},null,"",{"$f":"IF(B34=\"\",\"\",IF(M34<>COUNTA(C34:G34),\"\",IF(I34=1,Hauptmaske!J34/Stammdaten!$N$4,IF(I34=2,Hauptmaske!J34/Stammdaten!$N$5,IF(I34=3,Hauptmaske!J34/Stammdaten!$N$6,IF(I34=4,Hauptmaske!J34/Stammdaten!$N$7,IF(I34=5,Hauptmaske!J34/Stammdaten!$N$8,\"\")))))))","v":""},0,{"$f":"IF(I34=1,Stammdaten!$O$4,IF(Hauptmaske!I34=2,Stammdaten!$O$5,IF(Hauptmaske!I34=3,Stammdaten!$O$6,IF(Hauptmaske!I34=4,Stammdaten!$O$7,IF(Hauptmaske!I34=5,Stammdaten!$O$8,\"\")))))","v":""}]
["31.",null,null,null,null,null,null,{"$f":"IF(Stammdaten!$C$9=0,\"\",IF(I35=4,Stammdaten!$C$9,\"\"))","v":""},null,{"$f":"IF(SUM(C35:H35)=0,\"\",SUM(C35:H35))","v":""},{"$f":"IF(B35=\"\",\"\",IF(M35<>COUNTA(C35:G35),\"\",IF(I35=1,Hauptmaske!J35/Stammdaten!$N$4,IF(I35=2,Hauptmaske!J35/Stammdaten!$N$5,IF(I35=3,Hauptmaske!J35/Stammdaten!$N$6,IF(I35=4,Hauptmaske!J35/Stammdaten!$N$7,IF(I35=5,Hauptmaske!J35/Stammdaten!$N$8,\"\")))))))","v":""},null,{"$f":"IF(I35=1,Stammdaten!$O$4,IF(Hauptmaske!I35=2,Stammdaten!$O$5,IF(Hauptmaske!I35=3,Stammdaten!$O$6,IF(Hauptmaske!I35=4,Stammdaten!$O$7,IF(Hauptmaske!I35=5,Stammdaten!$O$8,\"\")))))","v":""}]
["32.",null,null,null,null,null,null,{"$f":"IF(Stammdaten!$C$9=0,\"\",IF(I36=4,Stammdaten!$C$9,\"\"))","v":""},null,"",{"$f":"IF(B36=\"\",\"\",IF(M36<>COUNTA(C36:G36),\"\",IF(I36=1,Hauptmaske!J36/Stammdaten!$N$4,IF(I36=2,Hauptmaske!J36/Stammdaten!$N$5,IF(I36=3,Hauptmaske!J36/Stammdaten!$N$6,IF(I36=4,Hauptmaske!J36/Stammdaten!$N$7,IF(I36=5,Hauptmaske!J36/Stammdaten!$N$8,\"\")))))))","v":""},null,{"$f":"IF(I36=1,Stammdaten!$O$4,IF(Hauptmaske!I36=2,Stammdaten!$O$5,IF(Hauptmaske!I36=3,Stammdaten!$O$6,IF(Hauptmaske!I36=4,Stammdaten!$O$7,IF(Hauptmaske!I36=5,Stammdaten!$O$8,\"\")))))","v":""}]
["33.",null,null,null,null,null,null,{"$f":"IF(Stammdaten!$C$9=0,\"\",IF(I37=4,Stammdaten!$C$9,\"\"))","v":""},null,"",{"$f":"IF(B37=\"\",\"\",IF(M37<>COUNTA(C37:G37),\"\",IF(I37=1,Hauptmaske!J37/Stammdaten!$N$4,IF(I37=2,Hauptmaske!J37/Stammdaten!$N$5,IF(I37=3,Hauptmaske!J37/Stammdaten!$N$6,IF(I37=4,Hauptmaske!J37/Stammdaten!$N$7,IF(I37=5,Hauptmaske!J37/Stammdaten!$N$8,\"\")))))))","v":""},null,{"$f":"IF(I37=1,Stammdaten!$O$4,IF(Hauptmaske!I37=2,Stammdaten!$O$5,IF(Hauptmaske!I37=3,Stammdaten!$O$6,IF(Hauptmaske!I37=4,Stammdaten!$O$7,IF(Hauptmaske!I37=5,Stammdaten!$O$8,\"\")))))","v":""}]
["34.",null,null,null,null,null,null,{"$f":"IF(Stammdaten!$C$9=0,\"\",IF(I38=4,Stammdaten!$C$9,\"\"))","v":""},null,"",{"$f":"IF(B38=\"\",\"\",IF(M38<>COUNTA(C38:G38),\"\",IF(I38=1,Hauptmaske!J38/Stammdaten!$N$4,IF(I38=2,Hauptmaske!J38/Stammdaten!$N$5,IF(I38=3,Hauptmaske!J38/Stammdaten!$N$6,IF(I38=4,Hauptmaske!J38/Stammdaten!$N$7,IF(I38=5,Hauptmaske!J38/Stammdaten!$N$8,\"\")))))))","v":""},null,{"$f":"IF(I38=1,Stammdaten!$O$4,IF(Hauptmaske!I38=2,Stammdaten!$O$5,IF(Hauptmaske!I38=3,Stammdaten!$O$6,IF(Hauptmaske!I38=4,Stammdaten!$O$7,IF(Hauptmaske!I38=5,Stammdaten!$O$8,\"\")))))","v":""}]
["35.",null,null,null,null,null,null,{"$f":"IF(Stammdaten!$C$9=0,\"\",IF(I39=4,Stammdaten!$C$9,\"\"))","v":""},null,"",{"$f":"IF(B39=\"\",\"\",IF(M39<>COUNTA(C39:G39),\"\",IF(I39=1,Hauptmaske!J39/Stammdaten!$N$4,IF(I39=2,Hauptmaske!J39/Stammdaten!$N$5,IF(I39=3,Hauptmaske!J39/Stammdaten!$N$6,IF(I39=4,Hauptmaske!J39/Stammdaten!$N$7,IF(I39=5,Hauptmaske!J39/Stammdaten!$N$8,\"\")))))))","v":""},null,{"$f":"IF(I39=1,Stammdaten!$O$4,IF(Hauptmaske!I39=2,Stammdaten!$O$5,IF(Hauptmaske!I39=3,Stammdaten!$O$6,IF(Hauptmaske!I39=4,Stammdaten!$O$7,IF(Hauptmaske!I39=5,Stammdaten!$O$8,\"\")))))","v":""}]
["36.",null,null,null,null,null,null,{"$f":"IF(Stammdaten!$C$9=0,\"\",IF(I40=4,Stammdaten!$C$9,\"\"))","v":""},null,"",{"$f":"IF(B40=\"\",\"\",IF(M40<>COUNTA(C40:G40),\"\",IF(I40=1,Hauptmaske!J40/Stammdaten!$N$4,IF(I40=2,Hauptmaske!J40/Stammdaten!$N$5,IF(I40=3,Hauptmaske!J40/Stammdaten!$N$6,IF(I40=4,Hauptmaske!J40/Stammdaten!$N$7,IF(I40=5,Hauptmaske!J40/Stammdaten!$N$8,\"\")))))))","v":""},null,{"$f":"IF(I40=1,Stammdaten!$O$4,IF(Hauptmaske!I40=2,Stammdaten!$O$5,IF(Hauptmaske!I40=3,Stammdaten!$O$6,IF(Hauptmaske!I40=4,Stammdaten!$O$7,IF(Hauptmaske!I40=5,Stammdaten!$O$8,\"\")))))","v":""}]
["37.",null,null,null,null,null,null,{"$f":"IF(Stammdaten!$C$9=0,\"\",IF(I41=4,Stammdaten!$C$9,\"\"))","v":""},null,"",{"$f":"IF(B41=\"\",\"\",IF(M41<>COUNTA(C41:G41),\"\",IF(I41=1,Hauptmaske!J41/Stammdaten!$N$4,IF(I41=2,Hauptmaske!J41/Stammdaten!$N$5,IF(I41=3,Hauptmaske!J41/Stammdaten!$N$6,IF(I41=4,Hauptmaske!J41/Stammdaten!$N$7,IF(I41=5,Hauptmaske!J41/Stammdaten!$N$8,\"\")))))))","v":""},null,{"$f":"IF(I41=1,Stammdaten!$O$4,IF(Hauptmaske!I41=2,Stammdaten!$O$5,IF(Hauptmaske!I41=3,Stammdaten!$O$6,IF(Hauptmaske!I41=4,Stammdaten!$O$7,IF(Hauptmaske!I41=5,Stammdaten!$O$8,\"\")))))","v":""}]
["38.",null,null,null,null,null,null,{"$f":"IF(Stammdaten!$C$9=0,\"\",IF(I42=4,Stammdaten!$C$9,\"\"))","v":""},null,"",{"$f":"IF(B42=\"\",\"\",IF(M42<>COUNTA(C42:G42),\"\",IF(I42=1,Hauptmaske!J42/Stammdaten!$N$4,IF(I42=2,Hauptmaske!J42/Stammdaten!$N$5,IF(I42=3,Hauptmaske!J42/Stammdaten!$N$6,IF(I42=4,Hauptmaske!J42/Stammdaten!$N$7,IF(I42=5,Hauptmaske!J42/Stammdaten!$N$8,\"\")))))))","v":""},null,{"$f":"IF(I42=1,Stammdaten!$O$4,IF(Hauptmaske!I42=2,Stammdaten!$O$5,IF(Hauptmaske!I42=3,Stammdaten!$O$6,IF(Hauptmaske!I42=4,Stammdaten!$O$7,IF(Hauptmaske!I42=5,Stammdaten!$O$8,\"\")))))","v":""}]
["39.",null,null,null,null,null,null,{"$f":"IF(Stammdaten!$C$9=0,\"\",IF(I43=4,Stammdaten!$C$9,\"\"))","v":""},null,"",{"$f":"IF(B43=\"\",\"\",IF(M43<>COUNTA(C43:G43),\"\",IF(I43=1,Hauptmaske!J43/Stammdaten!$N$4,IF(I43=2,Hauptmaske!J43/Stammdaten!$N$5,IF(I43=3,Hauptmaske!J43/Stammdaten!$N$6,IF(I43=4,Hauptmaske!J43/Stammdaten!$N$7,IF(I43=5,Hauptmaske!J43/Stammdaten!$N$8,\"\")))))))","v":""},null,{"$f":"IF(I43=1,Stammdaten!$O$4,IF(Hauptmaske!I43=2,Stammdaten!$O$5,IF(Hauptmaske!I43=3,Stammdaten!$O$6,IF(Hauptmaske!I43=4,Stammdaten!$O$7,IF(Hauptmaske!I43=5,Stammdaten!$O$8,\"\")))))","v":""}]
["40.",null,null,null,null,null,null,{"$f":"IF(Stammdaten!$C$9=0,\"\",IF(I44=4,Stammdaten!$C$9,\"\"))","v":""},null,"",{"$f":"IF(B44=\"\",\"\",IF(M44<>COUNTA(C44:G44),\"\",IF(I44=1,Hauptmaske!J44/Stammdaten!$N$4,IF(I44=2,Hauptmaske!J44/Stammdaten!$N$5,IF(I44=3,Hauptmaske!J44/Stammdaten!$N$6,IF(I44=4,Hauptmaske!J44/Stammdaten!$N$7,IF(I44=5,Hauptmaske!J44/Stammdaten!$N$8,\"\")))))))","v":""},null,{"$f":"IF(I44=1,Stammdaten!$O$4,IF(Hauptmaske!I44=2,Stammdaten!$O$5,IF(Hauptmaske!I44=3,Stammdaten!$O$6,IF(Hauptmaske!I44=4,Stammdaten!$O$7,IF(Hauptmaske!I44=5,Stammdaten!$O$8,\"\")))))","v":""}]
["41.",null,null,null,null,null,null,{"$f":"IF(Stammdaten!$C$9=0,\"\",IF(I45=4,Stammdaten!$C$9,\"\"))","v":""},null,"",{"$f":"IF(B45=\"\",\"\",IF(M45<>COUNTA(C45:G45),\"\",IF(I45=1,Hauptmaske!J45/Stammdaten!$N$4,IF(I45=2,Hauptmaske!J45/Stammdaten!$N$5,IF(I45=3,Hauptmaske!J45/Stammdaten!$N$6,IF(I45=4,Hauptmaske!J45/Stammdaten!$N$7,IF(I45=5,Hauptmaske!J45/Stammdaten!$N$8,\"\")))))))","v":""},null,{"$f":"IF(I45=1,Stammdaten!$O$4,IF(Hauptmaske!I45=2,Stammdaten!$O$5,IF(Hauptmaske!I45=3,Stammdaten!$O$6,IF(Hauptmaske!I45=4,Stammdaten!$O$7,IF(Hauptmaske!I45=5,Stammdaten!$O$8,\"\")))))","v":""}]
["42.",null,null,null,null,null,null,{"$f":"IF(Stammdaten!$C$9=0,\"\",IF(I46=4,Stammdaten!$C$9,\"\"))","v":""},null,"",{"$f":"IF(B46=\"\",\"\",IF(M46<>COUNTA(C46:G46),\"\",IF(I46=1,Hauptmaske!J46/Stammdaten!$N$4,IF(I46=2,Hauptmaske!J46/Stammdaten!$N$5,IF(I46=3,Hauptmaske!J46/Stammdaten!$N$6,IF(I46=4,Hauptmaske!J46/Stammdaten!$N$7,IF(I46=5,Hauptmaske!J46/Stammdaten!$N$8,\"\")))))))","v":""},null,{"$f":"IF(I46=1,Stammdaten!$O$4,IF(Hauptmaske!I46=2,Stammdaten!$O$5,IF(Hauptmaske!I46=3,Stammdaten!$O$6,IF(Hauptmaske!I46=4,Stammdaten!$O$7,IF(Hauptmaske!I46=5,Stammdaten!$O$8,\"\")))))","v":""}]
["43.",null,null,null,null,null,null,{"$f":"IF(Stammdaten!$C$9=0,\"\",IF(I47=4,Stammdaten!$C$9,\"\"))","v":""},null,"",{"$f":"IF(B47=\"\",\"\",IF(M47<>COUNTA(C47:G47),\"\",IF(I47=1,Hauptmaske!J47/Stammdaten!$N$4,IF(I47=2,Hauptmaske!J47/Stammdaten!$N$5,IF(I47=3,Hauptmaske!J47/Stammdaten!$N$6,IF(I47=4,Hauptmaske!J47/Stammdaten!$N$7,IF(I47=5,Hauptmaske!J47/Stammdaten!$N$8,\"\")))))))","v":""},null,{"$f":"IF(I47=1,Stammdaten!$O$4,IF(Hauptmaske!I47=2,Stammdaten!$O$5,IF(Hauptmaske!I47=3,Stammdaten!$O$6,IF(Hauptmaske!I47=4,Stammdaten!$O$7,IF(Hauptmaske!I47=5,Stammdaten!$O$8,\"\")))))","v":""}]
["44.",null,null,null,null,null,null,{"$f":"IF(Stammdaten!$C$9=0,\"\",IF(I48=4,Stammdaten!$C$9,\"\"))","v":""},null,"",{"$f":"IF(B48=\"\",\"\",IF(M48<>COUNTA(C48:G48),\"\",IF(I48=1,Hauptmaske!J48/Stammdaten!$N$4,IF(I48=2,Hauptmaske!J48/Stammdaten!$N$5,IF(I48=3,Hauptmaske!J48/Stammdaten!$N$6,IF(I48=4,Hauptmaske!J48/Stammdaten!$N$7,IF(I48=5,Hauptmaske!J48/Stammdaten!$N$8,\"\")))))))","v":""},null,{"$f":"IF(I48=1,Stammdaten!$O$4,IF(Hauptmaske!I48=2,Stammdaten!$O$5,IF(Hauptmaske!I48=3,Stammdaten!$O$6,IF(Hauptmaske!I48=4,Stammdaten!$O$7,IF(Hauptmaske!I48=5,Stammdaten!$O$8,\"\")))))","v":""}]
["45.",null,null,null,null,null,null,{"$f":"IF(Stammdaten!$C$9=0,\"\",IF(I49=4,Stammdaten!$C$9,\"\"))","v":""},null,"",{"$f":"IF(B49=\"\",\"\",IF(M49<>COUNTA(C49:G49),\"\",IF(I49=1,Hauptmaske!J49/Stammdaten!$N$4,IF(I49=2,Hauptmaske!J49/Stammdaten!$N$5,IF(I49=3,Hauptmaske!J49/Stammdaten!$N$6,IF(I49=4,Hauptmaske!J49/Stammdaten!$N$7,IF(I49=5,Hauptmaske!J49/Stammdaten!$N$8,\"\")))))))","v":""},null,{"$f":"IF(I49=1,Stammdaten!$O$4,IF(Hauptmaske!I49=2,Stammdaten!$O$5,IF(Hauptmaske!I49=3,Stammdaten!$O$6,IF(Hauptmaske!I49=4,Stammdaten!$O$7,IF(Hauptmaske!I49=5,Stammdaten!$O$8,\"\")))))","v":""}]
["46.",null,null,null,null,null,null,{"$f":"IF(Stammdaten!$C$9=0,\"\",IF(I50=4,Stammdaten!$C$9,\"\"))","v":""},null,"",{"$f":"IF(B50=\"\",\"\",IF(M50<>COUNTA(C50:G50),\"\",IF(I50=1,Hauptmaske!J50/Stammdaten!$N$4,IF(I50=2,Hauptmaske!J50/Stammdaten!$N$5,IF(I50=3,Hauptmaske!J50/Stammdaten!$N$6,IF(I50=4,Hauptmaske!J50/Stammdaten!$N$7,IF(I50=5,Hauptmaske!J50/Stammdaten!$N$8,\"\")))))))","v":""},null,{"$f":"IF(I50=1,Stammdaten!$O$4,IF(Hauptmaske!I50=2,Stammdaten!$O$5,IF(Hauptmaske!I50=3,Stammdaten!$O$6,IF(Hauptmaske!I50=4,Stammdaten!$O$7,IF(Hauptmaske!I50=5,Stammdaten!$O$8,\"\")))))","v":""}]
["47.",null,null,null,null,null,null,{"$f":"IF(Stammdaten!$C$9=0,\"\",IF(I51=4,Stammdaten!$C$9,\"\"))","v":""},null,"",{"$f":"IF(B51=\"\",\"\",IF(M51<>COUNTA(C51:G51),\"\",IF(I51=1,Hauptmaske!J51/Stammdaten!$N$4,IF(I51=2,Hauptmaske!J51/Stammdaten!$N$5,IF(I51=3,Hauptmaske!J51/Stammdaten!$N$6,IF(I51=4,Hauptmaske!J51/Stammdaten!$N$7,IF(I51=5,Hauptmaske!J51/Stammdaten!$N$8,\"\")))))))","v":""},null,{"$f":"IF(I51=1,Stammdaten!$O$4,IF(Hauptmaske!I51=2,Stammdaten!$O$5,IF(Hauptmaske!I51=3,Stammdaten!$O$6,IF(Hauptmaske!I51=4,Stammdaten!$O$7,IF(Hauptmaske!I51=5,Stammdaten!$O$8,\"\")))))","v":""}]
["48.",null,null,null,null,null,null,{"$f":"IF(Stammdaten!$C$9=0,\"\",IF(I52=4,Stammdaten!$C$9,\"\"))","v":""},null,"",{"$f":"IF(B52=\"\",\"\",IF(M52<>COUNTA(C52:G52),\"\",IF(I52=1,Hauptmaske!J52/Stammdaten!$N$4,IF(I52=2,Hauptmaske!J52/Stammdaten!$N$5,IF(I52=3,Hauptmaske!J52/Stammdaten!$N$6,IF(I52=4,Hauptmaske!J52/Stammdaten!$N$7,IF(I52=5,Hauptmaske!J52/Stammdaten!$N$8,\"\")))))))","v":""},null,{"$f":"IF(I52=1,Stammdaten!$O$4,IF(Hauptmaske!I52=2,Stammdaten!$O$5,IF(Hauptmaske!I52=3,Stammdaten!$O$6,IF(Hauptmaske!I52=4,Stammdaten!$O$7,IF(Hauptmaske!I52=5,Stammdaten!$O$8,\"\")))))","v":""}]
["49.",null,null,null,null,null,null,{"$f":"IF(Stammdaten!$C$9=0,\"\",IF(I53=4,Stammdaten!$C$9,\"\"))","v":""},null,"",{"$f":"IF(B53=\"\",\"\",IF(M53<>COUNTA(C53:G53),\"\",IF(I53=1,Hauptmaske!J53/Stammdaten!$N$4,IF(I53=2,Hauptmaske!J53/Stammdaten!$N$5,IF(I53=3,Hauptmaske!J53/Stammdaten!$N$6,IF(I53=4,Hauptmaske!J53/Stammdaten!$N$7,IF(I53=5,Hauptmaske!J53/Stammdaten!$N$8,\"\")))))))","v":""},null,{"$f":"IF(I53=1,Stammdaten!$O$4,IF(Hauptmaske!I53=2,Stammdaten!$O$5,IF(Hauptmaske!I53=3,Stammdaten!$O$6,IF(Hauptmaske!I53=4,Stammdaten!$O$7,IF(Hauptmaske!I53=5,Stammdaten!$O$8,\"\")))))","v":""}]
["50.",null,null,null,null,null,null,{"$f":"IF(Stammdaten!$C$9=0,\"\",IF(I54=4,Stammdaten!$C$9,\"\"))","v":""},null,"",{"$f":"IF(B54=\"\",\"\",IF(M54<>COUNTA(C54:G54),\"\",IF(I54=1,Hauptmaske!J54/Stammdaten!$N$4,IF(I54=2,Hauptmaske!J54/Stammdaten!$N$5,IF(I54=3,Hauptmaske!J54/Stammdaten!$N$6,IF(I54=4,Hauptmaske!J54/Stammdaten!$N$7,IF(I54=5,Hauptmaske!J54/Stammdaten!$N$8,\"\")))))))","v":""},null,{"$f":"IF(I54=1,Stammdaten!$O$4,IF(Hauptmaske!I54=2,Stammdaten!$O$5,IF(Hauptmaske!I54=3,Stammdaten!$O$6,IF(Hauptmaske!I54=4,Stammdaten!$O$7,IF(Hauptmaske!I54=5,Stammdaten!$O$8,\"\")))))","v":""}]
["51.",null,null,null,null,null,null,{"$f":"IF(Stammdaten!$C$9=0,\"\",IF(I55=4,Stammdaten!$C$9,\"\"))","v":""},null,"",{"$f":"IF(B55=\"\",\"\",IF(M55<>COUNTA(C55:G55),\"\",IF(I55=1,Hauptmaske!J55/Stammdaten!$N$4,IF(I55=2,Hauptmaske!J55/Stammdaten!$N$5,IF(I55=3,Hauptmaske!J55/Stammdaten!$N$6,IF(I55=4,Hauptmaske!J55/Stammdaten!$N$7,IF(I55=5,Hauptmaske!J55/Stammdaten!$N$8,\"\")))))))","v":""},null,{"$f":"IF(I55=1,Stammdaten!$O$4,IF(Hauptmaske!I55=2,Stammdaten!$O$5,IF(Hauptmaske!I55=3,Stammdaten!$O$6,IF(Hauptmaske!I55=4,Stammdaten!$O$7,IF(Hauptmaske!I55=5,Stammdaten!$O$8,\"\")))))","v":""}]
["52.",null,null,null,null,null,null,{"$f":"IF(Stammdaten!$C$9=0,\"\",IF(I56=4,Stammdaten!$C$9,\"\"))","v":""},null,"",{"$f":"IF(B56=\"\",\"\",IF(M56<>COUNTA(C56:G56),\"\",IF(I56=1,Hauptmaske!J56/Stammdaten!$N$4,IF(I56=2,Hauptmaske!J56/Stammdaten!$N$5,IF(I56=3,Hauptmaske!J56/Stammdaten!$N$6,IF(I56=4,Hauptmaske!J56/Stammdaten!$N$7,IF(I56=5,Hauptmaske!J56/Stammdaten!$N$8,\"\")))))))","v":""},null,{"$f":"IF(I56=1,Stammdaten!$O$4,IF(Hauptmaske!I56=2,Stammdaten!$O$5,IF(Hauptmaske!I56=3,Stammdaten!$O$6,IF(Hauptmaske!I56=4,Stammdaten!$O$7,IF(Hauptmaske!I56=5,Stammdaten!$O$8,\"\")))))","v":""}]
["53.",null,null,null,null,null,null,{"$f":"IF(Stammdaten!$C$9=0,\"\",IF(I57=4,Stammdaten!$C$9,\"\"))","v":""},null,"",{"$f":"IF(B57=\"\",\"\",IF(M57<>COUNTA(C57:G57),\"\",IF(I57=1,Hauptmaske!J57/Stammdaten!$N$4,IF(I57=2,Hauptmaske!J57/Stammdaten!$N$5,IF(I57=3,Hauptmaske!J57/Stammdaten!$N$6,IF(I57=4,Hauptmaske!J57/Stammdaten!$N$7,IF(I57=5,Hauptmaske!J57/Stammdaten!$N$8,\"\")))))))","v":""},null,{"$f":"IF(I57=1,Stammdaten!$O$4,IF(Hauptmaske!I57=2,Stammdaten!$O$5,IF(Hauptmaske!I57=3,Stammdaten!$O$6,IF(Hauptmaske!I57=4,Stammdaten!$O$7,IF(Hauptmaske!I57=5,Stammdaten!$O$8,\"\")))))","v":""}]
["54.",null,null,null,null,null,null,{"$f":"IF(Stammdaten!$C$9=0,\"\",IF(I58=4,Stammdaten!$C$9,\"\"))","v":""},null,"",{"$f":"IF(B58=\"\",\"\",IF(M58<>COUNTA(C58:G58),\"\",IF(I58=1,Hauptmaske!J58/Stammdaten!$N$4,IF(I58=2,Hauptmaske!J58/Stammdaten!$N$5,IF(I58=3,Hauptmaske!J58/Stammdaten!$N$6,IF(I58=4,Hauptmaske!J58/Stammdaten!$N$7,IF(I58=5,Hauptmaske!J58/Stammdaten!$N$8,\"\")))))))","v":""},null,{"$f":"IF(I58=1,Stammdaten!$O$4,IF(Hauptmaske!I58=2,Stammdaten!$O$5,IF(Hauptmaske!I58=3,Stammdaten!$O$6,IF(Hauptmaske!I58=4,Stammdaten!$O$7,IF(Hauptmaske!I58=5,Stammdaten!$O$8,\"\")))))","v":""}]
["55.",null,null,null,null,null,null,{"$f":"IF(Stammdaten!$C$9=0,\"\",IF(I59=4,Stammdaten!$C$9,\"\"))","v":""},null,"",{"$f":"IF(B59=\"\",\"\",IF(M59<>COUNTA(C59:G59),\"\",IF(I59=1,Hauptmaske!J59/Stammdaten!$N$4,IF(I59=2,Hauptmaske!J59/Stammdaten!$N$5,IF(I59=3,Hauptmaske!J59/Stammdaten!$N$6,IF(I59=4,Hauptmaske!J59/Stammdaten!$N$7,IF(I59=5,Hauptmaske!J59/Stammdaten!$N$8,\"\")))))))","v":""},null,{"$f":"IF(I59=1,Stammdaten!$O$4,IF(Hauptmaske!I59=2,Stammdaten!$O$5,IF(Hauptmaske!I59=3,Stammdaten!$O$6,IF(Hauptmaske!I59=4,Stammdaten!$O$7,IF(Hauptmaske!I59=5,Stammdaten!$O$8,\"\")))))","v":""}]
["56.",null,null,null,null,null,null,{"$f":"IF(Stammdaten!$C$9=0,\"\",IF(I60=4,Stammdaten!$C$9,\"\"))","v":""},null,"",{"$f":"IF(B60=\"\",\"\",IF(M60<>COUNTA(C60:G60),\"\",IF(I60=1,Hauptmaske!J60/Stammdaten!$N$4,IF(I60=2,Hauptmaske!J60/Stammdaten!$N$5,IF(I60=3,Hauptmaske!J60/Stammdaten!$N$6,IF(I60=4,Hauptmaske!J60/Stammdaten!$N$7,IF(I60=5,Hauptmaske!J60/Stammdaten!$N$8,\"\")))))))","v":""},null,{"$f":"IF(I60=1,Stammdaten!$O$4,IF(Hauptmaske!I60=2,Stammdaten!$O$5,IF(Hauptmaske!I60=3,Stammdaten!$O$6,IF(Hauptmaske!I60=4,Stammdaten!$O$7,IF(Hauptmaske!I60=5,Stammdaten!$O$8,\"\")))))","v":""}]
["57.",null,null,null,null,null,null,{"$f":"IF(Stammdaten!$C$9=0,\"\",IF(I61=4,Stammdaten!$C$9,\"\"))","v":""},null,"",{"$f":"IF(B61=\"\",\"\",IF(M61<>COUNTA(C61:G61),\"\",IF(I61=1,Hauptmaske!J61/Stammdaten!$N$4,IF(I61=2,Hauptmaske!J61/Stammdaten!$N$5,IF(I61=3,Hauptmaske!J61/Stammdaten!$N$6,IF(I61=4,Hauptmaske!J61/Stammdaten!$N$7,IF(I61=5,Hauptmaske!J61/Stammdaten!$N$8,\"\")))))))","v":""},null,{"$f":"IF(I61=1,Stammdaten!$O$4,IF(Hauptmaske!I61=2,Stammdaten!$O$5,IF(Hauptmaske!I61=3,Stammdaten!$O$6,IF(Hauptmaske!I61=4,Stammdaten!$O$7,IF(Hauptmaske!I61=5,Stammdaten!$O$8,\"\")))))","v":""}]
["58.",null,null,null,null,null,null,{"$f":"IF(Stammdaten!$C$9=0,\"\",IF(I62=4,Stammdaten!$C$9,\"\"))","v":""},null,"",{"$f":"IF(B62=\"\",\"\",IF(M62<>COUNTA(C62:G62),\"\",IF(I62=1,Hauptmaske!J62/Stammdaten!$N$4,IF(I62=2,Hauptmaske!J62/Stammdaten!$N$5,IF(I62=3,Hauptmaske!J62/Stammdaten!$N$6,IF(I62=4,Hauptmaske!J62/Stammdaten!$N$7,IF(I62=5,Hauptmaske!J62/Stammdaten!$N$8,\"\")))))))","v":""},null,{"$f":"IF(I62=1,Stammdaten!$O$4,IF(Hauptmaske!I62=2,Stammdaten!$O$5,IF(Hauptmaske!I62=3,Stammdaten!$O$6,IF(Hauptmaske!I62=4,Stammdaten!$O$7,IF(Hauptmaske!I62=5,Stammdaten!$O$8,\"\")))))","v":""}]
["59.",null,null,null,null,null,null,{"$f":"IF(Stammdaten!$C$9=0,\"\",IF(I63=4,Stammdaten!$C$9,\"\"))","v":""},null,"",{"$f":"IF(B63=\"\",\"\",IF(M63<>COUNTA(C63:G63),\"\",IF(I63=1,Hauptmaske!J63/Stammdaten!$N$4,IF(I63=2,Hauptmaske!J63/Stammdaten!$N$5,IF(I63=3,Hauptmaske!J63/Stammdaten!$N$6,IF(I63=4,Hauptmaske!J63/Stammdaten!$N$7,IF(I63=5,Hauptmaske!J63/Stammdaten!$N$8,\"\")))))))","v":""},null,{"$f":"IF(I63=1,Stammdaten!$O$4,IF(Hauptmaske!I63=2,Stammdaten!$O$5,IF(Hauptmaske!I63=3,Stammdaten!$O$6,IF(Hauptmaske!I63=4,Stammdaten!$O$7,IF(Hauptmaske!I63=5,Stammdaten!$O$8,\"\")))))","v":""}]
["60.",null,null,null,null,null,null,{"$f":"IF(Stammdaten!$C$9=0,\"\",IF(I64=4,Stammdaten!$C$9,\"\"))","v":""},null,"",{"$f":"IF(B64=\"\",\"\",IF(M64<>COUNTA(C64:G64),\"\",IF(I64=1,Hauptmaske!J64/Stammdaten!$N$4,IF(I64=2,Hauptmaske!J64/Stammdaten!$N$5,IF(I64=3,Hauptmaske!J64/Stammdaten!$N$6,IF(I64=4,Hauptmaske!J64/Stammdaten!$N$7,IF(I64=5,Hauptmaske!J64/Stammdaten!$N$8,\"\")))))))","v":""},null,{"$f":"IF(I64=1,Stammdaten!$O$4,IF(Hauptmaske!I64=2,Stammdaten!$O$5,IF(Hauptmaske!I64=3,Stammdaten!$O$6,IF(Hauptmaske!I64=4,Stammdaten!$O$7,IF(Hauptmaske!I64=5,Stammdaten!$O$8,\"\")))))","v":""}]
["61.",null,null,null,null,null,null,{"$f":"IF(Stammdaten!$C$9=0,\"\",IF(I65=4,Stammdaten!$C$9,\"\"))","v":""},null,"",{"$f":"IF(B65=\"\",\"\",IF(M65<>COUNTA(C65:G65),\"\",IF(I65=1,Hauptmaske!J65/Stammdaten!$N$4,IF(I65=2,Hauptmaske!J65/Stammdaten!$N$5,IF(I65=3,Hauptmaske!J65/Stammdaten!$N$6,IF(I65=4,Hauptmaske!J65/Stammdaten!$N$7,IF(I65=5,Hauptmaske!J65/Stammdaten!$N$8,\"\")))))))","v":""},null,{"$f":"IF(I65=1,Stammdaten!$O$4,IF(Hauptmaske!I65=2,Stammdaten!$O$5,IF(Hauptmaske!I65=3,Stammdaten!$O$6,IF(Hauptmaske!I65=4,Stammdaten!$O$7,IF(Hauptmaske!I65=5,Stammdaten!$O$8,\"\")))))","v":""}]
["62.",null,null,null,null,null,null,{"$f":"IF(Stammdaten!$C$9=0,\"\",IF(I66=4,Stammdaten!$C$9,\"\"))","v":""},null,"",{"$f":"IF(B66=\"\",\"\",IF(M66<>COUNTA(C66:G66),\"\",IF(I66=1,Hauptmaske!J66/Stammdaten!$N$4,IF(I66=2,Hauptmaske!J66/Stammdaten!$N$5,IF(I66=3,Hauptmaske!J66/Stammdaten!$N$6,IF(I66=4,Hauptmaske!J66/Stammdaten!$N$7,IF(I66=5,Hauptmaske!J66/Stammdaten!$N$8,\"\")))))))","v":""},null,{"$f":"IF(I66=1,Stammdaten!$O$4,IF(Hauptmaske!I66=2,Stammdaten!$O$5,IF(Hauptmaske!I66=3,Stammdaten!$O$6,IF(Hauptmaske!I66=4,Stammdaten!$O$7,IF(Hauptmaske!I66=5,Stammdaten!$O$8,\"\")))))","v":""}]
["63.",null,null,null,null,null,null,{"$f":"IF(Stammdaten!$C$9=0,\"\",IF(I67=4,Stammdaten!$C$9,\"\"))","v":""},null,"",{"$f":"IF(B67=\"\",\"\",IF(M67<>COUNTA(C67:G67),\"\",IF(I67=1,Hauptmaske!J67/Stammdaten!$N$4,IF(I67=2,Hauptmaske!J67/Stammdaten!$N$5,IF(I67=3,Hauptmaske!J67/Stammdaten!$N$6,IF(I67=4,Hauptmaske!J67/Stammdaten!$N$7,IF(I67=5,Hauptmaske!J67/Stammdaten!$N$8,\"\")))))))","v":""},null,{"$f":"IF(I67=1,Stammdaten!$O$4,IF(Hauptmaske!I67=2,Stammdaten!$O$5,IF(Hauptmaske!I67=3,Stammdaten!$O$6,IF(Hauptmaske!I67=4,Stammdaten!$O$7,IF(Hauptmaske!I67=5,Stammdaten!$O$8,\"\")))))","v":""}]
["64.",null,null,null,null,null,null,{"$f":"IF(Stammdaten!$C$9=0,\"\",IF(I68=4,Stammdaten!$C$9,\"\"))","v":""},null,"",{"$f":"IF(B68=\"\",\"\",IF(M68<>COUNTA(C68:G68),\"\",IF(I68=1,Hauptmaske!J68/Stammdaten!$N$4,IF(I68=2,Hauptmaske!J68/Stammdaten!$N$5,IF(I68=3,Hauptmaske!J68/Stammdaten!$N$6,IF(I68=4,Hauptmaske!J68/Stammdaten!$N$7,IF(I68=5,Hauptmaske!J68/Stammdaten!$N$8,\"\")))))))","v":""},null,{"$f":"IF(I68=1,Stammdaten!$O$4,IF(Hauptmaske!I68=2,Stammdaten!$O$5,IF(Hauptmaske!I68=3,Stammdaten!$O$6,IF(Hauptmaske!I68=4,Stammdaten!$O$7,IF(Hauptmaske!I68=5,Stammdaten!$O$8,\"\")))))","v":""}]
["65.",null,null,null,null,null,null,{"$f":"IF(Stammdaten!$C$9=0,\"\",IF(I69=4,Stammdaten!$C$9,\"\"))","v":""},null,"",{"$f":"IF(B69=\"\",\"\",IF(M69<>COUNTA(C69:G69),\"\",IF(I69=1,Hauptmaske!J69/Stammdaten!$N$4,IF(I69=2,Hauptmaske!J69/Stammdaten!$N$5,IF(I69=3,Hauptmaske!J69/Stammdaten!$N$6,IF(I69=4,Hauptmaske!J69/Stammdaten!$N$7,IF(I69=5,Hauptmaske!J69/Stammdaten!$N$8,\"\")))))))","v":""},null,{"$f":"IF(I69=1,Stammdaten!$O$4,IF(Hauptmaske!I69=2,Stammdaten!$O$5,IF(Hauptmaske!I69=3,Stammdaten!$O$6,IF(Hauptmaske!I69=4,Stammdaten!$O$7,IF(Hauptmaske!I69=5,Stammdaten!$O$8,\"\")))))","v":""}]
["66.",null,null,null,null,null,null,{"$f":"IF(Stammdaten!$C$9=0,\"\",IF(I70=4,Stammdaten!$C$9,\"\"))","v":""},null,"",{"$f":"IF(B70=\"\",\"\",IF(M70<>COUNTA(C70:G70),\"\",IF(I70=1,Hauptmaske!J70/Stammdaten!$N$4,IF(I70=2,Hauptmaske!J70/Stammdaten!$N$5,IF(I70=3,Hauptmaske!J70/Stammdaten!$N$6,IF(I70=4,Hauptmaske!J70/Stammdaten!$N$7,IF(I70=5,Hauptmaske!J70/Stammdaten!$N$8,\"\")))))))","v":""},null,{"$f":"IF(I70=1,Stammdaten!$O$4,IF(Hauptmaske!I70=2,Stammdaten!$O$5,IF(Hauptmaske!I70=3,Stammdaten!$O$6,IF(Hauptmaske!I70=4,Stammdaten!$O$7,IF(Hauptmaske!I70=5,Stammdaten!$O$8,\"\")))))","v":""}]
["67.",null,null,null,null,null,null,{"$f":"IF(Stammdaten!$C$9=0,\"\",IF(I71=4,Stammdaten!$C$9,\"\"))","v":""},null,"",{"$f":"IF(B71=\"\",\"\",IF(M71<>COUNTA(C71:G71),\"\",IF(I71=1,Hauptmaske!J71/Stammdaten!$N$4,IF(I71=2,Hauptmaske!J71/Stammdaten!$N$5,IF(I71=3,Hauptmaske!J71/Stammdaten!$N$6,IF(I71=4,Hauptmaske!J71/Stammdaten!$N$7,IF(I71=5,Hauptmaske!J71/Stammdaten!$N$8,\"\")))))))","v":""},null,{"$f":"IF(I71=1,Stammdaten!$O$4,IF(Hauptmaske!I71=2,Stammdaten!$O$5,IF(Hauptmaske!I71=3,Stammdaten!$O$6,IF(Hauptmaske!I71=4,Stammdaten!$O$7,IF(Hauptmaske!I71=5,Stammdaten!$O$8,\"\")))))","v":""}]
["68.",null,null,null,null,null,null,{"$f":"IF(Stammdaten!$C$9=0,\"\",IF(I72=4,Stammdaten!$C$9,\"\"))","v":""},null,"",{"$f":"IF(B72=\"\",\"\",IF(M72<>COUNTA(C72:G72),\"\",IF(I72=1,Hauptmaske!J72/Stammdaten!$N$4,IF(I72=2,Hauptmaske!J72/Stammdaten!$N$5,IF(I72=3,Hauptmaske!J72/Stammdaten!$N$6,IF(I72=4,Hauptmaske!J72/Stammdaten!$N$7,IF(I72=5,Hauptmaske!J72/Stammdaten!$N$8,\"\")))))))","v":""},null,{"$f":"IF(I72=1,Stammdaten!$O$4,IF(Hauptmaske!I72=2,Stammdaten!$O$5,IF(Hauptmaske!I72=3,Stammdaten!$O$6,IF(Hauptmaske!I72=4,Stammdaten!$O$7,IF(Hauptmaske!I72=5,Stammdaten!$O$8,\"\")))))","v":""}]
["69.",null,null,null,null,null,null,{"$f":"IF(Stammdaten!$C$9=0,\"\",IF(I73=4,Stammdaten!$C$9,\"\"))","v":""},null,"",{"$f":"IF(B73=\"\",\"\",IF(M73<>COUNTA(C73:G73),\"\",IF(I73=1,Hauptmaske!J73/Stammdaten!$N$4,IF(I73=2,Hauptmaske!J73/Stammdaten!$N$5,IF(I73=3,Hauptmaske!J73/Stammdaten!$N$6,IF(I73=4,Hauptmaske!J73/Stammdaten!$N$7,IF(I73=5,Hauptmaske!J73/Stammdaten!$N$8,\"\")))))))","v":""},null,{"$f":"IF(I73=1,Stammdaten!$O$4,IF(Hauptmaske!I73=2,Stammdaten!$O$5,IF(Hauptmaske!I73=3,Stammdaten!$O$6,IF(Hauptmaske!I73=4,Stammdaten!$O$7,IF(Hauptmaske!I73=5,Stammdaten!$O$8,\"\")))))","v":""}]
["70.",null,null,null,null,null,null,{"$f":"IF(Stammdaten!$C$9=0,\"\",IF(I74=4,Stammdaten!$C$9,\"\"))","v":""},null,"",{"$f":"IF(B74=\"\",\"\",IF(M74<>COUNTA(C74:G74),\"\",IF(I74=1,Hauptmaske!J74/Stammdaten!$N$4,IF(I74=2,Hauptmaske!J74/Stammdaten!$N$5,IF(I74=3,Hauptmaske!J74/Stammdaten!$N$6,IF(I74=4,Hauptmaske!J74/Stammdaten!$N$7,IF(I74=5,Hauptmaske!J74/Stammdaten!$N$8,\"\")))))))","v":""},null,{"$f":"IF(I74=1,Stammdaten!$O$4,IF(Hauptmaske!I74=2,Stammdaten!$O$5,IF(Hauptmaske!I74=3,Stammdaten!$O$6,IF(Hauptmaske!I74=4,Stammdaten!$O$7,IF(Hauptmaske!I74=5,Stammdaten!$O$8,\"\")))))","v":""}]
["71.",null,null,null,null,null,null,{"$f":"IF(Stammdaten!$C$9=0,\"\",IF(I75=4,Stammdaten!$C$9,\"\"))","v":""},null,"",{"$f":"IF(B75=\"\",\"\",IF(M75<>COUNTA(C75:G75),\"\",IF(I75=1,Hauptmaske!J75/Stammdaten!$N$4,IF(I75=2,Hauptmaske!J75/Stammdaten!$N$5,IF(I75=3,Hauptmaske!J75/Stammdaten!$N$6,IF(I75=4,Hauptmaske!J75/Stammdaten!$N$7,IF(I75=5,Hauptmaske!J75/Stammdaten!$N$8,\"\")))))))","v":""},null,{"$f":"IF(I75=1,Stammdaten!$O$4,IF(Hauptmaske!I75=2,Stammdaten!$O$5,IF(Hauptmaske!I75=3,Stammdaten!$O$6,IF(Hauptmaske!I75=4,Stammdaten!$O$7,IF(Hauptmaske!I75=5,Stammdaten!$O$8,\"\")))))","v":""}]
["72.",null,null,null,null,null,null,{"$f":"IF(Stammdaten!$C$9=0,\"\",IF(I76=4,Stammdaten!$C$9,\"\"))","v":""},null,"",{"$f":"IF(B76=\"\",\"\",IF(M76<>COUNTA(C76:G76),\"\",IF(I76=1,Hauptmaske!J76/Stammdaten!$N$4,IF(I76=2,Hauptmaske!J76/Stammdaten!$N$5,IF(I76=3,Hauptmaske!J76/Stammdaten!$N$6,IF(I76=4,Hauptmaske!J76/Stammdaten!$N$7,IF(I76=5,Hauptmaske!J76/Stammdaten!$N$8,\"\")))))))","v":""},null,{"$f":"IF(I76=1,Stammdaten!$O$4,IF(Hauptmaske!I76=2,Stammdaten!$O$5,IF(Hauptmaske!I76=3,Stammdaten!$O$6,IF(Hauptmaske!I76=4,Stammdaten!$O$7,IF(Hauptmaske!I76=5,Stammdaten!$O$8,\"\")))))","v":""}]
["73.",null,null,null,null,null,null,{"$f":"IF(Stammdaten!$C$9=0,\"\",IF(I77=4,Stammdaten!$C$9,\"\"))","v":""},null,"",{"$f":"IF(B77=\"\",\"\",IF(M77<>COUNTA(C77:G77),\"\",IF(I77=1,Hauptmaske!J77/Stammdaten!$N$4,IF(I77=2,Hauptmaske!J77/Stammdaten!$N$5,IF(I77=3,Hauptmaske!J77/Stammdaten!$N$6,IF(I77=4,Hauptmaske!J77/Stammdaten!$N$7,IF(I77=5,Hauptmaske!J77/Stammdaten!$N$8,\"\")))))))","v":""},null,{"$f":"IF(I77=1,Stammdaten!$O$4,IF(Hauptmaske!I77=2,Stammdaten!$O$5,IF(Hauptmaske!I77=3,Stammdaten!$O$6,IF(Hauptmaske!I77=4,Stammdaten!$O$7,IF(Hauptmaske!I77=5,Stammdaten!$O$8,\"\")))))","v":""}]
["74.",null,null,null,null,null,null,{"$f":"IF(Stammdaten!$C$9=0,\"\",IF(I78=4,Stammdaten!$C$9,\"\"))","v":""},null,"",{"$f":"IF(B78=\"\",\"\",IF(M78<>COUNTA(C78:G78),\"\",IF(I78=1,Hauptmaske!J78/Stammdaten!$N$4,IF(I78=2,Hauptmaske!J78/Stammdaten!$N$5,IF(I78=3,Hauptmaske!J78/Stammdaten!$N$6,IF(I78=4,Hauptmaske!J78/Stammdaten!$N$7,IF(I78=5,Hauptmaske!J78/Stammdaten!$N$8,\"\")))))))","v":""},null,{"$f":"IF(I78=1,Stammdaten!$O$4,IF(Hauptmaske!I78=2,Stammdaten!$O$5,IF(Hauptmaske!I78=3,Stammdaten!$O$6,IF(Hauptmaske!I78=4,Stammdaten!$O$7,IF(Hauptmaske!I78=5,Stammdaten!$O$8,\"\")))))","v":""}]
["75.",null,null,null,null,null,null,{"$f":"IF(Stammdaten!$C$9=0,\"\",IF(I79=4,Stammdaten!$C$9,\"\"))","v":""},null,"",{"$f":"IF(B79=\"\",\"\",IF(M79<>COUNTA(C79:G79),\"\",IF(I79=1,Hauptmaske!J79/Stammdaten!$N$4,IF(I79=2,Hauptmaske!J79/Stammdaten!$N$5,IF(I79=3,Hauptmaske!J79/Stammdaten!$N$6,IF(I79=4,Hauptmaske!J79/Stammdaten!$N$7,IF(I79=5,Hauptmaske!J79/Stammdaten!$N$8,\"\")))))))","v":""},null,{"$f":"IF(I79=1,Stammdaten!$O$4,IF(Hauptmaske!I79=2,Stammdaten!$O$5,IF(Hauptmaske!I79=3,Stammdaten!$O$6,IF(Hauptmaske!I79=4,Stammdaten!$O$7,IF(Hauptmaske!I79=5,Stammdaten!$O$8,\"\")))))","v":""}]
["76.",null,null,null,null,null,null,{"$f":"IF(Stammdaten!$C$9=0,\"\",IF(I80=4,Stammdaten!$C$9,\"\"))","v":""},null,"",{"$f":"IF(B80=\"\",\"\",IF(M80<>COUNTA(C80:G80),\"\",IF(I80=1,Hauptmaske!J80/Stammdaten!$N$4,IF(I80=2,Hauptmaske!J80/Stammdaten!$N$5,IF(I80=3,Hauptmaske!J80/Stammdaten!$N$6,IF(I80=4,Hauptmaske!J80/Stammdaten!$N$7,IF(I80=5,Hauptmaske!J80/Stammdaten!$N$8,\"\")))))))","v":""},null,{"$f":"IF(I80=1,Stammdaten!$O$4,IF(Hauptmaske!I80=2,Stammdaten!$O$5,IF(Hauptmaske!I80=3,Stammdaten!$O$6,IF(Hauptmaske!I80=4,Stammdaten!$O$7,IF(Hauptmaske!I80=5,Stammdaten!$O$8,\"\")))))","v":""}]
["77.",null,null,null,null,null,null,{"$f":"IF(Stammdaten!$C$9=0,\"\",IF(I81=4,Stammdaten!$C$9,\"\"))","v":""},null,"",{"$f":"IF(B81=\"\",\"\",IF(M81<>COUNTA(C81:G81),\"\",IF(I81=1,Hauptmaske!J81/Stammdaten!$N$4,IF(I81=2,Hauptmaske!J81/Stammdaten!$N$5,IF(I81=3,Hauptmaske!J81/Stammdaten!$N$6,IF(I81=4,Hauptmaske!J81/Stammdaten!$N$7,IF(I81=5,Hauptmaske!J81/Stammdaten!$N$8,\"\")))))))","v":""},null,{"$f":"IF(I81=1,Stammdaten!$O$4,IF(Hauptmaske!I81=2,Stammdaten!$O$5,IF(Hauptmaske!I81=3,Stammdaten!$O$6,IF(Hauptmaske!I81=4,Stammdaten!$O$7,IF(Hauptmaske!I81=5,Stammdaten!$O$8,\"\")))))","v":""}]
["78.",null,null,null,null,null,null,{"$f":"IF(Stammdaten!$C$9=0,\"\",IF(I82=4,Stammdaten!$C$9,\"\"))","v":""},null,"",{"$f":"IF(B82=\"\",\"\",IF(M82<>COUNTA(C82:G82),\"\",IF(I82=1,Hauptmaske!J82/Stammdaten!$N$4,IF(I82=2,Hauptmaske!J82/Stammdaten!$N$5,IF(I82=3,Hauptmaske!J82/Stammdaten!$N$6,IF(I82=4,Hauptmaske!J82/Stammdaten!$N$7,IF(I82=5,Hauptmaske!J82/Stammdaten!$N$8,\"\")))))))","v":""},null,{"$f":"IF(I82=1,Stammdaten!$O$4,IF(Hauptmaske!I82=2,Stammdaten!$O$5,IF(Hauptmaske!I82=3,Stammdaten!$O$6,IF(Hauptmaske!I82=4,Stammdaten!$O$7,IF(Hauptmaske!I82=5,Stammdaten!$O$8,\"\")))))","v":""}]
["79.",null,null,null,null,null,null,{"$f":"IF(Stammdaten!$C$9=0,\"\",IF(I83=4,Stammdaten!$C$9,\"\"))","v":""},null,"",{"$f":"IF(B83=\"\",\"\",IF(M83<>COUNTA(C83:G83),\"\",IF(I83=1,Hauptmaske!J83/Stammdaten!$N$4,IF(I83=2,Hauptmaske!J83/Stammdaten!$N$5,IF(I83=3,Hauptmaske!J83/Stammdaten!$N$6,IF(I83=4,Hauptmaske!J83/Stammdaten!$N$7,IF(I83=5,Hauptmaske!J83/Stammdaten!$N$8,\"\")))))))","v":""},null,{"$f":"IF(I83=1,Stammdaten!$O$4,IF(Hauptmaske!I83=2,Stammdaten!$O$5,IF(Hauptmaske!I83=3,Stammdaten!$O$6,IF(Hauptmaske!I83=4,Stammdaten!$O$7,IF(Hauptmaske!I83=5,Stammdaten!$O$8,\"\")))))","v":""}]
["80.",null,null,null,null,null,null,{"$f":"IF(Stammdaten!$C$9=0,\"\",IF(I84=4,Stammdaten!$C$9,\"\"))","v":""},null,"",{"$f":"IF(B84=\"\",\"\",IF(M84<>COUNTA(C84:G84),\"\",IF(I84=1,Hauptmaske!J84/Stammdaten!$N$4,IF(I84=2,Hauptmaske!J84/Stammdaten!$N$5,IF(I84=3,Hauptmaske!J84/Stammdaten!$N$6,IF(I84=4,Hauptmaske!J84/Stammdaten!$N$7,IF(I84=5,Hauptmaske!J84/Stammdaten!$N$8,\"\")))))))","v":""},null,{"$f":"IF(I84=1,Stammdaten!$O$4,IF(Hauptmaske!I84=2,Stammdaten!$O$5,IF(Hauptmaske!I84=3,Stammdaten!$O$6,IF(Hauptmaske!I84=4,Stammdaten!$O$7,IF(Hauptmaske!I84=5,Stammdaten!$O$8,\"\")))))","v":""}]
["81.",null,null,null,null,null,null,{"$f":"IF(Stammdaten!$C$9=0,\"\",IF(I85=4,Stammdaten!$C$9,\"\"))","v":""},null,"",{"$f":"IF(B85=\"\",\"\",IF(M85<>COUNTA(C85:G85),\"\",IF(I85=1,Hauptmaske!J85/Stammdaten!$N$4,IF(I85=2,Hauptmaske!J85/Stammdaten!$N$5,IF(I85=3,Hauptmaske!J85/Stammdaten!$N$6,IF(I85=4,Hauptmaske!J85/Stammdaten!$N$7,IF(I85=5,Hauptmaske!J85/Stammdaten!$N$8,\"\")))))))","v":""},null,{"$f":"IF(I85=1,Stammdaten!$O$4,IF(Hauptmaske!I85=2,Stammdaten!$O$5,IF(Hauptmaske!I85=3,Stammdaten!$O$6,IF(Hauptmaske!I85=4,Stammdaten!$O$7,IF(Hauptmaske!I85=5,Stammdaten!$O$8,\"\")))))","v":""}]
["82.",null,null,null,null,null,null,{"$f":"IF(Stammdaten!$C$9=0,\"\",IF(I86=4,Stammdaten!$C$9,\"\"))","v":""},null,"",{"$f":"IF(B86=\"\",\"\",IF(M86<>COUNTA(C86:G86),\"\",IF(I86=1,Hauptmaske!J86/Stammdaten!$N$4,IF(I86=2,Hauptmaske!J86/Stammdaten!$N$5,IF(I86=3,Hauptmaske!J86/Stammdaten!$N$6,IF(I86=4,Hauptmaske!J86/Stammdaten!$N$7,IF(I86=5,Hauptmaske!J86/Stammdaten!$N$8,\"\")))))))","v":""},null,{"$f":"IF(I86=1,Stammdaten!$O$4,IF(Hauptmaske!I86=2,Stammdaten!$O$5,IF(Hauptmaske!I86=3,Stammdaten!$O$6,IF(Hauptmaske!I86=4,Stammdaten!$O$7,IF(Hauptmaske!I86=5,Stammdaten!$O$8,\"\")))))","v":""}]
["83.",null,null,null,null,null,null,{"$f":"IF(Stammdaten!$C$9=0,\"\",IF(I87=4,Stammdaten!$C$9,\"\"))","v":""},null,"",{"$f":"IF(B87=\"\",\"\",IF(M87<>COUNTA(C87:G87),\"\",IF(I87=1,Hauptmaske!J87/Stammdaten!$N$4,IF(I87=2,Hauptmaske!J87/Stammdaten!$N$5,IF(I87=3,Hauptmaske!J87/Stammdaten!$N$6,IF(I87=4,Hauptmaske!J87/Stammdaten!$N$7,IF(I87=5,Hauptmaske!J87/Stammdaten!$N$8,\"\")))))))","v":""},null,{"$f":"IF(I87=1,Stammdaten!$O$4,IF(Hauptmaske!I87=2,Stammdaten!$O$5,IF(Hauptmaske!I87=3,Stammdaten!$O$6,IF(Hauptmaske!I87=4,Stammdaten!$O$7,IF(Hauptmaske!I87=5,Stammdaten!$O$8,\"\")))))","v":""}]
["84.",null,null,null,null,null,null,{"$f":"IF(Stammdaten!$C$9=0,\"\",IF(I88=4,Stammdaten!$C$9,\"\"))","v":""},null,"",{"$f":"IF(B88=\"\",\"\",IF(M88<>COUNTA(C88:G88),\"\",IF(I88=1,Hauptmaske!J88/Stammdaten!$N$4,IF(I88=2,Hauptmaske!J88/Stammdaten!$N$5,IF(I88=3,Hauptmaske!J88/Stammdaten!$N$6,IF(I88=4,Hauptmaske!J88/Stammdaten!$N$7,IF(I88=5,Hauptmaske!J88/Stammdaten!$N$8,\"\")))))))","v":""},null,{"$f":"IF(I88=1,Stammdaten!$O$4,IF(Hauptmaske!I88=2,Stammdaten!$O$5,IF(Hauptmaske!I88=3,Stammdaten!$O$6,IF(Hauptmaske!I88=4,Stammdaten!$O$7,IF(Hauptmaske!I88=5,Stammdaten!$O$8,\"\")))))","v":""}]
["85.",null,null,null,null,null,null,{"$f":"IF(Stammdaten!$C$9=0,\"\",IF(I89=4,Stammdaten!$C$9,\"\"))","v":""},null,"",{"$f":"IF(B89=\"\",\"\",IF(M89<>COUNTA(C89:G89),\"\",IF(I89=1,Hauptmaske!J89/Stammdaten!$N$4,IF(I89=2,Hauptmaske!J89/Stammdaten!$N$5,IF(I89=3,Hauptmaske!J89/Stammdaten!$N$6,IF(I89=4,Hauptmaske!J89/Stammdaten!$N$7,IF(I89=5,Hauptmaske!J89/Stammdaten!$N$8,\"\")))))))","v":""},null,{"$f":"IF(I89=1,Stammdaten!$O$4,IF(Hauptmaske!I89=2,Stammdaten!$O$5,IF(Hauptmaske!I89=3,Stammdaten!$O$6,IF(Hauptmaske!I89=4,Stammdaten!$O$7,IF(Hauptmaske!I89=5,Stammdaten!$O$8,\"\")))))","v":""}]
["86.",null,null,null,null,null,null,{"$f":"IF(Stammdaten!$C$9=0,\"\",IF(I90=4,Stammdaten!$C$9,\"\"))","v":""},null,"",{"$f":"IF(B90=\"\",\"\",IF(M90<>COUNTA(C90:G90),\"\",IF(I90=1,Hauptmaske!J90/Stammdaten!$N$4,IF(I90=2,Hauptmaske!J90/Stammdaten!$N$5,IF(I90=3,Hauptmaske!J90/Stammdaten!$N$6,IF(I90=4,Hauptmaske!J90/Stammdaten!$N$7,IF(I90=5,Hauptmaske!J90/Stammdaten!$N$8,\"\")))))))","v":""},null,{"$f":"IF(I90=1,Stammdaten!$O$4,IF(Hauptmaske!I90=2,Stammdaten!$O$5,IF(Hauptmaske!I90=3,Stammdaten!$O$6,IF(Hauptmaske!I90=4,Stammdaten!$O$7,IF(Hauptmaske!I90=5,Stammdaten!$O$8,\"\")))))","v":""}]
["87.",null,null,null,null,null,null,{"$f":"IF(Stammdaten!$C$9=0,\"\",IF(I91=4,Stammdaten!$C$9,\"\"))","v":""},null,"",{"$f":"IF(B91=\"\",\"\",IF(M91<>COUNTA(C91:G91),\"\",IF(I91=1,Hauptmaske!J91/Stammdaten!$N$4,IF(I91=2,Hauptmaske!J91/Stammdaten!$N$5,IF(I91=3,Hauptmaske!J91/Stammdaten!$N$6,IF(I91=4,Hauptmaske!J91/Stammdaten!$N$7,IF(I91=5,Hauptmaske!J91/Stammdaten!$N$8,\"\")))))))","v":""},null,{"$f":"IF(I91=1,Stammdaten!$O$4,IF(Hauptmaske!I91=2,Stammdaten!$O$5,IF(Hauptmaske!I91=3,Stammdaten!$O$6,IF(Hauptmaske!I91=4,Stammdaten!$O$7,IF(Hauptmaske!I91=5,Stammdaten!$O$8,\"\")))))","v":""}]
["88.",null,null,null,null,null,null,{"$f":"IF(Stammdaten!$C$9=0,\"\",IF(I92=4,Stammdaten!$C$9,\"\"))","v":""},null,"",{"$f":"IF(B92=\"\",\"\",IF(M92<>COUNTA(C92:G92),\"\",IF(I92=1,Hauptmaske!J92/Stammdaten!$N$4,IF(I92=2,Hauptmaske!J92/Stammdaten!$N$5,IF(I92=3,Hauptmaske!J92/Stammdaten!$N$6,IF(I92=4,Hauptmaske!J92/Stammdaten!$N$7,IF(I92=5,Hauptmaske!J92/Stammdaten!$N$8,\"\")))))))","v":""},null,{"$f":"IF(I92=1,Stammdaten!$O$4,IF(Hauptmaske!I92=2,Stammdaten!$O$5,IF(Hauptmaske!I92=3,Stammdaten!$O$6,IF(Hauptmaske!I92=4,Stammdaten!$O$7,IF(Hauptmaske!I92=5,Stammdaten!$O$8,\"\")))))","v":""}]
["89.",null,null,null,null,null,null,{"$f":"IF(Stammdaten!$C$9=0,\"\",IF(I93=4,Stammdaten!$C$9,\"\"))","v":""},null,"",{"$f":"IF(B93=\"\",\"\",IF(M93<>COUNTA(C93:G93),\"\",IF(I93=1,Hauptmaske!J93/Stammdaten!$N$4,IF(I93=2,Hauptmaske!J93/Stammdaten!$N$5,IF(I93=3,Hauptmaske!J93/Stammdaten!$N$6,IF(I93=4,Hauptmaske!J93/Stammdaten!$N$7,IF(I93=5,Hauptmaske!J93/Stammdaten!$N$8,\"\")))))))","v":""},null,{"$f":"IF(I93=1,Stammdaten!$O$4,IF(Hauptmaske!I93=2,Stammdaten!$O$5,IF(Hauptmaske!I93=3,Stammdaten!$O$6,IF(Hauptmaske!I93=4,Stammdaten!$O$7,IF(Hauptmaske!I93=5,Stammdaten!$O$8,\"\")))))","v":""}]
["90.",null,null,null,null,null,null,{"$f":"IF(Stammdaten!$C$9=0,\"\",IF(I94=4,Stammdaten!$C$9,\"\"))","v":""},null,"",{"$f":"IF(B94=\"\",\"\",IF(M94<>COUNTA(C94:G94),\"\",IF(I94=1,Hauptmaske!J94/Stammdaten!$N$4,IF(I94=2,Hauptmaske!J94/Stammdaten!$N$5,IF(I94=3,Hauptmaske!J94/Stammdaten!$N$6,IF(I94=4,Hauptmaske!J94/Stammdaten!$N$7,IF(I94=5,Hauptmaske!J94/Stammdaten!$N$8,\"\")))))))","v":""},null,{"$f":"IF(I94=1,Stammdaten!$O$4,IF(Hauptmaske!I94=2,Stammdaten!$O$5,IF(Hauptmaske!I94=3,Stammdaten!$O$6,IF(Hauptmaske!I94=4,Stammdaten!$O$7,IF(Hauptmaske!I94=5,Stammdaten!$O$8,\"\")))))","v":""}]
["91.",null,null,null,null,null,null,{"$f":"IF(Stammdaten!$C$9=0,\"\",IF(I95=4,Stammdaten!$C$9,\"\"))","v":""},null,"",{"$f":"IF(B95=\"\",\"\",IF(M95<>COUNTA(C95:G95),\"\",IF(I95=1,Hauptmaske!J95/Stammdaten!$N$4,IF(I95=2,Hauptmaske!J95/Stammdaten!$N$5,IF(I95=3,Hauptmaske!J95/Stammdaten!$N$6,IF(I95=4,Hauptmaske!J95/Stammdaten!$N$7,IF(I95=5,Hauptmaske!J95/Stammdaten!$N$8,\"\")))))))","v":""},null,{"$f":"IF(I95=1,Stammdaten!$O$4,IF(Hauptmaske!I95=2,Stammdaten!$O$5,IF(Hauptmaske!I95=3,Stammdaten!$O$6,IF(Hauptmaske!I95=4,Stammdaten!$O$7,IF(Hauptmaske!I95=5,Stammdaten!$O$8,\"\")))))","v":""}]
["92.",null,null,null,null,null,null,{"$f":"IF(Stammdaten!$C$9=0,\"\",IF(I96=4,Stammdaten!$C$9,\"\"))","v":""},null,"",{"$f":"IF(B96=\"\",\"\",IF(M96<>COUNTA(C96:G96),\"\",IF(I96=1,Hauptmaske!J96/Stammdaten!$N$4,IF(I96=2,Hauptmaske!J96/Stammdaten!$N$5,IF(I96=3,Hauptmaske!J96/Stammdaten!$N$6,IF(I96=4,Hauptmaske!J96/Stammdaten!$N$7,IF(I96=5,Hauptmaske!J96/Stammdaten!$N$8,\"\")))))))","v":""},null,{"$f":"IF(I96=1,Stammdaten!$O$4,IF(Hauptmaske!I96=2,Stammdaten!$O$5,IF(Hauptmaske!I96=3,Stammdaten!$O$6,IF(Hauptmaske!I96=4,Stammdaten!$O$7,IF(Hauptmaske!I96=5,Stammdaten!$O$8,\"\")))))","v":""}]
["93.",null,null,null,null,null,null,{"$f":"IF(Stammdaten!$C$9=0,\"\",IF(I97=4,Stammdaten!$C$9,\"\"))","v":""},null,"",{"$f":"IF(B97=\"\",\"\",IF(M97<>COUNTA(C97:G97),\"\",IF(I97=1,Hauptmaske!J97/Stammdaten!$N$4,IF(I97=2,Hauptmaske!J97/Stammdaten!$N$5,IF(I97=3,Hauptmaske!J97/Stammdaten!$N$6,IF(I97=4,Hauptmaske!J97/Stammdaten!$N$7,IF(I97=5,Hauptmaske!J97/Stammdaten!$N$8,\"\")))))))","v":""},null,{"$f":"IF(I97=1,Stammdaten!$O$4,IF(Hauptmaske!I97=2,Stammdaten!$O$5,IF(Hauptmaske!I97=3,Stammdaten!$O$6,IF(Hauptmaske!I97=4,Stammdaten!$O$7,IF(Hauptmaske!I97=5,Stammdaten!$O$8,\"\")))))","v":""}]
["94.",null,null,null,null,null,null,{"$f":"IF(Stammdaten!$C$9=0,\"\",IF(I98=4,Stammdaten!$C$9,\"\"))","v":""},null,"",{"$f":"IF(B98=\"\",\"\",IF(M98<>COUNTA(C98:G98),\"\",IF(I98=1,Hauptmaske!J98/Stammdaten!$N$4,IF(I98=2,Hauptmaske!J98/Stammdaten!$N$5,IF(I98=3,Hauptmaske!J98/Stammdaten!$N$6,IF(I98=4,Hauptmaske!J98/Stammdaten!$N$7,IF(I98=5,Hauptmaske!J98/Stammdaten!$N$8,\"\")))))))","v":""},null,{"$f":"IF(I98=1,Stammdaten!$O$4,IF(Hauptmaske!I98=2,Stammdaten!$O$5,IF(Hauptmaske!I98=3,Stammdaten!$O$6,IF(Hauptmaske!I98=4,Stammdaten!$O$7,IF(Hauptmaske!I98=5,Stammdaten!$O$8,\"\")))))","v":""}]
["95.",null,null,null,null,null,null,{"$f":"IF(Stammdaten!$C$9=0,\"\",IF(I99=4,Stammdaten!$C$9,\"\"))","v":""},null,{"$f":"IF(SUM(C99:H99)=0,\"\",SUM(C99:H99))","v":""},{"$f":"IF(B99=\"\",\"\",IF(M99<>COUNTA(C99:G99),\"\",IF(I99=1,Hauptmaske!J99/Stammdaten!$N$4,IF(I99=2,Hauptmaske!J99/Stammdaten!$N$5,IF(I99=3,Hauptmaske!J99/Stammdaten!$N$6,IF(I99=4,Hauptmaske!J99/Stammdaten!$N$7,IF(I99=5,Hauptmaske!J99/Stammdaten!$N$8,\"\")))))))","v":""},null,{"$f":"IF(I99=1,Stammdaten!$O$4,IF(Hauptmaske!I99=2,Stammdaten!$O$5,IF(Hauptmaske!I99=3,Stammdaten!$O$6,IF(Hauptmaske!I99=4,Stammdaten!$O$7,IF(Hauptmaske!I99=5,Stammdaten!$O$8,\"\")))))","v":""}]
["96.",null,null,null,null,null,null,{"$f":"IF(Stammdaten!$C$9=0,\"\",IF(I100=4,Stammdaten!$C$9,\"\"))","v":""},null,"",{"$f":"IF(B100=\"\",\"\",IF(M100<>COUNTA(C100:G100),\"\",IF(I100=1,Hauptmaske!J100/Stammdaten!$N$4,IF(I100=2,Hauptmaske!J100/Stammdaten!$N$5,IF(I100=3,Hauptmaske!J100/Stammdaten!$N$6,IF(I100=4,Hauptmaske!J100/Stammdaten!$N$7,IF(I100=5,Hauptmaske!J100/Stammdaten!$N$8,\"\")))))))","v":""},null,{"$f":"IF(I100=1,Stammdaten!$O$4,IF(Hauptmaske!I100=2,Stammdaten!$O$5,IF(Hauptmaske!I100=3,Stammdaten!$O$6,IF(Hauptmaske!I100=4,Stammdaten!$O$7,IF(Hauptmaske!I100=5,Stammdaten!$O$8,\"\")))))","v":""}]
["97.",null,null,null,null,null,null,{"$f":"IF(Stammdaten!$C$9=0,\"\",IF(I101=4,Stammdaten!$C$9,\"\"))","v":""},null,"",{"$f":"IF(B101=\"\",\"\",IF(M101<>COUNTA(C101:G101),\"\",IF(I101=1,Hauptmaske!J101/Stammdaten!$N$4,IF(I101=2,Hauptmaske!J101/Stammdaten!$N$5,IF(I101=3,Hauptmaske!J101/Stammdaten!$N$6,IF(I101=4,Hauptmaske!J101/Stammdaten!$N$7,IF(I101=5,Hauptmaske!J101/Stammdaten!$N$8,\"\")))))))","v":""},null,{"$f":"IF(I101=1,Stammdaten!$O$4,IF(Hauptmaske!I101=2,Stammdaten!$O$5,IF(Hauptmaske!I101=3,Stammdaten!$O$6,IF(Hauptmaske!I101=4,Stammdaten!$O$7,IF(Hauptmaske!I101=5,Stammdaten!$O$8,\"\")))))","v":""}]
["98.",null,null,null,null,null,null,{"$f":"IF(Stammdaten!$C$9=0,\"\",IF(I102=4,Stammdaten!$C$9,\"\"))","v":""},null,"",{"$f":"IF(B102=\"\",\"\",IF(M102<>COUNTA(C102:G102),\"\",IF(I102=1,Hauptmaske!J102/Stammdaten!$N$4,IF(I102=2,Hauptmaske!J102/Stammdaten!$N$5,IF(I102=3,Hauptmaske!J102/Stammdaten!$N$6,IF(I102=4,Hauptmaske!J102/Stammdaten!$N$7,IF(I102=5,Hauptmaske!J102/Stammdaten!$N$8,\"\")))))))","v":""},null,{"$f":"IF(I102=1,Stammdaten!$O$4,IF(Hauptmaske!I102=2,Stammdaten!$O$5,IF(Hauptmaske!I102=3,Stammdaten!$O$6,IF(Hauptmaske!I102=4,Stammdaten!$O$7,IF(Hauptmaske!I102=5,Stammdaten!$O$8,\"\")))))","v":""}]
["99.",null,null,null,null,null,null,{"$f":"IF(Stammdaten!$C$9=0,\"\",IF(I103=4,Stammdaten!$C$9,\"\"))","v":""},null,"",{"$f":"IF(B103=\"\",\"\",IF(M103<>COUNTA(C103:G103),\"\",IF(I103=1,Hauptmaske!J103/Stammdaten!$N$4,IF(I103=2,Hauptmaske!J103/Stammdaten!$N$5,IF(I103=3,Hauptmaske!J103/Stammdaten!$N$6,IF(I103=4,Hauptmaske!J103/Stammdaten!$N$7,IF(I103=5,Hauptmaske!J103/Stammdaten!$N$8,\"\")))))))","v":""},null,{"$f":"IF(I103=1,Stammdaten!$O$4,IF(Hauptmaske!I103=2,Stammdaten!$O$5,IF(Hauptmaske!I103=3,Stammdaten!$O$6,IF(Hauptmaske!I103=4,Stammdaten!$O$7,IF(Hauptmaske!I103=5,Stammdaten!$O$8,\"\")))))","v":""}]
["100.",null,null,null,null,null,null,{"$f":"IF(Stammdaten!$C$9=0,\"\",IF(I104=4,Stammdaten!$C$9,\"\"))","v":""},null,"",{"$f":"IF(B104=\"\",\"\",IF(M104<>COUNTA(C104:G104),\"\",IF(I104=1,Hauptmaske!J104/Stammdaten!$N$4,IF(I104=2,Hauptmaske!J104/Stammdaten!$N$5,IF(I104=3,Hauptmaske!J104/Stammdaten!$N$6,IF(I104=4,Hauptmaske!J104/Stammdaten!$N$7,IF(I104=5,Hauptmaske!J104/Stammdaten!$N$8,\"\")))))))","v":""},null,{"$f":"IF(I104=1,Stammdaten!$O$4,IF(Hauptmaske!I104=2,Stammdaten!$O$5,IF(Hauptmaske!I104=3,Stammdaten!$O$6,IF(Hauptmaske!I104=4,Stammdaten!$O$7,IF(Hauptmaske!I104=5,Stammdaten!$O$8,\"\")))))","v":""}]
["101.",null,null,null,null,null,null,{"$f":"IF(Stammdaten!$C$9=0,\"\",IF(I105=4,Stammdaten!$C$9,\"\"))","v":""},null,"",{"$f":"IF(B105=\"\",\"\",IF(M105<>COUNTA(C105:G105),\"\",IF(I105=1,Hauptmaske!J105/Stammdaten!$N$4,IF(I105=2,Hauptmaske!J105/Stammdaten!$N$5,IF(I105=3,Hauptmaske!J105/Stammdaten!$N$6,IF(I105=4,Hauptmaske!J105/Stammdaten!$N$7,IF(I105=5,Hauptmaske!J105/Stammdaten!$N$8,\"\")))))))","v":""},null,{"$f":"IF(I105=1,Stammdaten!$O$4,IF(Hauptmaske!I105=2,Stammdaten!$O$5,IF(Hauptmaske!I105=3,Stammdaten!$O$6,IF(Hauptmaske!I105=4,Stammdaten!$O$7,IF(Hauptmaske!I105=5,Stammdaten!$O$8,\"\")))))","v":""}]
["102.",null,null,null,null,null,null,{"$f":"IF(Stammdaten!$C$9=0,\"\",IF(I106=4,Stammdaten!$C$9,\"\"))","v":""},null,"",{"$f":"IF(B106=\"\",\"\",IF(M106<>COUNTA(C106:G106),\"\",IF(I106=1,Hauptmaske!J106/Stammdaten!$N$4,IF(I106=2,Hauptmaske!J106/Stammdaten!$N$5,IF(I106=3,Hauptmaske!J106/Stammdaten!$N$6,IF(I106=4,Hauptmaske!J106/Stammdaten!$N$7,IF(I106=5,Hauptmaske!J106/Stammdaten!$N$8,\"\")))))))","v":""},null,{"$f":"IF(I106=1,Stammdaten!$O$4,IF(Hauptmaske!I106=2,Stammdaten!$O$5,IF(Hauptmaske!I106=3,Stammdaten!$O$6,IF(Hauptmaske!I106=4,Stammdaten!$O$7,IF(Hauptmaske!I106=5,Stammdaten!$O$8,\"\")))))","v":""}]
["103.",null,null,null,null,null,null,{"$f":"IF(Stammdaten!$C$9=0,\"\",IF(I107=4,Stammdaten!$C$9,\"\"))","v":""},null,"",{"$f":"IF(B107=\"\",\"\",IF(M107<>COUNTA(C107:G107),\"\",IF(I107=1,Hauptmaske!J107/Stammdaten!$N$4,IF(I107=2,Hauptmaske!J107/Stammdaten!$N$5,IF(I107=3,Hauptmaske!J107/Stammdaten!$N$6,IF(I107=4,Hauptmaske!J107/Stammdaten!$N$7,IF(I107=5,Hauptmaske!J107/Stammdaten!$N$8,\"\")))))))","v":""},null,{"$f":"IF(I107=1,Stammdaten!$O$4,IF(Hauptmaske!I107=2,Stammdaten!$O$5,IF(Hauptmaske!I107=3,Stammdaten!$O$6,IF(Hauptmaske!I107=4,Stammdaten!$O$7,IF(Hauptmaske!I107=5,Stammdaten!$O$8,\"\")))))","v":""}]
["104.",null,null,null,null,null,null,{"$f":"IF(Stammdaten!$C$9=0,\"\",IF(I108=4,Stammdaten!$C$9,\"\"))","v":""},null,"",{"$f":"IF(B108=\"\",\"\",IF(M108<>COUNTA(C108:G108),\"\",IF(I108=1,Hauptmaske!J108/Stammdaten!$N$4,IF(I108=2,Hauptmaske!J108/Stammdaten!$N$5,IF(I108=3,Hauptmaske!J108/Stammdaten!$N$6,IF(I108=4,Hauptmaske!J108/Stammdaten!$N$7,IF(I108=5,Hauptmaske!J108/Stammdaten!$N$8,\"\")))))))","v":""},null,{"$f":"IF(I108=1,Stammdaten!$O$4,IF(Hauptmaske!I108=2,Stammdaten!$O$5,IF(Hauptmaske!I108=3,Stammdaten!$O$6,IF(Hauptmaske!I108=4,Stammdaten!$O$7,IF(Hauptmaske!I108=5,Stammdaten!$O$8,\"\")))))","v":""}]
["105.",null,null,null,null,null,null,{"$f":"IF(Stammdaten!$C$9=0,\"\",IF(I109=4,Stammdaten!$C$9,\"\"))","v":""},null,"",{"$f":"IF(B109=\"\",\"\",IF(M109<>COUNTA(C109:G109),\"\",IF(I109=1,Hauptmaske!J109/Stammdaten!$N$4,IF(I109=2,Hauptmaske!J109/Stammdaten!$N$5,IF(I109=3,Hauptmaske!J109/Stammdaten!$N$6,IF(I109=4,Hauptmaske!J109/Stammdaten!$N$7,IF(I109=5,Hauptmaske!J109/Stammdaten!$N$8,\"\")))))))","v":""},null,{"$f":"IF(I109=1,Stammdaten!$O$4,IF(Hauptmaske!I109=2,Stammdaten!$O$5,IF(Hauptmaske!I109=3,Stammdaten!$O$6,IF(Hauptmaske!I109=4,Stammdaten!$O$7,IF(Hauptmaske!I109=5,Stammdaten!$O$8,\"\")))))","v":""}]
["106.",null,null,null,null,null,null,{"$f":"IF(Stammdaten!$C$9=0,\"\",IF(I110=4,Stammdaten!$C$9,\"\"))","v":""},null,"",{"$f":"IF(B110=\"\",\"\",IF(M110<>COUNTA(C110:G110),\"\",IF(I110=1,Hauptmaske!J110/Stammdaten!$N$4,IF(I110=2,Hauptmaske!J110/Stammdaten!$N$5,IF(I110=3,Hauptmaske!J110/Stammdaten!$N$6,IF(I110=4,Hauptmaske!J110/Stammdaten!$N$7,IF(I110=5,Hauptmaske!J110/Stammdaten!$N$8,\"\")))))))","v":""},null,{"$f":"IF(I110=1,Stammdaten!$O$4,IF(Hauptmaske!I110=2,Stammdaten!$O$5,IF(Hauptmaske!I110=3,Stammdaten!$O$6,IF(Hauptmaske!I110=4,Stammdaten!$O$7,IF(Hauptmaske!I110=5,Stammdaten!$O$8,\"\")))))","v":""}]
["107.",null,null,null,null,null,null,{"$f":"IF(Stammdaten!$C$9=0,\"\",IF(I111=4,Stammdaten!$C$9,\"\"))","v":""},null,"",{"$f":"IF(B111=\"\",\"\",IF(M111<>COUNTA(C111:G111),\"\",IF(I111=1,Hauptmaske!J111/Stammdaten!$N$4,IF(I111=2,Hauptmaske!J111/Stammdaten!$N$5,IF(I111=3,Hauptmaske!J111/Stammdaten!$N$6,IF(I111=4,Hauptmaske!J111/Stammdaten!$N$7,IF(I111=5,Hauptmaske!J111/Stammdaten!$N$8,\"\")))))))","v":""},null,{"$f":"IF(I111=1,Stammdaten!$O$4,IF(Hauptmaske!I111=2,Stammdaten!$O$5,IF(Hauptmaske!I111=3,Stammdaten!$O$6,IF(Hauptmaske!I111=4,Stammdaten!$O$7,IF(Hauptmaske!I111=5,Stammdaten!$O$8,\"\")))))","v":""}]
["108.",null,null,null,null,null,null,{"$f":"IF(Stammdaten!$C$9=0,\"\",IF(I112=4,Stammdaten!$C$9,\"\"))","v":""},null,"",{"$f":"IF(B112=\"\",\"\",IF(M112<>COUNTA(C112:G112),\"\",IF(I112=1,Hauptmaske!J112/Stammdaten!$N$4,IF(I112=2,Hauptmaske!J112/Stammdaten!$N$5,IF(I112=3,Hauptmaske!J112/Stammdaten!$N$6,IF(I112=4,Hauptmaske!J112/Stammdaten!$N$7,IF(I112=5,Hauptmaske!J112/Stammdaten!$N$8,\"\")))))))","v":""},null,{"$f":"IF(I112=1,Stammdaten!$O$4,IF(Hauptmaske!I112=2,Stammdaten!$O$5,IF(Hauptmaske!I112=3,Stammdaten!$O$6,IF(Hauptmaske!I112=4,Stammdaten!$O$7,IF(Hauptmaske!I112=5,Stammdaten!$O$8,\"\")))))","v":""}]
["109.",null,null,null,null,null,null,{"$f":"IF(Stammdaten!$C$9=0,\"\",IF(I113=4,Stammdaten!$C$9,\"\"))","v":""},null,"",{"$f":"IF(B113=\"\",\"\",IF(M113<>COUNTA(C113:G113),\"\",IF(I113=1,Hauptmaske!J113/Stammdaten!$N$4,IF(I113=2,Hauptmaske!J113/Stammdaten!$N$5,IF(I113=3,Hauptmaske!J113/Stammdaten!$N$6,IF(I113=4,Hauptmaske!J113/Stammdaten!$N$7,IF(I113=5,Hauptmaske!J113/Stammdaten!$N$8,\"\")))))))","v":""},null,{"$f":"IF(I113=1,Stammdaten!$O$4,IF(Hauptmaske!I113=2,Stammdaten!$O$5,IF(Hauptmaske!I113=3,Stammdaten!$O$6,IF(Hauptmaske!I113=4,Stammdaten!$O$7,IF(Hauptmaske!I113=5,Stammdaten!$O$8,\"\")))))","v":""}]
["110.",null,null,null,null,null,null,{"$f":"IF(Stammdaten!$C$9=0,\"\",IF(I114=4,Stammdaten!$C$9,\"\"))","v":""},null,"",{"$f":"IF(B114=\"\",\"\",IF(M114<>COUNTA(C114:G114),\"\",IF(I114=1,Hauptmaske!J114/Stammdaten!$N$4,IF(I114=2,Hauptmaske!J114/Stammdaten!$N$5,IF(I114=3,Hauptmaske!J114/Stammdaten!$N$6,IF(I114=4,Hauptmaske!J114/Stammdaten!$N$7,IF(I114=5,Hauptmaske!J114/Stammdaten!$N$8,\"\")))))))","v":""},null,{"$f":"IF(I114=1,Stammdaten!$O$4,IF(Hauptmaske!I114=2,Stammdaten!$O$5,IF(Hauptmaske!I114=3,Stammdaten!$O$6,IF(Hauptmaske!I114=4,Stammdaten!$O$7,IF(Hauptmaske!I114=5,Stammdaten!$O$8,\"\")))))","v":""}]
["111.",null,null,null,null,null,null,{"$f":"IF(Stammdaten!$C$9=0,\"\",IF(I115=4,Stammdaten!$C$9,\"\"))","v":""},null,"",{"$f":"IF(B115=\"\",\"\",IF(M115<>COUNTA(C115:G115),\"\",IF(I115=1,Hauptmaske!J115/Stammdaten!$N$4,IF(I115=2,Hauptmaske!J115/Stammdaten!$N$5,IF(I115=3,Hauptmaske!J115/Stammdaten!$N$6,IF(I115=4,Hauptmaske!J115/Stammdaten!$N$7,IF(I115=5,Hauptmaske!J115/Stammdaten!$N$8,\"\")))))))","v":""},null,{"$f":"IF(I115=1,Stammdaten!$O$4,IF(Hauptmaske!I115=2,Stammdaten!$O$5,IF(Hauptmaske!I115=3,Stammdaten!$O$6,IF(Hauptmaske!I115=4,Stammdaten!$O$7,IF(Hauptmaske!I115=5,Stammdaten!$O$8,\"\")))))","v":""}]
["112.",null,null,null,null,null,null,{"$f":"IF(Stammdaten!$C$9=0,\"\",IF(I116=4,Stammdaten!$C$9,\"\"))","v":""},null,"",{"$f":"IF(B116=\"\",\"\",IF(M116<>COUNTA(C116:G116),\"\",IF(I116=1,Hauptmaske!J116/Stammdaten!$N$4,IF(I116=2,Hauptmaske!J116/Stammdaten!$N$5,IF(I116=3,Hauptmaske!J116/Stammdaten!$N$6,IF(I116=4,Hauptmaske!J116/Stammdaten!$N$7,IF(I116=5,Hauptmaske!J116/Stammdaten!$N$8,\"\")))))))","v":""},null,{"$f":"IF(I116=1,Stammdaten!$O$4,IF(Hauptmaske!I116=2,Stammdaten!$O$5,IF(Hauptmaske!I116=3,Stammdaten!$O$6,IF(Hauptmaske!I116=4,Stammdaten!$O$7,IF(Hauptmaske!I116=5,Stammdaten!$O$8,\"\")))))","v":""}]
["113.",null,null,null,null,null,null,{"$f":"IF(Stammdaten!$C$9=0,\"\",IF(I117=4,Stammdaten!$C$9,\"\"))","v":""},null,"",{"$f":"IF(B117=\"\",\"\",IF(M117<>COUNTA(C117:G117),\"\",IF(I117=1,Hauptmaske!J117/Stammdaten!$N$4,IF(I117=2,Hauptmaske!J117/Stammdaten!$N$5,IF(I117=3,Hauptmaske!J117/Stammdaten!$N$6,IF(I117=4,Hauptmaske!J117/Stammdaten!$N$7,IF(I117=5,Hauptmaske!J117/Stammdaten!$N$8,\"\")))))))","v":""},null,{"$f":"IF(I117=1,Stammdaten!$O$4,IF(Hauptmaske!I117=2,Stammdaten!$O$5,IF(Hauptmaske!I117=3,Stammdaten!$O$6,IF(Hauptmaske!I117=4,Stammdaten!$O$7,IF(Hauptmaske!I117=5,Stammdaten!$O$8,\"\")))))","v":""}]
["114.",null,null,null,null,null,null,{"$f":"IF(Stammdaten!$C$9=0,\"\",IF(I118=4,Stammdaten!$C$9,\"\"))","v":""},null,"",{"$f":"IF(B118=\"\",\"\",IF(M118<>COUNTA(C118:G118),\"\",IF(I118=1,Hauptmaske!J118/Stammdaten!$N$4,IF(I118=2,Hauptmaske!J118/Stammdaten!$N$5,IF(I118=3,Hauptmaske!J118/Stammdaten!$N$6,IF(I118=4,Hauptmaske!J118/Stammdaten!$N$7,IF(I118=5,Hauptmaske!J118/Stammdaten!$N$8,\"\")))))))","v":""},null,{"$f":"IF(I118=1,Stammdaten!$O$4,IF(Hauptmaske!I118=2,Stammdaten!$O$5,IF(Hauptmaske!I118=3,Stammdaten!$O$6,IF(Hauptmaske!I118=4,Stammdaten!$O$7,IF(Hauptmaske!I118=5,Stammdaten!$O$8,\"\")))))","v":""}]
["115.",null,null,null,null,null,null,{"$f":"IF(Stammdaten!$C$9=0,\"\",IF(I119=4,Stammdaten!$C$9,\"\"))","v":""},null,"",{"$f":"IF(B119=\"\",\"\",IF(M119<>COUNTA(C119:G119),\"\",IF(I119=1,Hauptmaske!J119/Stammdaten!$N$4,IF(I119=2,Hauptmaske!J119/Stammdaten!$N$5,IF(I119=3,Hauptmaske!J119/Stammdaten!$N$6,IF(I119=4,Hauptmaske!J119/Stammdaten!$N$7,IF(I119=5,Hauptmaske!J119/Stammdaten!$N$8,\"\")))))))","v":""},null,{"$f":"IF(I119=1,Stammdaten!$O$4,IF(Hauptmaske!I119=2,Stammdaten!$O$5,IF(Hauptmaske!I119=3,Stammdaten!$O$6,IF(Hauptmaske!I119=4,Stammdaten!$O$7,IF(Hauptmaske!I119=5,Stammdaten!$O$8,\"\")))))","v":""}]
["116.",null,null,null,null,null,null,{"$f":"IF(Stammdaten!$C$9=0,\"\",IF(I120=4,Stammdaten!$C$9,\"\"))","v":""},null,"",{"$f":"IF(B120=\"\",\"\",IF(M120<>COUNTA(C120:G120),\"\",IF(I120=1,Hauptmaske!J120/Stammdaten!$N$4,IF(I120=2,Hauptmaske!J120/Stammdaten!$N$5,IF(I120=3,Hauptmaske!J120/Stammdaten!$N$6,IF(I120=4,Hauptmaske!J120/Stammdaten!$N$7,IF(I120=5,Hauptmaske!J120/Stammdaten!$N$8,\"\")))))))","v":""},null,{"$f":"IF(I120=1,Stammdaten!$O$4,IF(Hauptmaske!I120=2,Stammdaten!$O$5,IF(Hauptmaske!I120=3,Stammdaten!$O$6,IF(Hauptmaske!I120=4,Stammdaten!$O$7,IF(Hauptmaske!I120=5,Stammdaten!$O$8,\"\")))))","v":""}]
["117.",null,null,null,null,null,null,{"$f":"IF(Stammdaten!$C$9=0,\"\",IF(I121=4,Stammdaten!$C$9,\"\"))","v":""},null,"",{"$f":"IF(B121=\"\",\"\",IF(M121<>COUNTA(C121:G121),\"\",IF(I121=1,Hauptmaske!J121/Stammdaten!$N$4,IF(I121=2,Hauptmaske!J121/Stammdaten!$N$5,IF(I121=3,Hauptmaske!J121/Stammdaten!$N$6,IF(I121=4,Hauptmaske!J121/Stammdaten!$N$7,IF(I121=5,Hauptmaske!J121/Stammdaten!$N$8,\"\")))))))","v":""},null,{"$f":"IF(I121=1,Stammdaten!$O$4,IF(Hauptmaske!I121=2,Stammdaten!$O$5,IF(Hauptmaske!I121=3,Stammdaten!$O$6,IF(Hauptmaske!I121=4,Stammdaten!$O$7,IF(Hauptmaske!I121=5,Stammdaten!$O$8,\"\")))))","v":""}]
["118.",null,null,null,null,null,null,{"$f":"IF(Stammdaten!$C$9=0,\"\",IF(I122=4,Stammdaten!$C$9,\"\"))","v":""},null,"",{"$f":"IF(B122=\"\",\"\",IF(M122<>COUNTA(C122:G122),\"\",IF(I122=1,Hauptmaske!J122/Stammdaten!$N$4,IF(I122=2,Hauptmaske!J122/Stammdaten!$N$5,IF(I122=3,Hauptmaske!J122/Stammdaten!$N$6,IF(I122=4,Hauptmaske!J122/Stammdaten!$N$7,IF(I122=5,Hauptmaske!J122/Stammdaten!$N$8,\"\")))))))","v":""},null,{"$f":"IF(I122=1,Stammdaten!$O$4,IF(Hauptmaske!I122=2,Stammdaten!$O$5,IF(Hauptmaske!I122=3,Stammdaten!$O$6,IF(Hauptmaske!I122=4,Stammdaten!$O$7,IF(Hauptmaske!I122=5,Stammdaten!$O$8,\"\")))))","v":""}]
["119.",null,null,null,null,null,null,{"$f":"IF(Stammdaten!$C$9=0,\"\",IF(I123=4,Stammdaten!$C$9,\"\"))","v":""},null,"",{"$f":"IF(B123=\"\",\"\",IF(M123<>COUNTA(C123:G123),\"\",IF(I123=1,Hauptmaske!J123/Stammdaten!$N$4,IF(I123=2,Hauptmaske!J123/Stammdaten!$N$5,IF(I123=3,Hauptmaske!J123/Stammdaten!$N$6,IF(I123=4,Hauptmaske!J123/Stammdaten!$N$7,IF(I123=5,Hauptmaske!J123/Stammdaten!$N$8,\"\")))))))","v":""},null,{"$f":"IF(I123=1,Stammdaten!$O$4,IF(Hauptmaske!I123=2,Stammdaten!$O$5,IF(Hauptmaske!I123=3,Stammdaten!$O$6,IF(Hauptmaske!I123=4,Stammdaten!$O$7,IF(Hauptmaske!I123=5,Stammdaten!$O$8,\"\")))))","v":""}]
["120.",null,null,null,null,null,null,{"$f":"IF(Stammdaten!$C$9=0,\"\",IF(I124=4,Stammdaten!$C$9,\"\"))","v":""},null,"",{"$f":"IF(B124=\"\",\"\",IF(M124<>COUNTA(C124:G124),\"\",IF(I124=1,Hauptmaske!J124/Stammdaten!$N$4,IF(I124=2,Hauptmaske!J124/Stammdaten!$N$5,IF(I124=3,Hauptmaske!J124/Stammdaten!$N$6,IF(I124=4,Hauptmaske!J124/Stammdaten!$N$7,IF(I124=5,Hauptmaske!J124/Stammdaten!$N$8,\"\")))))))","v":""},null,{"$f":"IF(I124=1,Stammdaten!$O$4,IF(Hauptmaske!I124=2,Stammdaten!$O$5,IF(Hauptmaske!I124=3,Stammdaten!$O$6,IF(Hauptmaske!I124=4,Stammdaten!$O$7,IF(Hauptmaske!I124=5,Stammdaten!$O$8,\"\")))))","v":""}]
["121.",null,null,null,null,null,null,{"$f":"IF(Stammdaten!$C$9=0,\"\",IF(I125=4,Stammdaten!$C$9,\"\"))","v":""},null,"",{"$f":"IF(B125=\"\",\"\",IF(M125<>COUNTA(C125:G125),\"\",IF(I125=1,Hauptmaske!J125/Stammdaten!$N$4,IF(I125=2,Hauptmaske!J125/Stammdaten!$N$5,IF(I125=3,Hauptmaske!J125/Stammdaten!$N$6,IF(I125=4,Hauptmaske!J125/Stammdaten!$N$7,IF(I125=5,Hauptmaske!J125/Stammdaten!$N$8,\"\")))))))","v":""},null,{"$f":"IF(I125=1,Stammdaten!$O$4,IF(Hauptmaske!I125=2,Stammdaten!$O$5,IF(Hauptmaske!I125=3,Stammdaten!$O$6,IF(Hauptmaske!I125=4,Stammdaten!$O$7,IF(Hauptmaske!I125=5,Stammdaten!$O$8,\"\")))))","v":""}]
["122.",null,null,null,null,null,null,{"$f":"IF(Stammdaten!$C$9=0,\"\",IF(I126=4,Stammdaten!$C$9,\"\"))","v":""},null,"",{"$f":"IF(B126=\"\",\"\",IF(M126<>COUNTA(C126:G126),\"\",IF(I126=1,Hauptmaske!J126/Stammdaten!$N$4,IF(I126=2,Hauptmaske!J126/Stammdaten!$N$5,IF(I126=3,Hauptmaske!J126/Stammdaten!$N$6,IF(I126=4,Hauptmaske!J126/Stammdaten!$N$7,IF(I126=5,Hauptmaske!J126/Stammdaten!$N$8,\"\")))))))","v":""},null,{"$f":"IF(I126=1,Stammdaten!$O$4,IF(Hauptmaske!I126=2,Stammdaten!$O$5,IF(Hauptmaske!I126=3,Stammdaten!$O$6,IF(Hauptmaske!I126=4,Stammdaten!$O$7,IF(Hauptmaske!I126=5,Stammdaten!$O$8,\"\")))))","v":""}]
["123.",null,null,null,null,null,null,{"$f":"IF(Stammdaten!$C$9=0,\"\",IF(I127=4,Stammdaten!$C$9,\"\"))","v":""},null,"",{"$f":"IF(B127=\"\",\"\",IF(M127<>COUNTA(C127:G127),\"\",IF(I127=1,Hauptmaske!J127/Stammdaten!$N$4,IF(I127=2,Hauptmaske!J127/Stammdaten!$N$5,IF(I127=3,Hauptmaske!J127/Stammdaten!$N$6,IF(I127=4,Hauptmaske!J127/Stammdaten!$N$7,IF(I127=5,Hauptmaske!J127/Stammdaten!$N$8,\"\")))))))","v":""},null,{"$f":"IF(I127=1,Stammdaten!$O$4,IF(Hauptmaske!I127=2,Stammdaten!$O$5,IF(Hauptmaske!I127=3,Stammdaten!$O$6,IF(Hauptmaske!I127=4,Stammdaten!$O$7,IF(Hauptmaske!I127=5,Stammdaten!$O$8,\"\")))))","v":""}]
["124.",null,null,null,null,null,null,{"$f":"IF(Stammdaten!$C$9=0,\"\",IF(I128=4,Stammdaten!$C$9,\"\"))","v":""},null,"",{"$f":"IF(B128=\"\",\"\",IF(M128<>COUNTA(C128:G128),\"\",IF(I128=1,Hauptmaske!J128/Stammdaten!$N$4,IF(I128=2,Hauptmaske!J128/Stammdaten!$N$5,IF(I128=3,Hauptmaske!J128/Stammdaten!$N$6,IF(I128=4,Hauptmaske!J128/Stammdaten!$N$7,IF(I128=5,Hauptmaske!J128/Stammdaten!$N$8,\"\")))))))","v":""},null,{"$f":"IF(I128=1,Stammdaten!$O$4,IF(Hauptmaske!I128=2,Stammdaten!$O$5,IF(Hauptmaske!I128=3,Stammdaten!$O$6,IF(Hauptmaske!I128=4,Stammdaten!$O$7,IF(Hauptmaske!I128=5,Stammdaten!$O$8,\"\")))))","v":""}]
["125.",null,null,null,null,null,null,{"$f":"IF(Stammdaten!$C$9=0,\"\",IF(I129=4,Stammdaten!$C$9,\"\"))","v":""},null,"",{"$f":"IF(B129=\"\",\"\",IF(M129<>COUNTA(C129:G129),\"\",IF(I129=1,Hauptmaske!J129/Stammdaten!$N$4,IF(I129=2,Hauptmaske!J129/Stammdaten!$N$5,IF(I129=3,Hauptmaske!J129/Stammdaten!$N$6,IF(I129=4,Hauptmaske!J129/Stammdaten!$N$7,IF(I129=5,Hauptmaske!J129/Stammdaten!$N$8,\"\")))))))","v":""},null,{"$f":"IF(I129=1,Stammdaten!$O$4,IF(Hauptmaske!I129=2,Stammdaten!$O$5,IF(Hauptmaske!I129=3,Stammdaten!$O$6,IF(Hauptmaske!I129=4,Stammdaten!$O$7,IF(Hauptmaske!I129=5,Stammdaten!$O$8,\"\")))))","v":""}]
["126.",null,null,null,null,null,null,{"$f":"IF(Stammdaten!$C$9=0,\"\",IF(I130=4,Stammdaten!$C$9,\"\"))","v":""},null,"",{"$f":"IF(B130=\"\",\"\",IF(M130<>COUNTA(C130:G130),\"\",IF(I130=1,Hauptmaske!J130/Stammdaten!$N$4,IF(I130=2,Hauptmaske!J130/Stammdaten!$N$5,IF(I130=3,Hauptmaske!J130/Stammdaten!$N$6,IF(I130=4,Hauptmaske!J130/Stammdaten!$N$7,IF(I130=5,Hauptmaske!J130/Stammdaten!$N$8,\"\")))))))","v":""},null,{"$f":"IF(I130=1,Stammdaten!$O$4,IF(Hauptmaske!I130=2,Stammdaten!$O$5,IF(Hauptmaske!I130=3,Stammdaten!$O$6,IF(Hauptmaske!I130=4,Stammdaten!$O$7,IF(Hauptmaske!I130=5,Stammdaten!$O$8,\"\")))))","v":""}]
["127.",null,null,null,null,null,null,{"$f":"IF(Stammdaten!$C$9=0,\"\",IF(I131=4,Stammdaten!$C$9,\"\"))","v":""},null,"",{"$f":"IF(B131=\"\",\"\",IF(M131<>COUNTA(C131:G131),\"\",IF(I131=1,Hauptmaske!J131/Stammdaten!$N$4,IF(I131=2,Hauptmaske!J131/Stammdaten!$N$5,IF(I131=3,Hauptmaske!J131/Stammdaten!$N$6,IF(I131=4,Hauptmaske!J131/Stammdaten!$N$7,IF(I131=5,Hauptmaske!J131/Stammdaten!$N$8,\"\")))))))","v":""},null,{"$f":"IF(I131=1,Stammdaten!$O$4,IF(Hauptmaske!I131=2,Stammdaten!$O$5,IF(Hauptmaske!I131=3,Stammdaten!$O$6,IF(Hauptmaske!I131=4,Stammdaten!$O$7,IF(Hauptmaske!I131=5,Stammdaten!$O$8,\"\")))))","v":""}]
["128.",null,null,null,null,null,null,{"$f":"IF(Stammdaten!$C$9=0,\"\",IF(I132=4,Stammdaten!$C$9,\"\"))","v":""},null,"",{"$f":"IF(B132=\"\",\"\",IF(M132<>COUNTA(C132:G132),\"\",IF(I132=1,Hauptmaske!J132/Stammdaten!$N$4,IF(I132=2,Hauptmaske!J132/Stammdaten!$N$5,IF(I132=3,Hauptmaske!J132/Stammdaten!$N$6,IF(I132=4,Hauptmaske!J132/Stammdaten!$N$7,IF(I132=5,Hauptmaske!J132/Stammdaten!$N$8,\"\")))))))","v":""},null,{"$f":"IF(I132=1,Stammdaten!$O$4,IF(Hauptmaske!I132=2,Stammdaten!$O$5,IF(Hauptmaske!I132=3,Stammdaten!$O$6,IF(Hauptmaske!I132=4,Stammdaten!$O$7,IF(Hauptmaske!I132=5,Stammdaten!$O$8,\"\")))))","v":""}]
["129.",null,null,null,null,null,null,{"$f":"IF(Stammdaten!$C$9=0,\"\",IF(I133=4,Stammdaten!$C$9,\"\"))","v":""},null,"",{"$f":"IF(B133=\"\",\"\",IF(M133<>COUNTA(C133:G133),\"\",IF(I133=1,Hauptmaske!J133/Stammdaten!$N$4,IF(I133=2,Hauptmaske!J133/Stammdaten!$N$5,IF(I133=3,Hauptmaske!J133/Stammdaten!$N$6,IF(I133=4,Hauptmaske!J133/Stammdaten!$N$7,IF(I133=5,Hauptmaske!J133/Stammdaten!$N$8,\"\")))))))","v":""},null,{"$f":"IF(I133=1,Stammdaten!$O$4,IF(Hauptmaske!I133=2,Stammdaten!$O$5,IF(Hauptmaske!I133=3,Stammdaten!$O$6,IF(Hauptmaske!I133=4,Stammdaten!$O$7,IF(Hauptmaske!I133=5,Stammdaten!$O$8,\"\")))))","v":""}]
["130.",null,null,null,null,null,null,{"$f":"IF(Stammdaten!$C$9=0,\"\",IF(I134=4,Stammdaten!$C$9,\"\"))","v":""},null,"",{"$f":"IF(B134=\"\",\"\",IF(M134<>COUNTA(C134:G134),\"\",IF(I134=1,Hauptmaske!J134/Stammdaten!$N$4,IF(I134=2,Hauptmaske!J134/Stammdaten!$N$5,IF(I134=3,Hauptmaske!J134/Stammdaten!$N$6,IF(I134=4,Hauptmaske!J134/Stammdaten!$N$7,IF(I134=5,Hauptmaske!J134/Stammdaten!$N$8,\"\")))))))","v":""},null,{"$f":"IF(I134=1,Stammdaten!$O$4,IF(Hauptmaske!I134=2,Stammdaten!$O$5,IF(Hauptmaske!I134=3,Stammdaten!$O$6,IF(Hauptmaske!I134=4,Stammdaten!$O$7,IF(Hauptmaske!I134=5,Stammdaten!$O$8,\"\")))))","v":""}]
["131.",null,null,null,null,null,null,{"$f":"IF(Stammdaten!$C$9=0,\"\",IF(I135=4,Stammdaten!$C$9,\"\"))","v":""},null,"",{"$f":"IF(B135=\"\",\"\",IF(M135<>COUNTA(C135:G135),\"\",IF(I135=1,Hauptmaske!J135/Stammdaten!$N$4,IF(I135=2,Hauptmaske!J135/Stammdaten!$N$5,IF(I135=3,Hauptmaske!J135/Stammdaten!$N$6,IF(I135=4,Hauptmaske!J135/Stammdaten!$N$7,IF(I135=5,Hauptmaske!J135/Stammdaten!$N$8,\"\")))))))","v":""},null,{"$f":"IF(I135=1,Stammdaten!$O$4,IF(Hauptmaske!I135=2,Stammdaten!$O$5,IF(Hauptmaske!I135=3,Stammdaten!$O$6,IF(Hauptmaske!I135=4,Stammdaten!$O$7,IF(Hauptmaske!I135=5,Stammdaten!$O$8,\"\")))))","v":""}]
["132.",null,null,null,null,null,null,{"$f":"IF(Stammdaten!$C$9=0,\"\",IF(I136=4,Stammdaten!$C$9,\"\"))","v":""},null,"",{"$f":"IF(B136=\"\",\"\",IF(M136<>COUNTA(C136:G136),\"\",IF(I136=1,Hauptmaske!J136/Stammdaten!$N$4,IF(I136=2,Hauptmaske!J136/Stammdaten!$N$5,IF(I136=3,Hauptmaske!J136/Stammdaten!$N$6,IF(I136=4,Hauptmaske!J136/Stammdaten!$N$7,IF(I136=5,Hauptmaske!J136/Stammdaten!$N$8,\"\")))))))","v":""},null,{"$f":"IF(I136=1,Stammdaten!$O$4,IF(Hauptmaske!I136=2,Stammdaten!$O$5,IF(Hauptmaske!I136=3,Stammdaten!$O$6,IF(Hauptmaske!I136=4,Stammdaten!$O$7,IF(Hauptmaske!I136=5,Stammdaten!$O$8,\"\")))))","v":""}]
["133.",null,null,null,null,null,null,{"$f":"IF(Stammdaten!$C$9=0,\"\",IF(I137=4,Stammdaten!$C$9,\"\"))","v":""},null,"",{"$f":"IF(B137=\"\",\"\",IF(M137<>COUNTA(C137:G137),\"\",IF(I137=1,Hauptmaske!J137/Stammdaten!$N$4,IF(I137=2,Hauptmaske!J137/Stammdaten!$N$5,IF(I137=3,Hauptmaske!J137/Stammdaten!$N$6,IF(I137=4,Hauptmaske!J137/Stammdaten!$N$7,IF(I137=5,Hauptmaske!J137/Stammdaten!$N$8,\"\")))))))","v":""},null,{"$f":"IF(I137=1,Stammdaten!$O$4,IF(Hauptmaske!I137=2,Stammdaten!$O$5,IF(Hauptmaske!I137=3,Stammdaten!$O$6,IF(Hauptmaske!I137=4,Stammdaten!$O$7,IF(Hauptmaske!I137=5,Stammdaten!$O$8,\"\")))))","v":""}]
["134.",null,null,null,null,null,null,{"$f":"IF(Stammdaten!$C$9=0,\"\",IF(I138=4,Stammdaten!$C$9,\"\"))","v":""},null,"",{"$f":"IF(B138=\"\",\"\",IF(M138<>COUNTA(C138:G138),\"\",IF(I138=1,Hauptmaske!J138/Stammdaten!$N$4,IF(I138=2,Hauptmaske!J138/Stammdaten!$N$5,IF(I138=3,Hauptmaske!J138/Stammdaten!$N$6,IF(I138=4,Hauptmaske!J138/Stammdaten!$N$7,IF(I138=5,Hauptmaske!J138/Stammdaten!$N$8,\"\")))))))","v":""},null,{"$f":"IF(I138=1,Stammdaten!$O$4,IF(Hauptmaske!I138=2,Stammdaten!$O$5,IF(Hauptmaske!I138=3,Stammdaten!$O$6,IF(Hauptmaske!I138=4,Stammdaten!$O$7,IF(Hauptmaske!I138=5,Stammdaten!$O$8,\"\")))))","v":""}]
["135.",null,null,null,null,null,null,{"$f":"IF(Stammdaten!$C$9=0,\"\",IF(I139=4,Stammdaten!$C$9,\"\"))","v":""},null,"",{"$f":"IF(B139=\"\",\"\",IF(M139<>COUNTA(C139:G139),\"\",IF(I139=1,Hauptmaske!J139/Stammdaten!$N$4,IF(I139=2,Hauptmaske!J139/Stammdaten!$N$5,IF(I139=3,Hauptmaske!J139/Stammdaten!$N$6,IF(I139=4,Hauptmaske!J139/Stammdaten!$N$7,IF(I139=5,Hauptmaske!J139/Stammdaten!$N$8,\"\")))))))","v":""},null,{"$f":"IF(I139=1,Stammdaten!$O$4,IF(Hauptmaske!I139=2,Stammdaten!$O$5,IF(Hauptmaske!I139=3,Stammdaten!$O$6,IF(Hauptmaske!I139=4,Stammdaten!$O$7,IF(Hauptmaske!I139=5,Stammdaten!$O$8,\"\")))))","v":""}]
["136.",null,null,null,null,null,null,{"$f":"IF(Stammdaten!$C$9=0,\"\",IF(I140=4,Stammdaten!$C$9,\"\"))","v":""},null,"",{"$f":"IF(B140=\"\",\"\",IF(M140<>COUNTA(C140:G140),\"\",IF(I140=1,Hauptmaske!J140/Stammdaten!$N$4,IF(I140=2,Hauptmaske!J140/Stammdaten!$N$5,IF(I140=3,Hauptmaske!J140/Stammdaten!$N$6,IF(I140=4,Hauptmaske!J140/Stammdaten!$N$7,IF(I140=5,Hauptmaske!J140/Stammdaten!$N$8,\"\")))))))","v":""},null,{"$f":"IF(I140=1,Stammdaten!$O$4,IF(Hauptmaske!I140=2,Stammdaten!$O$5,IF(Hauptmaske!I140=3,Stammdaten!$O$6,IF(Hauptmaske!I140=4,Stammdaten!$O$7,IF(Hauptmaske!I140=5,Stammdaten!$O$8,\"\")))))","v":""}]
["137.",null,null,null,null,null,null,{"$f":"IF(Stammdaten!$C$9=0,\"\",IF(I141=4,Stammdaten!$C$9,\"\"))","v":""},null,"",{"$f":"IF(B141=\"\",\"\",IF(M141<>COUNTA(C141:G141),\"\",IF(I141=1,Hauptmaske!J141/Stammdaten!$N$4,IF(I141=2,Hauptmaske!J141/Stammdaten!$N$5,IF(I141=3,Hauptmaske!J141/Stammdaten!$N$6,IF(I141=4,Hauptmaske!J141/Stammdaten!$N$7,IF(I141=5,Hauptmaske!J141/Stammdaten!$N$8,\"\")))))))","v":""},null,{"$f":"IF(I141=1,Stammdaten!$O$4,IF(Hauptmaske!I141=2,Stammdaten!$O$5,IF(Hauptmaske!I141=3,Stammdaten!$O$6,IF(Hauptmaske!I141=4,Stammdaten!$O$7,IF(Hauptmaske!I141=5,Stammdaten!$O$8,\"\")))))","v":""}]
["138.",null,null,null,null,null,null,{"$f":"IF(Stammdaten!$C$9=0,\"\",IF(I142=4,Stammdaten!$C$9,\"\"))","v":""},null,"",{"$f":"IF(B142=\"\",\"\",IF(M142<>COUNTA(C142:G142),\"\",IF(I142=1,Hauptmaske!J142/Stammdaten!$N$4,IF(I142=2,Hauptmaske!J142/Stammdaten!$N$5,IF(I142=3,Hauptmaske!J142/Stammdaten!$N$6,IF(I142=4,Hauptmaske!J142/Stammdaten!$N$7,IF(I142=5,Hauptmaske!J142/Stammdaten!$N$8,\"\")))))))","v":""},null,{"$f":"IF(I142=1,Stammdaten!$O$4,IF(Hauptmaske!I142=2,Stammdaten!$O$5,IF(Hauptmaske!I142=3,Stammdaten!$O$6,IF(Hauptmaske!I142=4,Stammdaten!$O$7,IF(Hauptmaske!I142=5,Stammdaten!$O$8,\"\")))))","v":""}]
["139.",null,null,null,null,null,null,{"$f":"IF(Stammdaten!$C$9=0,\"\",IF(I143=4,Stammdaten!$C$9,\"\"))","v":""},null,"",{"$f":"IF(B143=\"\",\"\",IF(M143<>COUNTA(C143:G143),\"\",IF(I143=1,Hauptmaske!J143/Stammdaten!$N$4,IF(I143=2,Hauptmaske!J143/Stammdaten!$N$5,IF(I143=3,Hauptmaske!J143/Stammdaten!$N$6,IF(I143=4,Hauptmaske!J143/Stammdaten!$N$7,IF(I143=5,Hauptmaske!J143/Stammdaten!$N$8,\"\")))))))","v":""},null,{"$f":"IF(I143=1,Stammdaten!$O$4,IF(Hauptmaske!I143=2,Stammdaten!$O$5,IF(Hauptmaske!I143=3,Stammdaten!$O$6,IF(Hauptmaske!I143=4,Stammdaten!$O$7,IF(Hauptmaske!I143=5,Stammdaten!$O$8,\"\")))))","v":""}]
["140.",null,null,null,null,null,null,{"$f":"IF(Stammdaten!$C$9=0,\"\",IF(I144=4,Stammdaten!$C$9,\"\"))","v":""},null,"",{"$f":"IF(B144=\"\",\"\",IF(M144<>COUNTA(C144:G144),\"\",IF(I144=1,Hauptmaske!J144/Stammdaten!$N$4,IF(I144=2,Hauptmaske!J144/Stammdaten!$N$5,IF(I144=3,Hauptmaske!J144/Stammdaten!$N$6,IF(I144=4,Hauptmaske!J144/Stammdaten!$N$7,IF(I144=5,Hauptmaske!J144/Stammdaten!$N$8,\"\")))))))","v":""},null,{"$f":"IF(I144=1,Stammdaten!$O$4,IF(Hauptmaske!I144=2,Stammdaten!$O$5,IF(Hauptmaske!I144=3,Stammdaten!$O$6,IF(Hauptmaske!I144=4,Stammdaten!$O$7,IF(Hauptmaske!I144=5,Stammdaten!$O$8,\"\")))))","v":""}]
["141.",null,null,null,null,null,null,{"$f":"IF(Stammdaten!$C$9=0,\"\",IF(I145=4,Stammdaten!$C$9,\"\"))","v":""},null,"",{"$f":"IF(B145=\"\",\"\",IF(M145<>COUNTA(C145:G145),\"\",IF(I145=1,Hauptmaske!J145/Stammdaten!$N$4,IF(I145=2,Hauptmaske!J145/Stammdaten!$N$5,IF(I145=3,Hauptmaske!J145/Stammdaten!$N$6,IF(I145=4,Hauptmaske!J145/Stammdaten!$N$7,IF(I145=5,Hauptmaske!J145/Stammdaten!$N$8,\"\")))))))","v":""},null,{"$f":"IF(I145=1,Stammdaten!$O$4,IF(Hauptmaske!I145=2,Stammdaten!$O$5,IF(Hauptmaske!I145=3,Stammdaten!$O$6,IF(Hauptmaske!I145=4,Stammdaten!$O$7,IF(Hauptmaske!I145=5,Stammdaten!$O$8,\"\")))))","v":""}]
["142.",null,null,null,null,null,null,{"$f":"IF(Stammdaten!$C$9=0,\"\",IF(I146=4,Stammdaten!$C$9,\"\"))","v":""},null,"",{"$f":"IF(B146=\"\",\"\",IF(M146<>COUNTA(C146:G146),\"\",IF(I146=1,Hauptmaske!J146/Stammdaten!$N$4,IF(I146=2,Hauptmaske!J146/Stammdaten!$N$5,IF(I146=3,Hauptmaske!J146/Stammdaten!$N$6,IF(I146=4,Hauptmaske!J146/Stammdaten!$N$7,IF(I146=5,Hauptmaske!J146/Stammdaten!$N$8,\"\")))))))","v":""},null,{"$f":"IF(I146=1,Stammdaten!$O$4,IF(Hauptmaske!I146=2,Stammdaten!$O$5,IF(Hauptmaske!I146=3,Stammdaten!$O$6,IF(Hauptmaske!I146=4,Stammdaten!$O$7,IF(Hauptmaske!I146=5,Stammdaten!$O$8,\"\")))))","v":""}]
["143.",null,null,null,null,null,null,{"$f":"IF(Stammdaten!$C$9=0,\"\",IF(I147=4,Stammdaten!$C$9,\"\"))","v":""},null,"",{"$f":"IF(B147=\"\",\"\",IF(M147<>COUNTA(C147:G147),\"\",IF(I147=1,Hauptmaske!J147/Stammdaten!$N$4,IF(I147=2,Hauptmaske!J147/Stammdaten!$N$5,IF(I147=3,Hauptmaske!J147/Stammdaten!$N$6,IF(I147=4,Hauptmaske!J147/Stammdaten!$N$7,IF(I147=5,Hauptmaske!J147/Stammdaten!$N$8,\"\")))))))","v":""},null,{"$f":"IF(I147=1,Stammdaten!$O$4,IF(Hauptmaske!I147=2,Stammdaten!$O$5,IF(Hauptmaske!I147=3,Stammdaten!$O$6,IF(Hauptmaske!I147=4,Stammdaten!$O$7,IF(Hauptmaske!I147=5,Stammdaten!$O$8,\"\")))))","v":""}]
["144.",null,null,null,null,null,null,{"$f":"IF(Stammdaten!$C$9=0,\"\",IF(I148=4,Stammdaten!$C$9,\"\"))","v":""},null,"",{"$f":"IF(B148=\"\",\"\",IF(M148<>COUNTA(C148:G148),\"\",IF(I148=1,Hauptmaske!J148/Stammdaten!$N$4,IF(I148=2,Hauptmaske!J148/Stammdaten!$N$5,IF(I148=3,Hauptmaske!J148/Stammdaten!$N$6,IF(I148=4,Hauptmaske!J148/Stammdaten!$N$7,IF(I148=5,Hauptmaske!J148/Stammdaten!$N$8,\"\")))))))","v":""},null,{"$f":"IF(I148=1,Stammdaten!$O$4,IF(Hauptmaske!I148=2,Stammdaten!$O$5,IF(Hauptmaske!I148=3,Stammdaten!$O$6,IF(Hauptmaske!I148=4,Stammdaten!$O$7,IF(Hauptmaske!I148=5,Stammdaten!$O$8,\"\")))))","v":""}]
["145.",null,null,null,null,null,null,{"$f":"IF(Stammdaten!$C$9=0,\"\",IF(I149=4,Stammdaten!$C$9,\"\"))","v":""},null,"",{"$f":"IF(B149=\"\",\"\",IF(M149<>COUNTA(C149:G149),\"\",IF(I149=1,Hauptmaske!J149/Stammdaten!$N$4,IF(I149=2,Hauptmaske!J149/Stammdaten!$N$5,IF(I149=3,Hauptmaske!J149/Stammdaten!$N$6,IF(I149=4,Hauptmaske!J149/Stammdaten!$N$7,IF(I149=5,Hauptmaske!J149/Stammdaten!$N$8,\"\")))))))","v":""},null,{"$f":"IF(I149=1,Stammdaten!$O$4,IF(Hauptmaske!I149=2,Stammdaten!$O$5,IF(Hauptmaske!I149=3,Stammdaten!$O$6,IF(Hauptmaske!I149=4,Stammdaten!$O$7,IF(Hauptmaske!I149=5,Stammdaten!$O$8,\"\")))))","v":""}]
["146.",null,null,null,null,null,null,{"$f":"IF(Stammdaten!$C$9=0,\"\",IF(I150=4,Stammdaten!$C$9,\"\"))","v":""},null,"",{"$f":"IF(B150=\"\",\"\",IF(M150<>COUNTA(C150:G150),\"\",IF(I150=1,Hauptmaske!J150/Stammdaten!$N$4,IF(I150=2,Hauptmaske!J150/Stammdaten!$N$5,IF(I150=3,Hauptmaske!J150/Stammdaten!$N$6,IF(I150=4,Hauptmaske!J150/Stammdaten!$N$7,IF(I150=5,Hauptmaske!J150/Stammdaten!$N$8,\"\")))))))","v":""},null,{"$f":"IF(I150=1,Stammdaten!$O$4,IF(Hauptmaske!I150=2,Stammdaten!$O$5,IF(Hauptmaske!I150=3,Stammdaten!$O$6,IF(Hauptmaske!I150=4,Stammdaten!$O$7,IF(Hauptmaske!I150=5,Stammdaten!$O$8,\"\")))))","v":""}]
["147.",null,null,null,null,null,null,{"$f":"IF(Stammdaten!$C$9=0,\"\",IF(I151=4,Stammdaten!$C$9,\"\"))","v":""},null,"",{"$f":"IF(B151=\"\",\"\",IF(M151<>COUNTA(C151:G151),\"\",IF(I151=1,Hauptmaske!J151/Stammdaten!$N$4,IF(I151=2,Hauptmaske!J151/Stammdaten!$N$5,IF(I151=3,Hauptmaske!J151/Stammdaten!$N$6,IF(I151=4,Hauptmaske!J151/Stammdaten!$N$7,IF(I151=5,Hauptmaske!J151/Stammdaten!$N$8,\"\")))))))","v":""},null,{"$f":"IF(I151=1,Stammdaten!$O$4,IF(Hauptmaske!I151=2,Stammdaten!$O$5,IF(Hauptmaske!I151=3,Stammdaten!$O$6,IF(Hauptmaske!I151=4,Stammdaten!$O$7,IF(Hauptmaske!I151=5,Stammdaten!$O$8,\"\")))))","v":""}]
["148.",null,null,null,null,null,null,{"$f":"IF(Stammdaten!$C$9=0,\"\",IF(I152=4,Stammdaten!$C$9,\"\"))","v":""},null,"",{"$f":"IF(B152=\"\",\"\",IF(M152<>COUNTA(C152:G152),\"\",IF(I152=1,Hauptmaske!J152/Stammdaten!$N$4,IF(I152=2,Hauptmaske!J152/Stammdaten!$N$5,IF(I152=3,Hauptmaske!J152/Stammdaten!$N$6,IF(I152=4,Hauptmaske!J152/Stammdaten!$N$7,IF(I152=5,Hauptmaske!J152/Stammdaten!$N$8,\"\")))))))","v":""},null,{"$f":"IF(I152=1,Stammdaten!$O$4,IF(Hauptmaske!I152=2,Stammdaten!$O$5,IF(Hauptmaske!I152=3,Stammdaten!$O$6,IF(Hauptmaske!I152=4,Stammdaten!$O$7,IF(Hauptmaske!I152=5,Stammdaten!$O$8,\"\")))))","v":""}]
["149.",null,null,null,null,null,null,{"$f":"IF(Stammdaten!$C$9=0,\"\",IF(I153=4,Stammdaten!$C$9,\"\"))","v":""},null,"",{"$f":"IF(B153=\"\",\"\",IF(M153<>COUNTA(C153:G153),\"\",IF(I153=1,Hauptmaske!J153/Stammdaten!$N$4,IF(I153=2,Hauptmaske!J153/Stammdaten!$N$5,IF(I153=3,Hauptmaske!J153/Stammdaten!$N$6,IF(I153=4,Hauptmaske!J153/Stammdaten!$N$7,IF(I153=5,Hauptmaske!J153/Stammdaten!$N$8,\"\")))))))","v":""},null,{"$f":"IF(I153=1,Stammdaten!$O$4,IF(Hauptmaske!I153=2,Stammdaten!$O$5,IF(Hauptmaske!I153=3,Stammdaten!$O$6,IF(Hauptmaske!I153=4,Stammdaten!$O$7,IF(Hauptmaske!I153=5,Stammdaten!$O$8,\"\")))))","v":""}]
["150.",null,null,null,null,null,null,{"$f":"IF(Stammdaten!$C$9=0,\"\",IF(I154=4,Stammdaten!$C$9,\"\"))","v":""},null,"",{"$f":"IF(B154=\"\",\"\",IF(M154<>COUNTA(C154:G154),\"\",IF(I154=1,Hauptmaske!J154/Stammdaten!$N$4,IF(I154=2,Hauptmaske!J154/Stammdaten!$N$5,IF(I154=3,Hauptmaske!J154/Stammdaten!$N$6,IF(I154=4,Hauptmaske!J154/Stammdaten!$N$7,IF(I154=5,Hauptmaske!J154/Stammdaten!$N$8,\"\")))))))","v":""},null,{"$f":"IF(I154=1,Stammdaten!$O$4,IF(Hauptmaske!I154=2,Stammdaten!$O$5,IF(Hauptmaske!I154=3,Stammdaten!$O$6,IF(Hauptmaske!I154=4,Stammdaten!$O$7,IF(Hauptmaske!I154=5,Stammdaten!$O$8,\"\")))))","v":""}]

{"sheet":"Datensammler","index":3,"n_rows":151,"n_cols":3,"rows_kept":151,"cut":false,"hidden":false,"merged":[]}
["Name:","Summe:","Klasse:"]
[{"$f":"IF(Hauptmaske!B5=\"\",0,Hauptmaske!B5)","v":0},{"$f":"IF(SUM(Hauptmaske!C5:H5)=0,0,Hauptmaske!J5)","v":0},{"$f":"IF(SUM(Hauptmaske!C5:H5)=0,\"-\",Hauptmaske!I5)","v":"-"}]
[{"$f":"IF(Hauptmaske!B6=\"\",0,Hauptmaske!B6)","v":0},{"$f":"IF(SUM(Hauptmaske!C6:H6)=0,0,Hauptmaske!J6)","v":0},{"$f":"IF(SUM(Hauptmaske!C6:H6)=0,\"-\",Hauptmaske!I6)","v":"-"}]
[{"$f":"IF(Hauptmaske!B7=\"\",0,Hauptmaske!B7)","v":0},{"$f":"IF(SUM(Hauptmaske!C7:H7)=0,0,Hauptmaske!J7)","v":0},{"$f":"IF(SUM(Hauptmaske!C7:H7)=0,\"-\",Hauptmaske!I7)","v":"-"}]
[{"$f":"IF(Hauptmaske!B8=\"\",0,Hauptmaske!B8)","v":0},{"$f":"IF(SUM(Hauptmaske!C8:H8)=0,0,Hauptmaske!J8)","v":0},{"$f":"IF(SUM(Hauptmaske!C8:H8)=0,\"-\",Hauptmaske!I8)","v":"-"}]
[{"$f":"IF(Hauptmaske!B9=\"\",0,Hauptmaske!B9)","v":0},{"$f":"IF(SUM(Hauptmaske!C9:H9)=0,0,Hauptmaske!J9)","v":0},{"$f":"IF(SUM(Hauptmaske!C9:H9)=0,\"-\",Hauptmaske!I9)","v":"-"}]
[{"$f":"IF(Hauptmaske!B10=\"\",0,Hauptmaske!B10)","v":0},{"$f":"IF(SUM(Hauptmaske!C10:H10)=0,0,Hauptmaske!J10)","v":0},{"$f":"IF(SUM(Hauptmaske!C10:H10)=0,\"-\",Hauptmaske!I10)","v":"-"}]
[{"$f":"IF(Hauptmaske!B11=\"\",0,Hauptmaske!B11)","v":0},{"$f":"IF(SUM(Hauptmaske!C11:H11)=0,0,Hauptmaske!J11)","v":0},{"$f":"IF(SUM(Hauptmaske!C11:H11)=0,\"-\",Hauptmaske!I11)","v":"-"}]
[{"$f":"IF(Hauptmaske!B12=\"\",0,Hauptmaske!B12)","v":0},{"$f":"IF(SUM(Hauptmaske!C12:H12)=0,0,Hauptmaske!J12)","v":0},{"$f":"IF(SUM(Hauptmaske!C12:H12)=0,\"-\",Hauptmaske!I12)","v":"-"}]
[{"$f":"IF(Hauptmaske!B13=\"\",0,Hauptmaske!B13)","v":0},{"$f":"IF(SUM(Hauptmaske!C13:H13)=0,0,Hauptmaske!J13)","v":0},{"$f":"IF(SUM(Hauptmaske!C13:H13)=0,\"-\",Hauptmaske!I13)","v":"-"}]
[{"$f":"IF(Hauptmaske!B14=\"\",0,Hauptmaske!B14)","v":0},{"$f":"IF(SUM(Hauptmaske!C14:H14)=0,0,Hauptmaske!J14)","v":0},{"$f":"IF(SUM(Hauptmaske!C14:H14)=0,\"-\",Hauptmaske!I14)","v":"-"}]
[{"$f":"IF(Hauptmaske!B15=\"\",0,Hauptmaske!B15)","v":0},{"$f":"IF(SUM(Hauptmaske!C15:H15)=0,0,Hauptmaske!J15)","v":0},{"$f":"IF(SUM(Hauptmaske!C15:H15)=0,\"-\",Hauptmaske!I15)","v":"-"}]
[{"$f":"IF(Hauptmaske!B16=\"\",0,Hauptmaske!B16)","v":0},{"$f":"IF(SUM(Hauptmaske!C16:H16)=0,0,Hauptmaske!J16)","v":0},{"$f":"IF(SUM(Hauptmaske!C16:H16)=0,\"-\",Hauptmaske!I16)","v":"-"}]
[{"$f":"IF(Hauptmaske!B17=\"\",0,Hauptmaske!B17)","v":0},{"$f":"IF(SUM(Hauptmaske!C17:H17)=0,0,Hauptmaske!J17)","v":0},{"$f":"IF(SUM(Hauptmaske!C17:H17)=0,\"-\",Hauptmaske!I17)","v":"-"}]
[{"$f":"IF(Hauptmaske!B18=\"\",0,Hauptmaske!B18)","v":0},{"$f":"IF(SUM(Hauptmaske!C18:H18)=0,0,Hauptmaske!J18)","v":0},{"$f":"IF(SUM(Hauptmaske!C18:H18)=0,\"-\",Hauptmaske!I18)","v":"-"}]
[{"$f":"IF(Hauptmaske!B19=\"\",0,Hauptmaske!B19)","v":0},{"$f":"IF(SUM(Hauptmaske!C19:H19)=0,0,Hauptmaske!J19)","v":0},{"$f":"IF(SUM(Hauptmaske!C19:H19)=0,\"-\",Hauptmaske!I19)","v":"-"}]
[{"$f":"IF(Hauptmaske!B20=\"\",0,Hauptmaske!B20)","v":0},{"$f":"IF(SUM(Hauptmaske!C20:H20)=0,0,Hauptmaske!J20)","v":0},{"$f":"IF(SUM(Hauptmaske!C20:H20)=0,\"-\",Hauptmaske!I20)","v":"-"}]
[{"$f":"IF(Hauptmaske!B21=\"\",0,Hauptmaske!B21)","v":0},{"$f":"IF(SUM(Hauptmaske!C21:H21)=0,0,Hauptmaske!J21)","v":0},{"$f":"IF(SUM(Hauptmaske!C21:H21)=0,\"-\",Hauptmaske!I21)","v":"-"}]
[{"$f":"IF(Hauptmaske!B22=\"\",0,Hauptmaske!B22)","v":0},{"$f":"IF(SUM(Hauptmaske!C22:H22)=0,0,Hauptmaske!J22)","v":0},{"$f":"IF(SUM(Hauptmaske!C22:H22)=0,\"-\",Hauptmaske!I22)","v":"-"}]
[{"$f":"IF(Hauptmaske!B23=\"\",0,Hauptmaske!B23)","v":0},{"$f":"IF(SUM(Hauptmaske!C23:H23)=0,0,Hauptmaske!J23)","v":0},{"$f":"IF(SUM(Hauptmaske!C23:H23)=0,\"-\",Hauptmaske!I23)","v":"-"}]
[{"$f":"IF(Hauptmaske!B24=\"\",0,Hauptmaske!B24)","v":0},{"$f":"IF(SUM(Hauptmaske!C24:H24)=0,0,Hauptmaske!J24)","v":0},{"$f":"IF(SUM(Hauptmaske!C24:H24)=0,\"-\",Hauptmaske!I24)","v":"-"}]
[{"$f":"IF(Hauptmaske!B25=\"\",0,Hauptmaske!B25)","v":0},{"$f":"IF(SUM(Hauptmaske!C25:H25)=0,0,Hauptmaske!J25)","v":0},{"$f":"IF(SUM(Hauptmaske!C25:H25)=0,\"-\",Hauptmaske!I25)","v":"-"}]
[{"$f":"IF(Hauptmaske!B26=\"\",0,Hauptmaske!B26)","v":0},{"$f":"IF(SUM(Hauptmaske!C26:H26)=0,0,Hauptmaske!J26)","v":0},{"$f":"IF(SUM(Hauptmaske!C26:H26)=0,\"-\",Hauptmaske!I26)","v":"-"}]
[{"$f":"IF(Hauptmaske!B27=\"\",0,Hauptmaske!B27)","v":0},{"$f":"IF(SUM(Hauptmaske!C27:H27)=0,0,Hauptmaske!J27)","v":0},{"$f":"IF(SUM(Hauptmaske!C27:H27)=0,\"-\",Hauptmaske!I27)","v":"-"}]
[{"$f":"IF(Hauptmaske!B28=\"\",0,Hauptmaske!B28)","v":0},{"$f":"IF(SUM(Hauptmaske!C28:H28)=0,0,Hauptmaske!J28)","v":0},{"$f":"IF(SUM(Hauptmaske!C28:H28)=0,\"-\",Hauptmaske!I28)","v":"-"}]
[{"$f":"IF(Hauptmaske!B29=\"\",0,Hauptmaske!B29)","v":0},{"$f":"IF(SUM(Hauptmaske!C29:H29)=0,0,Hauptmaske!J29)","v":0},{"$f":"IF(SUM(Hauptmaske!C29:H29)=0,\"-\",Hauptmaske!I29)","v":"-"}]
[{"$f":"IF(Hauptmaske!B30=\"\",0,Hauptmaske!B30)","v":0},{"$f":"IF(SUM(Hauptmaske!C30:H30)=0,0,Hauptmaske!J30)","v":0},{"$f":"IF(SUM(Hauptmaske!C30:H30)=0,\"-\",Hauptmaske!I30)","v":"-"}]
[{"$f":"IF(Hauptmaske!B31=\"\",0,Hauptmaske!B31)","v":0},{"$f":"IF(SUM(Hauptmaske!C31:H31)=0,0,Hauptmaske!J31)","v":0},{"$f":"IF(SUM(Hauptmaske!C31:H31)=0,\"-\",Hauptmaske!I31)","v":"-"}]
[{"$f":"IF(Hauptmaske!B32=\"\",0,Hauptmaske!B32)","v":0},{"$f":"IF(SUM(Hauptmaske!C32:H32)=0,0,Hauptmaske!J32)","v":0},{"$f":"IF(SUM(Hauptmaske!C32:H32)=0,\"-\",Hauptmaske!I32)","v":"-"}]
[{"$f":"IF(Hauptmaske!B33=\"\",0,Hauptmaske!B33)","v":0},{"$f":"IF(SUM(Hauptmaske!C33:H33)=0,0,Hauptmaske!J33)","v":0},{"$f":"IF(SUM(Hauptmaske!C33:H33)=0,\"-\",Hauptmaske!I33)","v":"-"}]
[{"$f":"IF(Hauptmaske!B34=\"\",0,Hauptmaske!B34)","v":0},{"$f":"IF(SUM(Hauptmaske!C34:H34)=0,0,Hauptmaske!J34)","v":0},{"$f":"IF(SUM(Hauptmaske!C34:H34)=0,\"-\",Hauptmaske!I34)","v":"-"}]
[{"$f":"IF(Hauptmaske!B35=\"\",0,Hauptmaske!B35)","v":0},{"$f":"IF(SUM(Hauptmaske!C35:H35)=0,0,Hauptmaske!J35)","v":0},{"$f":"IF(SUM(Hauptmaske!C35:H35)=0,\"-\",Hauptmaske!I35)","v":"-"}]
[{"$f":"IF(Hauptmaske!B36=\"\",0,Hauptmaske!B36)","v":0},{"$f":"IF(SUM(Hauptmaske!C36:H36)=0,0,Hauptmaske!J36)","v":0},{"$f":"IF(SUM(Hauptmaske!C36:H36)=0,\"-\",Hauptmaske!I36)","v":"-"}]
[{"$f":"IF(Hauptmaske!B37=\"\",0,Hauptmaske!B37)","v":0},{"$f":"IF(SUM(Hauptmaske!C37:H37)=0,0,Hauptmaske!J37)","v":0},{"$f":"IF(SUM(Hauptmaske!C37:H37)=0,\"-\",Hauptmaske!I37)","v":"-"}]
[{"$f":"IF(Hauptmaske!B38=\"\",0,Hauptmaske!B38)","v":0},{"$f":"IF(SUM(Hauptmaske!C38:H38)=0,0,Hauptmaske!J38)","v":0},{"$f":"IF(SUM(Hauptmaske!C38:H38)=0,\"-\",Hauptmaske!I38)","v":"-"}]
[{"$f":"IF(Hauptmaske!B39=\"\",0,Hauptmaske!B39)","v":0},{"$f":"IF(SUM(Hauptmaske!C39:H39)=0,0,Hauptmaske!J39)","v":0},{"$f":"IF(SUM(Hauptmaske!C39:H39)=0,\"-\",Hauptmaske!I39)","v":"-"}]
[{"$f":"IF(Hauptmaske!B40=\"\",0,Hauptmaske!B40)","v":0},{"$f":"IF(SUM(Hauptmaske!C40:H40)=0,0,Hauptmaske!J40)","v":0},{"$f":"IF(SUM(Hauptmaske!C40:H40)=0,\"-\",Hauptmaske!I40)","v":"-"}]
[{"$f":"IF(Hauptmaske!B41=\"\",0,Hauptmaske!B41)","v":0},{"$f":"IF(SUM(Hauptmaske!C41:H41)=0,0,Hauptmaske!J41)","v":0},{"$f":"IF(SUM(Hauptmaske!C41:H41)=0,\"-\",Hauptmaske!I41)","v":"-"}]
[{"$f":"IF(Hauptmaske!B42=\"\",0,Hauptmaske!B42)","v":0},{"$f":"IF(SUM(Hauptmaske!C42:H42)=0,0,Hauptmaske!J42)","v":0},{"$f":"IF(SUM(Hauptmaske!C42:H42)=0,\"-\",Hauptmaske!I42)","v":"-"}]
[{"$f":"IF(Hauptmaske!B43=\"\",0,Hauptmaske!B43)","v":0},{"$f":"IF(SUM(Hauptmaske!C43:H43)=0,0,Hauptmaske!J43)","v":0},{"$f":"IF(SUM(Hauptmaske!C43:H43)=0,\"-\",Hauptmaske!I43)","v":"-"}]
[{"$f":"IF(Hauptmaske!B44=\"\",0,Hauptmaske!B44)","v":0},{"$f":"IF(SUM(Hauptmaske!C44:H44)=0,0,Hauptmaske!J44)","v":0},{"$f":"IF(SUM(Hauptmaske!C44:H44)=0,\"-\",Hauptmaske!I44)","v":"-"}]
[{"$f":"IF(Hauptmaske!B45=\"\",0,Hauptmaske!B45)","v":0},{"$f":"IF(SUM(Hauptmaske!C45:H45)=0,0,Hauptmaske!J45)","v":0},{"$f":"IF(SUM(Hauptmaske!C45:H45)=0,\"-\",Hauptmaske!I45)","v":"-"}]
[{"$f":"IF(Hauptmaske!B46=\"\",0,Hauptmaske!B46)","v":0},{"$f":"IF(SUM(Hauptmaske!C46:H46)=0,0,Hauptmaske!J46)","v":0},{"$f":"IF(SUM(Hauptmaske!C46:H46)=0,\"-\",Hauptmaske!I46)","v":"-"}]
[{"$f":"IF(Hauptmaske!B47=\"\",0,Hauptmaske!B47)","v":0},{"$f":"IF(SUM(Hauptmaske!C47:H47)=0,0,Hauptmaske!J47)","v":0},{"$f":"IF(SUM(Hauptmaske!C47:H47)=0,\"-\",Hauptmaske!I47)","v":"-"}]
[{"$f":"IF(Hauptmaske!B48=\"\",0,Hauptmaske!B48)","v":0},{"$f":"IF(SUM(Hauptmaske!C48:H48)=0,0,Hauptmaske!J48)","v":0},{"$f":"IF(SUM(Hauptmaske!C48:H48)=0,\"-\",Hauptmaske!I48)","v":"-"}]
[{"$f":"IF(Hauptmaske!B49=\"\",0,Hauptmaske!B49)","v":0},{"$f":"IF(SUM(Hauptmaske!C49:H49)=0,0,Hauptmaske!J49)","v":0},{"$f":"IF(SUM(Hauptmaske!C49:H49)=0,\"-\",Hauptmaske!I49)","v":"-"}]
[{"$f":"IF(Hauptmaske!B50=\"\",0,Hauptmaske!B50)","v":0},{"$f":"IF(SUM(Hauptmaske!C50:H50)=0,0,Hauptmaske!J50)","v":0},{"$f":"IF(SUM(Hauptmaske!C50:H50)=0,\"-\",Hauptmaske!I50)","v":"-"}]
[{"$f":"IF(Hauptmaske!B51=\"\",0,Hauptmaske!B51)","v":0},{"$f":"IF(SUM(Hauptmaske!C51:H51)=0,0,Hauptmaske!J51)","v":0},{"$f":"IF(SUM(Hauptmaske!C51:H51)=0,\"-\",Hauptmaske!I51)","v":"-"}]
[{"$f":"IF(Hauptmaske!B52=\"\",0,Hauptmaske!B52)","v":0},{"$f":"IF(SUM(Hauptmaske!C52:H52)=0,0,Hauptmaske!J52)","v":0},{"$f":"IF(SUM(Hauptmaske!C52:H52)=0,\"-\",Hauptmaske!I52)","v":"-"}]
[{"$f":"IF(Hauptmaske!B53=\"\",0,Hauptmaske!B53)","v":0},{"$f":"IF(SUM(Hauptmaske!C53:H53)=0,0,Hauptmaske!J53)","v":0},{"$f":"IF(SUM(Hauptmaske!C53:H53)=0,\"-\",Hauptmaske!I53)","v":"-"}]
[{"$f":"IF(Hauptmaske!B54=\"\",0,Hauptmaske!B54)","v":0},{"$f":"IF(SUM(Hauptmaske!C54:H54)=0,0,Hauptmaske!J54)","v":0},{"$f":"IF(SUM(Hauptmaske!C54:H54)=0,\"-\",Hauptmaske!I54)","v":"-"}]
[{"$f":"IF(Hauptmaske!B55=\"\",0,Hauptmaske!B55)","v":0},{"$f":"IF(SUM(Hauptmaske!C55:H55)=0,0,Hauptmaske!J55)","v":0},{"$f":"IF(SUM(Hauptmaske!C55:H55)=0,\"-\",Hauptmaske!I55)","v":"-"}]
[{"$f":"IF(Hauptmaske!B56=\"\",0,Hauptmaske!B56)","v":0},{"$f":"IF(SUM(Hauptmaske!C56:H56)=0,0,Hauptmaske!J56)","v":0},{"$f":"IF(SUM(Hauptmaske!C56:H56)=0,\"-\",Hauptmaske!I56)","v":"-"}]
[{"$f":"IF(Hauptmaske!B57=\"\",0,Hauptmaske!B57)","v":0},{"$f":"IF(SUM(Hauptmaske!C57:H57)=0,0,Hauptmaske!J57)","v":0},{"$f":"IF(SUM(Hauptmaske!C57:H57)=0,\"-\",Hauptmaske!I57)","v":"-"}]
[{"$f":"IF(Hauptmaske!B58=\"\",0,Hauptmaske!B58)","v":0},{"$f":"IF(SUM(Hauptmaske!C58:H58)=0,0,Hauptmaske!J58)","v":0},{"$f":"IF(SUM(Hauptmaske!C58:H58)=0,\"-\",Hauptmaske!I58)","v":"-"}]
[{"$f":"IF(Hauptmaske!B59=\"\",0,Hauptmaske!B59)","v":0},{"$f":"IF(SUM(Hauptmaske!C59:H59)=0,0,Hauptmaske!J59)","v":0},{"$f":"IF(SUM(Hauptmaske!C59:H59)=0,\"-\",Hauptmaske!I59)","v":"-"}]
[{"$f":"IF(Hauptmaske!B60=\"\",0,Hauptmaske!B60)","v":0},{"$f":"IF(SUM(Hauptmaske!C60:H60)=0,0,Hauptmaske!J60)","v":0},{"$f":"IF(SUM(Hauptmaske!C60:H60)=0,\"-\",Hauptmaske!I60)","v":"-"}]
[{"$f":"IF(Hauptmaske!B61=\"\",0,Hauptmaske!B61)","v":0},{"$f":"IF(SUM(Hauptmaske!C61:H61)=0,0,Hauptmaske!J61)","v":0},{"$f":"IF(SUM(Hauptmaske!C61:H61)=0,\"-\",Hauptmaske!I61)","v":"-"}]
[{"$f":"IF(Hauptmaske!B62=\"\",0,Hauptmaske!B62)","v":0},{"$f":"IF(SUM(Hauptmaske!C62:H62)=0,0,Hauptmaske!J62)","v":0},{"$f":"IF(SUM(Hauptmaske!C62:H62)=0,\"-\",Hauptmaske!I62)","v":"-"}]
[{"$f":"IF(Hauptmaske!B63=\"\",0,Hauptmaske!B63)","v":0},{"$f":"IF(SUM(Hauptmaske!C63:H63)=0,0,Hauptmaske!J63)","v":0},{"$f":"IF(SUM(Hauptmaske!C63:H63)=0,\"-\",Hauptmaske!I63)","v":"-"}]
[{"$f":"IF(Hauptmaske!B64=\"\",0,Hauptmaske!B64)","v":0},{"$f":"IF(SUM(Hauptmaske!C64:H64)=0,0,Hauptmaske!J64)","v":0},{"$f":"IF(SUM(Hauptmaske!C64:H64)=0,\"-\",Hauptmaske!I64)","v":"-"}]
[{"$f":"IF(Hauptmaske!B65=\"\",0,Hauptmaske!B65)","v":0},{"$f":"IF(SUM(Hauptmaske!C65:H65)=0,0,Hauptmaske!J65)","v":0},{"$f":"IF(SUM(Hauptmaske!C65:H65)=0,\"-\",Hauptmaske!I65)","v":"-"}]
[{"$f":"IF(Hauptmaske!B66=\"\",0,Hauptmaske!B66)","v":0},{"$f":"IF(SUM(Hauptmaske!C66:H66)=0,0,Hauptmaske!J66)","v":0},{"$f":"IF(SUM(Hauptmaske!C66:H66)=0,\"-\",Hauptmaske!I66)","v":"-"}]
[{"$f":"IF(Hauptmaske!B67=\"\",0,Hauptmaske!B67)","v":0},{"$f":"IF(SUM(Hauptmaske!C67:H67)=0,0,Hauptmaske!J67)","v":0},{"$f":"IF(SUM(Hauptmaske!C67:H67)=0,\"-\",Hauptmaske!I67)","v":"-"}]
[{"$f":"IF(Hauptmaske!B68=\"\",0,Hauptmaske!B68)","v":0},{"$f":"IF(SUM(Hauptmaske!C68:H68)=0,0,Hauptmaske!J68)","v":0},{"$f":"IF(SUM(Hauptmaske!C68:H68)=0,\"-\",Hauptmaske!I68)","v":"-"}]
[{"$f":"IF(Hauptmaske!B69=\"\",0,Hauptmaske!B69)","v":0},{"$f":"IF(SUM(Hauptmaske!C69:H69)=0,0,Hauptmaske!J69)","v":0},{"$f":"IF(SUM(Hauptmaske!C69:H69)=0,\"-\",Hauptmaske!I69)","v":"-"}]
[{"$f":"IF(Hauptmaske!B70=\"\",0,Hauptmaske!B70)","v":0},{"$f":"IF(SUM(Hauptmaske!C70:H70)=0,0,Hauptmaske!J70)","v":0},{"$f":"IF(SUM(Hauptmaske!C70:H70)=0,\"-\",Hauptmaske!I70)","v":"-"}]
[{"$f":"IF(Hauptmaske!B71=\"\",0,Hauptmaske!B71)","v":0},{"$f":"IF(SUM(Hauptmaske!C71:H71)=0,0,Hauptmaske!J71)","v":0},{"$f":"IF(SUM(Hauptmaske!C71:H71)=0,\"-\",Hauptmaske!I71)","v":"-"}]
[{"$f":"IF(Hauptmaske!B72=\"\",0,Hauptmaske!B72)","v":0},{"$f":"IF(SUM(Hauptmaske!C72:H72)=0,0,Hauptmaske!J72)","v":0},{"$f":"IF(SUM(Hauptmaske!C72:H72)=0,\"-\",Hauptmaske!I72)","v":"-"}]
[{"$f":"IF(Hauptmaske!B73=\"\",0,Hauptmaske!B73)","v":0},{"$f":"IF(SUM(Hauptmaske!C73:H73)=0,0,Hauptmaske!J73)","v":0},{"$f":"IF(SUM(Hauptmaske!C73:H73)=0,\"-\",Hauptmaske!I73)","v":"-"}]
[{"$f":"IF(Hauptmaske!B74=\"\",0,Hauptmaske!B74)","v":0},{"$f":"IF(SUM(Hauptmaske!C74:H74)=0,0,Hauptmaske!J74)","v":0},{"$f":"IF(SUM(Hauptmaske!C74:H74)=0,\"-\",Hauptmaske!I74)","v":"-"}]
[{"$f":"IF(Hauptmaske!B75=\"\",0,Hauptmaske!B75)","v":0},{"$f":"IF(SUM(Hauptmaske!C75:H75)=0,0,Hauptmaske!J75)","v":0},{"$f":"IF(SUM(Hauptmaske!C75:H75)=0,\"-\",Hauptmaske!I75)","v":"-"}]
[{"$f":"IF(Hauptmaske!B76=\"\",0,Hauptmaske!B76)","v":0},{"$f":"IF(SUM(Hauptmaske!C76:H76)=0,0,Hauptmaske!J76)","v":0},{"$f":"IF(SUM(Hauptmaske!C76:H76)=0,\"-\",Hauptmaske!I76)","v":"-"}]
[{"$f":"IF(Hauptmaske!B77=\"\",0,Hauptmaske!B77)","v":0},{"$f":"IF(SUM(Hauptmaske!C77:H77)=0,0,Hauptmaske!J77)","v":0},{"$f":"IF(SUM(Hauptmaske!C77:H77)=0,\"-\",Hauptmaske!I77)","v":"-"}]
[{"$f":"IF(Hauptmaske!B78=\"\",0,Hauptmaske!B78)","v":0},{"$f":"IF(SUM(Hauptmaske!C78:H78)=0,0,Hauptmaske!J78)","v":0},{"$f":"IF(SUM(Hauptmaske!C78:H78)=0,\"-\",Hauptmaske!I78)","v":"-"}]
[{"$f":"IF(Hauptmaske!B79=\"\",0,Hauptmaske!B79)","v":0},{"$f":"IF(SUM(Hauptmaske!C79:H79)=0,0,Hauptmaske!J79)","v":0},{"$f":"IF(SUM(Hauptmaske!C79:H79)=0,\"-\",Hauptmaske!I79)","v":"-"}]
[{"$f":"IF(Hauptmaske!B80=\"\",0,Hauptmaske!B80)","v":0},{"$f":"IF(SUM(Hauptmaske!C80:H80)=0,0,Hauptmaske!J80)","v":0},{"$f":"IF(SUM(Hauptmaske!C80:H80)=0,\"-\",Hauptmaske!I80)","v":"-"}]
[{"$f":"IF(Hauptmaske!B81=\"\",0,Hauptmaske!B81)","v":0},{"$f":"IF(SUM(Hauptmaske!C81:H81)=0,0,Hauptmaske!J81)","v":0},{"$f":"IF(SUM(Hauptmaske!C81:H81)=0,\"-\",Hauptmaske!I81)","v":"-"}]
[{"$f":"IF(Hauptmaske!B82=\"\",0,Hauptmaske!B82)","v":0},{"$f":"IF(SUM(Hauptmaske!C82:H82)=0,0,Hauptmaske!J82)","v":0},{"$f":"IF(SUM(Hauptmaske!C82:H82)=0,\"-\",Hauptmaske!I82)","v":"-"}]
[{"$f":"IF(Hauptmaske!B83=\"\",0,Hauptmaske!B83)","v":0},{"$f":"IF(SUM(Hauptmaske!C83:H83)=0,0,Hauptmaske!J83)","v":0},{"$f":"IF(SUM(Hauptmaske!C83:H83)=0,\"-\",Hauptmaske!I83)","v":"-"}]
[{"$f":"IF(Hauptmaske!B84=\"\",0,Hauptmaske!B84)","v":0},{"$f":"IF(SUM(Hauptmaske!C84:H84)=0,0,Hauptmaske!J84)","v":0},{"$f":"IF(SUM(Hauptmaske!C84:H84)=0,\"-\",Hauptmaske!I84)","v":"-"}]
[{"$f":"IF(Hauptmaske!B85=\"\",0,Hauptmaske!B85)","v":0},{"$f":"IF(SUM(Hauptmaske!C85:H85)=0,0,Hauptmaske!J85)","v":0},{"$f":"IF(SUM(Hauptmaske!C85:H85)=0,\"-\",Hauptmaske!I85)","v":"-"}]
[{"$f":"IF(Hauptmaske!B86=\"\",0,Hauptmaske!B86)","v":0},{"$f":"IF(SUM(Hauptmaske!C86:H86)=0,0,Hauptmaske!J86)","v":0},{"$f":"IF(SUM(Hauptmaske!C86:H86)=0,\"-\",Hauptmaske!I86)","v":"-"}]
[{"$f":"IF(Hauptmaske!B87=\"\",0,Hauptmaske!B87)","v":0},{"$f":"IF(SUM(Hauptmaske!C87:H87)=0,0,Hauptmaske!J87)","v":0},{"$f":"IF(SUM(Hauptmaske!C87:H87)=0,\"-\",Hauptmaske!I87)","v":"-"}]
[{"$f":"IF(Hauptmaske!B88=\"\",0,Hauptmaske!B88)","v":0},{"$f":"IF(SUM(Hauptmaske!C88:H88)=0,0,Hauptmaske!J88)","v":0},{"$f":"IF(SUM(Hauptmaske!C88:H88)=0,\"-\",Hauptmaske!I88)","v":"-"}]
[{"$f":"IF(Hauptmaske!B89=\"\",0,Hauptmaske!B89)","v":0},{"$f":"IF(SUM(Hauptmaske!C89:H89)=0,0,Hauptmaske!J89)","v":0},{"$f":"IF(SUM(Hauptmaske!C89:H89)=0,\"-\",Hauptmaske!I89)","v":"-"}]
[{"$f":"IF(Hauptmaske!B90=\"\",0,Hauptmaske!B90)","v":0},{"$f":"IF(SUM(Hauptmaske!C90:H90)=0,0,Hauptmaske!J90)","v":0},{"$f":"IF(SUM(Hauptmaske!C90:H90)=0,\"-\",Hauptmaske!I90)","v":"-"}]
[{"$f":"IF(Hauptmaske!B91=\"\",0,Hauptmaske!B91)","v":0},{"$f":"IF(SUM(Hauptmaske!C91:H91)=0,0,Hauptmaske!J91)","v":0},{"$f":"IF(SUM(Hauptmaske!C91:H91)=0,\"-\",Hauptmaske!I91)","v":"-"}]
[{"$f":"IF(Hauptmaske!B92=\"\",0,Hauptmaske!B92)","v":0},{"$f":"IF(SUM(Hauptmaske!C92:H92)=0,0,Hauptmaske!J92)","v":0},{"$f":"IF(SUM(Hauptmaske!C92:H92)=0,\"-\",Hauptmaske!I92)","v":"-"}]
[{"$f":"IF(Hauptmaske!B93=\"\",0,Hauptmaske!B93)","v":0},{"$f":"IF(SUM(Hauptmaske!C93:H93)=0,0,Hauptmaske!J93)","v":0},{"$f":"IF(SUM(Hauptmaske!C93:H93)=0,\"-\",Hauptmaske!I93)","v":"-"}]
[{"$f":"IF(Hauptmaske!B94=\"\",0,Hauptmaske!B94)","v":0},{"$f":"IF(SUM(Hauptmaske!C94:H94)=0,0,Hauptmaske!J94)","v":0},{"$f":"IF(SUM(Hauptmaske!C94:H94)=0,\"-\",Hauptmaske!I94)","v":"-"}]
[{"$f":"IF(Hauptmaske!B95=\"\",0,Hauptmaske!B95)","v":0},{"$f":"IF(SUM(Hauptmaske!C95:H95)=0,0,Hauptmaske!J95)","v":0},{"$f":"IF(SUM(Hauptmaske!C95:H95)=0,\"-\",Hauptmaske!I95)","v":"-"}]
[{"$f":"IF(Hauptmaske!B96=\"\",0,Hauptmaske!B96)","v":0},{"$f":"IF(SUM(Hauptmaske!C96:H96)=0,0,Hauptmaske!J96)","v":0},{"$f":"IF(SUM(Hauptmaske!C96:H96)=0,\"-\",Hauptmaske!I96)","v":"-"}]
[{"$f":"IF(Hauptmaske!B97=\"\",0,Hauptmaske!B97)","v":0},{"$f":"IF(SUM(Hauptmaske!C97:H97)=0,0,Hauptmaske!J97)","v":0},{"$f":"IF(SUM(Hauptmaske!C97:H97)=0,\"-\",Hauptmaske!I97)","v":"-"}]
[{"$f":"IF(Hauptmaske!B98=\"\",0,Hauptmaske!B98)","v":0},{"$f":"IF(SUM(Hauptmaske!C98:H98)=0,0,Hauptmaske!J98)","v":0},{"$f":"IF(SUM(Hauptmaske!C98:H98)=0,\"-\",Hauptmaske!I98)","v":"-"}]
[{"$f":"IF(Hauptmaske!B99=\"\",0,Hauptmaske!B99)","v":0},{"$f":"IF(SUM(Hauptmaske!C99:H99)=0,0,Hauptmaske!J99)","v":0},{"$f":"IF(SUM(Hauptmaske!C99:H99)=0,\"-\",Hauptmaske!I99)","v":"-"}]
[{"$f":"IF(Hauptmaske!B100=\"\",0,Hauptmaske!B100)","v":0},{"$f":"IF(SUM(Hauptmaske!C100:H100)=0,0,Hauptmaske!J100)","v":0},{"$f":"IF(SUM(Hauptmaske!C100:H100)=0,\"-\",Hauptmaske!I100)","v":"-"}]
[{"$f":"IF(Hauptmaske!B101=\"\",0,Hauptmaske!B101)","v":0},{"$f":"IF(SUM(Hauptmaske!C101:H101)=0,0,Hauptmaske!J101)","v":0},{"$f":"IF(SUM(Hauptmaske!C101:H101)=0,\"-\",Hauptmaske!I101)","v":"-"}]
[{"$f":"IF(Hauptmaske!B102=\"\",0,Hauptmaske!B102)","v":0},{"$f":"IF(SUM(Hauptmaske!C102:H102)=0,0,Hauptmaske!J102)","v":0},{"$f":"IF(SUM(Hauptmaske!C102:H102)=0,\"-\",Hauptmaske!I102)","v":"-"}]
[{"$f":"IF(Hauptmaske!B103=\"\",0,Hauptmaske!B103)","v":0},{"$f":"IF(SUM(Hauptmaske!C103:H103)=0,0,Hauptmaske!J103)","v":0},{"$f":"IF(SUM(Hauptmaske!C103:H103)=0,\"-\",Hauptmaske!I103)","v":"-"}]
[{"$f":"IF(Hauptmaske!B104=\"\",0,Hauptmaske!B104)","v":0},{"$f":"IF(SUM(Hauptmaske!C104:H104)=0,0,Hauptmaske!J104)","v":0},{"$f":"IF(SUM(Hauptmaske!C104:H104)=0,\"-\",Hauptmaske!I104)","v":"-"}]
[{"$f":"IF(Hauptmaske!B105=\"\",0,Hauptmaske!B105)","v":0},{"$f":"IF(SUM(Hauptmaske!C105:H105)=0,0,Hauptmaske!J105)","v":0},{"$f":"IF(SUM(Hauptmaske!C105:H105)=0,\"-\",Hauptmaske!I105)","v":"-"}]
[{"$f":"IF(Hauptmaske!B106=\"\",0,Hauptmaske!B106)","v":0},{"$f":"IF(SUM(Hauptmaske!C106:H106)=0,0,Hauptmaske!J106)","v":0},{"$f":"IF(SUM(Hauptmaske!C106:H106)=0,\"-\",Hauptmaske!I106)","v":"-"}]
[{"$f":"IF(Hauptmaske!B107=\"\",0,Hauptmaske!B107)","v":0},{"$f":"IF(SUM(Hauptmaske!C107:H107)=0,0,Hauptmaske!J107)","v":0},{"$f":"IF(SUM(Hauptmaske!C107:H107)=0,\"-\",Hauptmaske!I107)","v":"-"}]
[{"$f":"IF(Hauptmaske!B108=\"\",0,Hauptmaske!B108)","v":0},{"$f":"IF(SUM(Hauptmaske!C108:H108)=0,0,Hauptmaske!J108)","v":0},{"$f":"IF(SUM(Hauptmaske!C108:H108)=0,\"-\",Hauptmaske!I108)","v":"-"}]
[{"$f":"IF(Hauptmaske!B109=\"\",0,Hauptmaske!B109)","v":0},{"$f":"IF(SUM(Hauptmaske!C109:H109)=0,0,Hauptmaske!J109)","v":0},{"$f":"IF(SUM(Hauptmaske!C109:H109)=0,\"-\",Hauptmaske!I109)","v":"-"}]
[{"$f":"IF(Hauptmaske!B110=\"\",0,Hauptmaske!B110)","v":0},{"$f":"IF(SUM(Hauptmaske!C110:H110)=0,0,Hauptmaske!J110)","v":0},{"$f":"IF(SUM(Hauptmaske!C110:H110)=0,\"-\",Hauptmaske!I110)","v":"-"}]
[{"$f":"IF(Hauptmaske!B111=\"\",0,Hauptmaske!B111)","v":0},{"$f":"IF(SUM(Hauptmaske!C111:H111)=0,0,Hauptmaske!J111)","v":0},{"$f":"IF(SUM(Hauptmaske!C111:H111)=0,\"-\",Hauptmaske!I111)","v":"-"}]
[{"$f":"IF(Hauptmaske!B112=\"\",0,Hauptmaske!B112)","v":0},{"$f":"IF(SUM(Hauptmaske!C112:H112)=0,0,Hauptmaske!J112)","v":0},{"$f":"IF(SUM(Hauptmaske!C112:H112)=0,\"-\",Hauptmaske!I112)","v":"-"}]
[{"$f":"IF(Hauptmaske!B113=\"\",0,Hauptmaske!B113)","v":0},{"$f":"IF(SUM(Hauptmaske!C113:H113)=0,0,Hauptmaske!J113)","v":0},{"$f":"IF(SUM(Hauptmaske!C113:H113)=0,\"-\",Hauptmaske!I113)","v":"-"}]
[{"$f":"IF(Hauptmaske!B114=\"\",0,Hauptmaske!B114)","v":0},{"$f":"IF(SUM(Hauptmaske!C114:H114)=0,0,Hauptmaske!J114)","v":0},{"$f":"IF(SUM(Hauptmaske!C114:H114)=0,\"-\",Hauptmaske!I114)","v":"-"}]
[{"$f":"IF(Hauptmaske!B115=\"\",0,Hauptmaske!B115)","v":0},{"$f":"IF(SUM(Hauptmaske!C115:H115)=0,0,Hauptmaske!J115)","v":0},{"$f":"IF(SUM(Hauptmaske!C115:H115)=0,\"-\",Hauptmaske!I115)","v":"-"}]
[{"$f":"IF(Hauptmaske!B116=\"\",0,Hauptmaske!B116)","v":0},{"$f":"IF(SUM(Hauptmaske!C116:H116)=0,0,Hauptmaske!J116)","v":0},{"$f":"IF(SUM(Hauptmaske!C116:H116)=0,\"-\",Hauptmaske!I116)","v":"-"}]
[{"$f":"IF(Hauptmaske!B117=\"\",0,Hauptmaske!B117)","v":0},{"$f":"IF(SUM(Hauptmaske!C117:H117)=0,0,Hauptmaske!J117)","v":0},{"$f":"IF(SUM(Hauptmaske!C117:H117)=0,\"-\",Hauptmaske!I117)","v":"-"}]
[{"$f":"IF(Hauptmaske!B118=\"\",0,Hauptmaske!B118)","v":0},{"$f":"IF(SUM(Hauptmaske!C118:H118)=0,0,Hauptmaske!J118)","v":0},{"$f":"IF(SUM(Hauptmaske!C118:H118)=0,\"-\",Hauptmaske!I118)","v":"-"}]
[{"$f":"IF(Hauptmaske!B119=\"\",0,Hauptmaske!B119)","v":0},{"$f":"IF(SUM(Hauptmaske!C119:H119)=0,0,Hauptmaske!J119)","v":0},{"$f":"IF(SUM(Hauptmaske!C119:H119)=0,\"-\",Hauptmaske!I119)","v":"-"}]
[{"$f":"IF(Hauptmaske!B120=\"\",0,Hauptmaske!B120)","v":0},{"$f":"IF(SUM(Hauptmaske!C120:H120)=0,0,Hauptmaske!J120)","v":0},{"$f":"IF(SUM(Hauptmaske!C120:H120)=0,\"-\",Hauptmaske!I120)","v":"-"}]
[{"$f":"IF(Hauptmaske!B121=\"\",0,Hauptmaske!B121)","v":0},{"$f":"IF(SUM(Hauptmaske!C121:H121)=0,0,Hauptmaske!J121)","v":0},{"$f":"IF(SUM(Hauptmaske!C121:H121)=0,\"-\",Hauptmaske!I121)","v":"-"}]
[{"$f":"IF(Hauptmaske!B122=\"\",0,Hauptmaske!B122)","v":0},{"$f":"IF(SUM(Hauptmaske!C122:H122)=0,0,Hauptmaske!J122)","v":0},{"$f":"IF(SUM(Hauptmaske!C122:H122)=0,\"-\",Hauptmaske!I122)","v":"-"}]
[{"$f":"IF(Hauptmaske!B123=\"\",0,Hauptmaske!B123)","v":0},{"$f":"IF(SUM(Hauptmaske!C123:H123)=0,0,Hauptmaske!J123)","v":0},{"$f":"IF(SUM(Hauptmaske!C123:H123)=0,\"-\",Hauptmaske!I123)","v":"-"}]
[{"$f":"IF(Hauptmaske!B124=\"\",0,Hauptmaske!B124)","v":0},{"$f":"IF(SUM(Hauptmaske!C124:H124)=0,0,Hauptmaske!J124)","v":0},{"$f":"IF(SUM(Hauptmaske!C124:H124)=0,\"-\",Hauptmaske!I124)","v":"-"}]
[{"$f":"IF(Hauptmaske!B125=\"\",0,Hauptmaske!B125)","v":0},{"$f":"IF(SUM(Hauptmaske!C125:H125)=0,0,Hauptmaske!J125)","v":0},{"$f":"IF(SUM(Hauptmaske!C125:H125)=0,\"-\",Hauptmaske!I125)","v":"-"}]
[{"$f":"IF(Hauptmaske!B126=\"\",0,Hauptmaske!B126)","v":0},{"$f":"IF(SUM(Hauptmaske!C126:H126)=0,0,Hauptmaske!J126)","v":0},{"$f":"IF(SUM(Hauptmaske!C126:H126)=0,\"-\",Hauptmaske!I126)","v":"-"}]
[{"$f":"IF(Hauptmaske!B127=\"\",0,Hauptmaske!B127)","v":0},{"$f":"IF(SUM(Hauptmaske!C127:H127)=0,0,Hauptmaske!J127)","v":0},{"$f":"IF(SUM(Hauptmaske!C127:H127)=0,\"-\",Hauptmaske!I127)","v":"-"}]
[{"$f":"IF(Hauptmaske!B128=\"\",0,Hauptmaske!B128)","v":0},{"$f":"IF(SUM(Hauptmaske!C128:H128)=0,0,Hauptmaske!J128)","v":0},{"$f":"IF(SUM(Hauptmaske!C128:H128)=0,\"-\",Hauptmaske!I128)","v":"-"}]
[{"$f":"IF(Hauptmaske!B129=\"\",0,Hauptmaske!B129)","v":0},{"$f":"IF(SUM(Hauptmaske!C129:H129)=0,0,Hauptmaske!J129)","v":0},{"$f":"IF(SUM(Hauptmaske!C129:H129)=0,\"-\",Hauptmaske!I129)","v":"-"}]
[{"$f":"IF(Hauptmaske!B130=\"\",0,Hauptmaske!B130)","v":0},{"$f":"IF(SUM(Hauptmaske!C130:H130)=0,0,Hauptmaske!J130)","v":0},{"$f":"IF(SUM(Hauptmaske!C130:H130)=0,\"-\",Hauptmaske!I130)","v":"-"}]
[{"$f":"IF(Hauptmaske!B131=\"\",0,Hauptmaske!B131)","v":0},{"$f":"IF(SUM(Hauptmaske!C131:H131)=0,0,Hauptmaske!J131)","v":0},{"$f":"IF(SUM(Hauptmaske!C131:H131)=0,\"-\",Hauptmaske!I131)","v":"-"}]
[{"$f":"IF(Hauptmaske!B132=\"\",0,Hauptmaske!B132)","v":0},{"$f":"IF(SUM(Hauptmaske!C132:H132)=0,0,Hauptmaske!J132)","v":0},{"$f":"IF(SUM(Hauptmaske!C132:H132)=0,\"-\",Hauptmaske!I132)","v":"-"}]
[{"$f":"IF(Hauptmaske!B133=\"\",0,Hauptmaske!B133)","v":0},{"$f":"IF(SUM(Hauptmaske!C133:H133)=0,0,Hauptmaske!J133)","v":0},{"$f":"IF(SUM(Hauptmaske!C133:H133)=0,\"-\",Hauptmaske!I133)","v":"-"}]
[{"$f":"IF(Hauptmaske!B134=\"\",0,Hauptmaske!B134)","v":0},{"$f":"IF(SUM(Hauptmaske!C134:H134)=0,0,Hauptmaske!J134)","v":0},{"$f":"IF(SUM(Hauptmaske!C134:H134)=0,\"-\",Hauptmaske!I134)","v":"-"}]
[{"$f":"IF(Hauptmaske!B135=\"\",0,Hauptmaske!B135)","v":0},{"$f":"IF(SUM(Hauptmaske!C135:H135)=0,0,Hauptmaske!J135)","v":0},{"$f":"IF(SUM(Hauptmaske!C135:H135)=0,\"-\",Hauptmaske!I135)","v":"-"}]
[{"$f":"IF(Hauptmaske!B136=\"\",0,Hauptmaske!B136)","v":0},{"$f":"IF(SUM(Hauptmaske!C136:H136)=0,0,Hauptmaske!J136)","v":0},{"$f":"IF(SUM(Hauptmaske!C136:H136)=0,\"-\",Hauptmaske!I136)","v":"-"}]
[{"$f":"IF(Hauptmaske!B137=\"\",0,Hauptmaske!B137)","v":0},{"$f":"IF(SUM(Hauptmaske!C137:H137)=0,0,Hauptmaske!J137)","v":0},{"$f":"IF(SUM(Hauptmaske!C137:H137)=0,\"-\",Hauptmaske!I137)","v":"-"}]
[{"$f":"IF(Hauptmaske!B138=\"\",0,Hauptmaske!B138)","v":0},{"$f":"IF(SUM(Hauptmaske!C138:H138)=0,0,Hauptmaske!J138)","v":0},{"$f":"IF(SUM(Hauptmaske!C138:H138)=0,\"-\",Hauptmaske!I138)","v":"-"}]
[{"$f":"IF(Hauptmaske!B139=\"\",0,Hauptmaske!B139)","v":0},{"$f":"IF(SUM(Hauptmaske!C139:H139)=0,0,Hauptmaske!J139)","v":0},{"$f":"IF(SUM(Hauptmaske!C139:H139)=0,\"-\",Hauptmaske!I139)","v":"-"}]
[{"$f":"IF(Hauptmaske!B140=\"\",0,Hauptmaske!B140)","v":0},{"$f":"IF(SUM(Hauptmaske!C140:H140)=0,0,Hauptmaske!J140)","v":0},{"$f":"IF(SUM(Hauptmaske!C140:H140)=0,\"-\",Hauptmaske!I140)","v":"-"}]
[{"$f":"IF(Hauptmaske!B141=\"\",0,Hauptmaske!B141)","v":0},{"$f":"IF(SUM(Hauptmaske!C141:H141)=0,0,Hauptmaske!J141)","v":0},{"$f":"IF(SUM(Hauptmaske!C141:H141)=0,\"-\",Hauptmaske!I141)","v":"-"}]
[{"$f":"IF(Hauptmaske!B142=\"\",0,Hauptmaske!B142)","v":0},{"$f":"IF(SUM(Hauptmaske!C142:H142)=0,0,Hauptmaske!J142)","v":0},{"$f":"IF(SUM(Hauptmaske!C142:H142)=0,\"-\",Hauptmaske!I142)","v":"-"}]
[{"$f":"IF(Hauptmaske!B143=\"\",0,Hauptmaske!B143)","v":0},{"$f":"IF(SUM(Hauptmaske!C143:H143)=0,0,Hauptmaske!J143)","v":0},{"$f":"IF(SUM(Hauptmaske!C143:H143)=0,\"-\",Hauptmaske!I143)","v":"-"}]
[{"$f":"IF(Hauptmaske!B144=\"\",0,Hauptmaske!B144)","v":0},{"$f":"IF(SUM(Hauptmaske!C144:H144)=0,0,Hauptmaske!J144)","v":0},{"$f":"IF(SUM(Hauptmaske!C144:H144)=0,\"-\",Hauptmaske!I144)","v":"-"}]
[{"$f":"IF(Hauptmaske!B145=\"\",0,Hauptmaske!B145)","v":0},{"$f":"IF(SUM(Hauptmaske!C145:H145)=0,0,Hauptmaske!J145)","v":0},{"$f":"IF(SUM(Hauptmaske!C145:H145)=0,\"-\",Hauptmaske!I145)","v":"-"}]
[{"$f":"IF(Hauptmaske!B146=\"\",0,Hauptmaske!B146)","v":0},{"$f":"IF(SUM(Hauptmaske!C146:H146)=0,0,Hauptmaske!J146)","v":0},{"$f":"IF(SUM(Hauptmaske!C146:H146)=0,\"-\",Hauptmaske!I146)","v":"-"}]
[{"$f":"IF(Hauptmaske!B147=\"\",0,Hauptmaske!B147)","v":0},{"$f":"IF(SUM(Hauptmaske!C147:H147)=0,0,Hauptmaske!J147)","v":0},{"$f":"IF(SUM(Hauptmaske!C147:H147)=0,\"-\",Hauptmaske!I147)","v":"-"}]
[{"$f":"IF(Hauptmaske!B148=\"\",0,Hauptmaske!B148)","v":0},{"$f":"IF(SUM(Hauptmaske!C148:H148)=0,0,Hauptmaske!J148)","v":0},{"$f":"IF(SUM(Hauptmaske!C148:H148)=0,\"-\",Hauptmaske!I148)","v":"-"}]
[{"$f":"IF(Hauptmaske!B149=\"\",0,Hauptmaske!B149)","v":0},{"$f":"IF(SUM(Hauptmaske!C149:H149)=0,0,Hauptmaske!J149)","v":0},{"$f":"IF(SUM(Hauptmaske!C149:H149)=0,\"-\",Hauptmaske!I149)","v":"-"}]
[{"$f":"IF(Hauptmaske!B150=\"\",0,Hauptmaske!B150)","v":0},{"$f":"IF(SUM(Hauptmaske!C150:H150)=0,0,Hauptmaske!J150)","v":0},{"$f":"IF(SUM(Hauptmaske!C150:H150)=0,\"-\",Hauptmaske!I150)","v":"-"}]
[{"$f":"IF(Hauptmaske!B151=\"\",0,Hauptmaske!B151)","v":0},{"$f":"IF(SUM(Hauptmaske!C151:H151)=0,0,Hauptmaske!J151)","v":0},{"$f":"IF(SUM(Hauptmaske!C151:H151)=0,\"-\",Hauptmaske!I151)","v":"-"}]
[{"$f":"IF(Hauptmaske!B152=\"\",0,Hauptmaske!B152)","v":0},{"$f":"IF(SUM(Hauptmaske!C152:H152)=0,0,Hauptmaske!J152)","v":0},{"$f":"IF(SUM(Hauptmaske!C152:H152)=0,\"-\",Hauptmaske!I152)","v":"-"}]
[{"$f":"IF(Hauptmaske!B153=\"\",0,Hauptmaske!B153)","v":0},{"$f":"IF(SUM(Hauptmaske!C153:H153)=0,0,Hauptmaske!J153)","v":0},{"$f":"IF(SUM(Hauptmaske!C153:H153)=0,\"-\",Hauptmaske!I153)","v":"-"}]
[{"$f":"IF(Hauptmaske!B154=\"\",0,Hauptmaske!B154)","v":0},{"$f":"IF(SUM(Hauptmaske!C154:H154)=0,0,Hauptmaske!J154)","v":0},{"$f":"IF(SUM(Hauptmaske!C154:H154)=0,\"-\",Hauptmaske!I154)","v":"-"}]

{"sheet":"Daten","index":4,"n_rows":151,"n_cols":25,"rows_kept":151,"cut":false,"hidden":false,"merged":[]}
["Lfd. Nr.:","Name:","Summe:","Klasse:",null,null,"Klasse - 1","Punkte:",null,"Klasse - 2","Punkte:",null,"Klasse - 3","Punkte:",null,"Klasse - 4","Punkte:",null,"Klasse - 5","Punkte:",null,"Lfd. Nr.:","Name:","Summe:"]
[1,0,0,"-",null,1,{"$f":"IFERROR(INDEX($B$2:$B$151,LARGE(($D$2:$D$151=1)*(ROW($D$2:$D$151)-1),COUNTIF($D$2:$D$151,1)+1-ROW(D1))),\"\")","v":""},{"$f":"IF(G2=\"\",\"\",VLOOKUP(G2,$B$2:$C$151,2,0))","v":""},1,{"$f":"IFERROR(INDEX($B$2:$B$151,LARGE(($D$2:$D$151=2)*(ROW($D$2:$D$151)-1),COUNTIF($D$2:$D$151,2)+1-ROW(D1))),\"\")","v":""},{"$f":"IF(J2=\"\",\"\",VLOOKUP(J2,$B$2:$C$151,2,0))","v":""},1,{"$f":"IFERROR(INDEX($B$2:$B$151,LARGE(($D$2:$D$151=3)*(ROW($D$2:$D$151)-1),COUNTIF($D$2:$D$151,3)+1-ROW(D1))),\"\")","v":""},{"$f":"IF(M2=\"\",\"\",VLOOKUP(M2,$B$2:$C$151,2,0))","v":""},1,{"$f":"IFERROR(INDEX($B$2:$B$151,LARGE(($D$2:$D$151=4)*(ROW($D$2:$D$151)-1),COUNTIF($D$2:$D$151,4)+1-ROW(D1))),\"\")","v":""},{"$f":"IF(P2=\"\",\"\",VLOOKUP(P2,$B$2:$C$151,2,0))","v":""},1,{"$f":"IFERROR(INDEX($B$2:$B$151,LARGE(($D$2:$D$151=5)*(ROW($D$2:$D$151)-1),COUNTIF($D$2:$D$151,5)+1-ROW(D1))),\"\")","v":""},{"$f":"IF(S2=\"\",\"\",VLOOKUP(S2,$B$2:$C$151,2,0))","v":""},null,1,0,0,"-"]
[2,0,0,"-",null,2,{"$f":"IFERROR(INDEX($B$2:$B$151,LARGE(($D$2:$D$151=1)*(ROW($D$2:$D$151)-1),COUNTIF($D$2:$D$151,1)+1-ROW(D2))),\"\")","v":""},{"$f":"IF(G3=\"\",\"\",VLOOKUP(G3,$B$2:$C$151,2,0))","v":""},2,{"$f":"IFERROR(INDEX($B$2:$B$151,LARGE(($D$2:$D$151=2)*(ROW($D$2:$D$151)-1),COUNTIF($D$2:$D$151,2)+1-ROW(D2))),\"\")","v":""},{"$f":"IF(J3=\"\",\"\",VLOOKUP(J3,$B$2:$C$151,2,0))","v":""},2,{"$f":"IFERROR(INDEX($B$2:$B$151,LARGE(($D$2:$D$151=3)*(ROW($D$2:$D$151)-1),COUNTIF($D$2:$D$151,3)+1-ROW(D2))),\"\")","v":""},{"$f":"IF(M3=\"\",\"\",VLOOKUP(M3,$B$2:$C$151,2,0))","v":""},2,{"$f":"IFERROR(INDEX($B$2:$B$151,LARGE(($D$2:$D$151=4)*(ROW($D$2:$D$151)-1),COUNTIF($D$2:$D$151,4)+1-ROW(D2))),\"\")","v":""},{"$f":"IF(P3=\"\",\"\",VLOOKUP(P3,$B$2:$C$151,2,0))","v":""},2,{"$f":"IFERROR(INDEX($B$2:$B$151,LARGE(($D$2:$D$151=5)*(ROW($D$2:$D$151)-1),COUNTIF($D$2:$D$151,5)+1-ROW(D2))),\"\")","v":""},{"$f":"IF(S3=\"\",\"\",VLOOKUP(S3,$B$2:$C$151,2,0))","v":""},null,2,0,0,"-"]
[3,0,0,"-",null,3,{"$f":"IFERROR(INDEX($B$2:$B$151,LARGE(($D$2:$D$151=1)*(ROW($D$2:$D$151)-1),COUNTIF($D$2:$D$151,1)+1-ROW(D3))),\"\")","v":""},"",3,{"$f":"IFERROR(INDEX($B$2:$B$151,LARGE(($D$2:$D$151=2)*(ROW($D$2:$D$151)-1),COUNTIF($D$2:$D$151,2)+1-ROW(D3))),\"\")","v":""},"",3,{"$f":"IFERROR(INDEX($B$2:$B$151,LARGE(($D$2:$D$151=3)*(ROW($D$2:$D$151)-1),COUNTIF($D$2:$D$151,3)+1-ROW(D3))),\"\")","v":""},"",3,{"$f":"IFERROR(INDEX($B$2:$B$151,LARGE(($D$2:$D$151=4)*(ROW($D$2:$D$151)-1),COUNTIF($D$2:$D$151,4)+1-ROW(D3))),\"\")","v":""},"",3,{"$f":"IFERROR(INDEX($B$2:$B$151,LARGE(($D$2:$D$151=5)*(ROW($D$2:$D$151)-1),COUNTIF($D$2:$D$151,5)+1-ROW(D3))),\"\")","v":""},"",null,3,0,0,"-"]
[4,0,0,"-",null,4,{"$f":"IFERROR(INDEX($B$2:$B$151,LARGE(($D$2:$D$151=1)*(ROW($D$2:$D$151)-1),COUNTIF($D$2:$D$151,1)+1-ROW(D4))),\"\")","v":""},"",4,{"$f":"IFERROR(INDEX($B$2:$B$151,LARGE(($D$2:$D$151=2)*(ROW($D$2:$D$151)-1),COUNTIF($D$2:$D$151,2)+1-ROW(D4))),\"\")","v":""},"",4,{"$f":"IFERROR(INDEX($B$2:$B$151,LARGE(($D$2:$D$151=3)*(ROW($D$2:$D$151)-1),COUNTIF($D$2:$D$151,3)+1-ROW(D4))),\"\")","v":""},"",4,{"$f":"IFERROR(INDEX($B$2:$B$151,LARGE(($D$2:$D$151=4)*(ROW($D$2:$D$151)-1),COUNTIF($D$2:$D$151,4)+1-ROW(D4))),\"\")","v":""},"",4,{"$f":"IFERROR(INDEX($B$2:$B$151,LARGE(($D$2:$D$151=5)*(ROW($D$2:$D$151)-1),COUNTIF($D$2:$D$151,5)+1-ROW(D4))),\"\")","v":""},"",null,4,0,0,"-"]
[5,0,0,"-",null,5,{"$f":"IFERROR(INDEX($B$2:$B$151,LARGE(($D$2:$D$151=1)*(ROW($D$2:$D$151)-1),COUNTIF($D$2:$D$151,1)+1-ROW(D5))),\"\")","v":""},"",5,{"$f":"IFERROR(INDEX($B$2:$B$151,LARGE(($D$2:$D$151=2)*(ROW($D$2:$D$151)-1),COUNTIF($D$2:$D$151,2)+1-ROW(D5))),\"\")","v":""},"",5,{"$f":"IFERROR(INDEX($B$2:$B$151,LARGE(($D$2:$D$151=3)*(ROW($D$2:$D$151)-1),COUNTIF($D$2:$D$151,3)+1-ROW(D5))),\"\")","v":""},"",5,{"$f":"IFERROR(INDEX($B$2:$B$151,LARGE(($D$2:$D$151=4)*(ROW($D$2:$D$151)-1),COUNTIF($D$2:$D$151,4)+1-ROW(D5))),\"\")","v":""},"",5,{"$f":"IFERROR(INDEX($B$2:$B$151,LARGE(($D$2:$D$151=5)*(ROW($D$2:$D$151)-1),COUNTIF($D$2:$D$151,5)+1-ROW(D5))),\"\")","v":""},"",null,5,0,0,"-"]
[6,0,0,"-",null,6,{"$f":"IFERROR(INDEX($B$2:$B$151,LARGE(($D$2:$D$151=1)*(ROW($D$2:$D$151)-1),COUNTIF($D$2:$D$151,1)+1-ROW(D6))),\"\")","v":""},"",6,{"$f":"IFERROR(INDEX($B$2:$B$151,LARGE(($D$2:$D$151=2)*(ROW($D$2:$D$151)-1),COUNTIF($D$2:$D$151,2)+1-ROW(D6))),\"\")","v":""},"",6,{"$f":"IFERROR(INDEX($B$2:$B$151,LARGE(($D$2:$D$151=3)*(ROW($D$2:$D$151)-1),COUNTIF($D$2:$D$151,3)+1-ROW(D6))),\"\")","v":""},"",6,{"$f":"IFERROR(INDEX($B$2:$B$151,LARGE(($D$2:$D$151=4)*(ROW($D$2:$D$151)-1),COUNTIF($D$2:$D$151,4)+1-ROW(D6))),\"\")","v":""},"",6,{"$f":"IFERROR(INDEX($B$2:$B$151,LARGE(($D$2:$D$151=5)*(ROW($D$2:$D$151)-1),COUNTIF($D$2:$D$151,5)+1-ROW(D6))),\"\")","v":""},"",null,6,0,0,"-"]
[7,0,0,"-",null,7,{"$f":"IFERROR(INDEX($B$2:$B$151,LARGE(($D$2:$D$151=1)*(ROW($D$2:$D$151)-1),COUNTIF($D$2:$D$151,1)+1-ROW(D7))),\"\")","v":""},"",7,{"$f":"IFERROR(INDEX($B$2:$B$151,LARGE(($D$2:$D$151=2)*(ROW($D$2:$D$151)-1),COUNTIF($D$2:$D$151,2)+1-ROW(D7))),\"\")","v":""},"",7,{"$f":"IFERROR(INDEX($B$2:$B$151,LARGE(($D$2:$D$151=3)*(ROW($D$2:$D$151)-1),COUNTIF($D$2:$D$151,3)+1-ROW(D7))),\"\")","v":""},"",7,{"$f":"IFERROR(INDEX($B$2:$B$151,LARGE(($D$2:$D$151=4)*(ROW($D$2:$D$151)-1),COUNTIF($D$2:$D$151,4)+1-ROW(D7))),\"\")","v":""},"",7,{"$f":"IFERROR(INDEX($B$2:$B$151,LARGE(($D$2:$D$151=5)*(ROW($D$2:$D$151)-1),COUNTIF($D$2:$D$151,5)+1-ROW(D7))),\"\")","v":""},"",null,7,0,0,"-"]
[8,0,0,"-",null,8,{"$f":"IFERROR(INDEX($B$2:$B$151,LARGE(($D$2:$D$151=1)*(ROW($D$2:$D$151)-1),COUNTIF($D$2:$D$151,1)+1-ROW(D8))),\"\")","v":""},"",8,{"$f":"IFERROR(INDEX($B$2:$B$151,LARGE(($D$2:$D$151=2)*(ROW($D$2:$D$151)-1),COUNTIF($D$2:$D$151,2)+1-ROW(D8))),\"\")","v":""},"",8,{"$f":"IFERROR(INDEX($B$2:$B$151,LARGE(($D$2:$D$151=3)*(ROW($D$2:$D$151)-1),COUNTIF($D$2:$D$151,3)+1-ROW(D8))),\"\")","v":""},"",8,{"$f":"IFERROR(INDEX($B$2:$B$151,LARGE(($D$2:$D$151=4)*(ROW($D$2:$D$151)-1),COUNTIF($D$2:$D$151,4)+1-ROW(D8))),\"\")","v":""},"",8,{"$f":"IFERROR(INDEX($B$2:$B$151,LARGE(($D$2:$D$151=5)*(ROW($D$2:$D$151)-1),COUNTIF($D$2:$D$151,5)+1-ROW(D8))),\"\")","v":""},"",null,8,0,0,"-"]
[9,0,0,"-",null,9,{"$f":"IFERROR(INDEX($B$2:$B$151,LARGE(($D$2:$D$151=1)*(ROW($D$2:$D$151)-1),COUNTIF($D$2:$D$151,1)+1-ROW(D9))),\"\")","v":""},"",9,{"$f":"IFERROR(INDEX($B$2:$B$151,LARGE(($D$2:$D$151=2)*(ROW($D$2:$D$151)-1),COUNTIF($D$2:$D$151,2)+1-ROW(D9))),\"\")","v":""},"",9,{"$f":"IFERROR(INDEX($B$2:$B$151,LARGE(($D$2:$D$151=3)*(ROW($D$2:$D$151)-1),COUNTIF($D$2:$D$151,3)+1-ROW(D9))),\"\")","v":""},"",9,{"$f":"IFERROR(INDEX($B$2:$B$151,LARGE(($D$2:$D$151=4)*(ROW($D$2:$D$151)-1),COUNTIF($D$2:$D$151,4)+1-ROW(D9))),\"\")","v":""},"",9,{"$f":"IFERROR(INDEX($B$2:$B$151,LARGE(($D$2:$D$151=5)*(ROW($D$2:$D$151)-1),COUNTIF($D$2:$D$151,5)+1-ROW(D9))),\"\")","v":""},"",null,9,0,0,"-"]
[10,0,0,"-",null,10,{"$f":"IFERROR(INDEX($B$2:$B$151,LARGE(($D$2:$D$151=1)*(ROW($D$2:$D$151)-1),COUNTIF($D$2:$D$151,1)+1-ROW(D10))),\"\")","v":""},"",10,{"$f":"IFERROR(INDEX($B$2:$B$151,LARGE(($D$2:$D$151=2)*(ROW($D$2:$D$151)-1),COUNTIF($D$2:$D$151,2)+1-ROW(D10))),\"\")","v":""},"",10,{"$f":"IFERROR(INDEX($B$2:$B$151,LARGE(($D$2:$D$151=3)*(ROW($D$2:$D$151)-1),COUNTIF($D$2:$D$151,3)+1-ROW(D10))),\"\")","v":""},"",10,{"$f":"IFERROR(INDEX($B$2:$B$151,LARGE(($D$2:$D$151=4)*(ROW($D$2:$D$151)-1),COUNTIF($D$2:$D$151,4)+1-ROW(D10))),\"\")","v":""},"",10,{"$f":"IFERROR(INDEX($B$2:$B$151,LARGE(($D$2:$D$151=5)*(ROW($D$2:$D$151)-1),COUNTIF($D$2:$D$151,5)+1-ROW(D10))),\"\")","v":""},"",null,10,0,0,"-"]
[11,0,0,"-",null,11,{"$f":"IFERROR(INDEX($B$2:$B$151,LARGE(($D$2:$D$151=1)*(ROW($D$2:$D$151)-1),COUNTIF($D$2:$D$151,1)+1-ROW(D11))),\"\")","v":""},"",11,{"$f":"IFERROR(INDEX($B$2:$B$151,LARGE(($D$2:$D$151=2)*(ROW($D$2:$D$151)-1),COUNTIF($D$2:$D$151,2)+1-ROW(D11))),\"\")","v":""},"",11,{"$f":"IFERROR(INDEX($B$2:$B$151,LARGE(($D$2:$D$151=3)*(ROW($D$2:$D$151)-1),COUNTIF($D$2:$D$151,3)+1-ROW(D11))),\"\")","v":""},"",11,{"$f":"IFERROR(INDEX($B$2:$B$151,LARGE(($D$2:$D$151=4)*(ROW($D$2:$D$151)-1),COUNTIF($D$2:$D$151,4)+1-ROW(D11))),\"\")","v":""},"",11,{"$f":"IFERROR(INDEX($B$2:$B$151,LARGE(($D$2:$D$151=5)*(ROW($D$2:$D$151)-1),COUNTIF($D$2:$D$151,5)+1-ROW(D11))),\"\")","v":""},"",null,11,0,0,"-"]
[12,0,0,"-",null,12,{"$f":"IFERROR(INDEX($B$2:$B$151,LARGE(($D$2:$D$151=1)*(ROW($D$2:$D$151)-1),COUNTIF($D$2:$D$151,1)+1-ROW(D12))),\"\")","v":""},"",12,{"$f":"IFERROR(INDEX($B$2:$B$151,LARGE(($D$2:$D$151=2)*(ROW($D$2:$D$151)-1),COUNTIF($D$2:$D$151,2)+1-ROW(D12))),\"\")","v":""},"",12,{"$f":"IFERROR(INDEX($B$2:$B$151,LARGE(($D$2:$D$151=3)*(ROW($D$2:$D$151)-1),COUNTIF($D$2:$D$151,3)+1-ROW(D12))),\"\")","v":""},"",12,{"$f":"IFERROR(INDEX($B$2:$B$151,LARGE(($D$2:$D$151=4)*(ROW($D$2:$D$151)-1),COUNTIF($D$2:$D$151,4)+1-ROW(D12))),\"\")","v":""},"",12,{"$f":"IFERROR(INDEX($B$2:$B$151,LARGE(($D$2:$D$151=5)*(ROW($D$2:$D$151)-1),COUNTIF($D$2:$D$151,5)+1-ROW(D12))),\"\")","v":""},"",null,12,0,0,"-"]
[13,0,0,"-",null,13,{"$f":"IFERROR(INDEX($B$2:$B$151,LARGE(($D$2:$D$151=1)*(ROW($D$2:$D$151)-1),COUNTIF($D$2:$D$151,1)+1-ROW(D13))),\"\")","v":""},"",13,{"$f":"IFERROR(INDEX($B$2:$B$151,LARGE(($D$2:$D$151=2)*(ROW($D$2:$D$151)-1),COUNTIF($D$2:$D$151,2)+1-ROW(D13))),\"\")","v":""},"",13,{"$f":"IFERROR(INDEX($B$2:$B$151,LARGE(($D$2:$D$151=3)*(ROW($D$2:$D$151)-1),COUNTIF($D$2:$D$151,3)+1-ROW(D13))),\"\")","v":""},"",13,{"$f":"IFERROR(INDEX($B$2:$B$151,LARGE(($D$2:$D$151=4)*(ROW($D$2:$D$151)-1),COUNTIF($D$2:$D$151,4)+1-ROW(D13))),\"\")","v":""},"",13,{"$f":"IFERROR(INDEX($B$2:$B$151,LARGE(($D$2:$D$151=5)*(ROW($D$2:$D$151)-1),COUNTIF($D$2:$D$151,5)+1-ROW(D13))),\"\")","v":""},"",null,13,0,0,"-"]
[14,0,0,"-",null,14,{"$f":"IFERROR(INDEX($B$2:$B$151,LARGE(($D$2:$D$151=1)*(ROW($D$2:$D$151)-1),COUNTIF($D$2:$D$151,1)+1-ROW(D14))),\"\")","v":""},"",14,{"$f":"IFERROR(INDEX($B$2:$B$151,LARGE(($D$2:$D$151=2)*(ROW($D$2:$D$151)-1),COUNTIF($D$2:$D$151,2)+1-ROW(D14))),\"\")","v":""},"",14,{"$f":"IFERROR(INDEX($B$2:$B$151,LARGE(($D$2:$D$151=3)*(ROW($D$2:$D$151)-1),COUNTIF($D$2:$D$151,3)+1-ROW(D14))),\"\")","v":""},"",14,{"$f":"IFERROR(INDEX($B$2:$B$151,LARGE(($D$2:$D$151=4)*(ROW($D$2:$D$151)-1),COUNTIF($D$2:$D$151,4)+1-ROW(D14))),\"\")","v":""},"",14,{"$f":"IFERROR(INDEX($B$2:$B$151,LARGE(($D$2:$D$151=5)*(ROW($D$2:$D$151)-1),COUNTIF($D$2:$D$151,5)+1-ROW(D14))),\"\")","v":""},"",null,14,0,0,"-"]
[15,0,0,"-",null,15,{"$f":"IFERROR(INDEX($B$2:$B$151,LARGE(($D$2:$D$151=1)*(ROW($D$2:$D$151)-1),COUNTIF($D$2:$D$151,1)+1-ROW(D15))),\"\")","v":""},"",15,{"$f":"IFERROR(INDEX($B$2:$B$151,LARGE(($D$2:$D$151=2)*(ROW($D$2:$D$151)-1),COUNTIF($D$2:$D$151,2)+1-ROW(D15))),\"\")","v":""},"",15,{"$f":"IFERROR(INDEX($B$2:$B$151,LARGE(($D$2:$D$151=3)*(ROW($D$2:$D$151)-1),COUNTIF($D$2:$D$151,3)+1-ROW(D15))),\"\")","v":""},"",15,{"$f":"IFERROR(INDEX($B$2:$B$151,LARGE(($D$2:$D$151=4)*(ROW($D$2:$D$151)-1),COUNTIF($D$2:$D$151,4)+1-ROW(D15))),\"\")","v":""},"",15,{"$f":"IFERROR(INDEX($B$2:$B$151,LARGE(($D$2:$D$151=5)*(ROW($D$2:$D$151)-1),COUNTIF($D$2:$D$151,5)+1-ROW(D15))),\"\")","v":""},"",null,15,0,0,"-"]
[16,0,0,"-",null,16,{"$f":"IFERROR(INDEX($B$2:$B$151,LARGE(($D$2:$D$151=1)*(ROW($D$2:$D$151)-1),COUNTIF($D$2:$D$151,1)+1-ROW(D16))),\"\")","v":""},"",16,{"$f":"IFERROR(INDEX($B$2:$B$151,LARGE(($D$2:$D$151=2)*(ROW($D$2:$D$151)-1),COUNTIF($D$2:$D$151,2)+1-ROW(D16))),\"\")","v":""},"",16,{"$f":"IFERROR(INDEX($B$2:$B$151,LARGE(($D$2:$D$151=3)*(ROW($D$2:$D$151)-1),COUNTIF($D$2:$D$151,3)+1-ROW(D16))),\"\")","v":""},"",16,{"$f":"IFERROR(INDEX($B$2:$B$151,LARGE(($D$2:$D$151=4)*(ROW($D$2:$D$151)-1),COUNTIF($D$2:$D$151,4)+1-ROW(D16))),\"\")","v":""},"",16,{"$f":"IFERROR(INDEX($B$2:$B$151,LARGE(($D$2:$D$151=5)*(ROW($D$2:$D$151)-1),COUNTIF($D$2:$D$151,5)+1-ROW(D16))),\"\")","v":""},"",null,16,0,0,"-"]
[17,0,0,"-",null,17,{"$f":"IFERROR(INDEX($B$2:$B$151,LARGE(($D$2:$D$151=1)*(ROW($D$2:$D$151)-1),COUNTIF($D$2:$D$151,1)+1-ROW(D17))),\"\")","v":""},"",17,{"$f":"IFERROR(INDEX($B$2:$B$151,LARGE(($D$2:$D$151=2)*(ROW($D$2:$D$151)-1),COUNTIF($D$2:$D$151,2)+1-ROW(D17))),\"\")","v":""},"",17,{"$f":"IFERROR(INDEX($B$2:$B$151,LARGE(($D$2:$D$151=3)*(ROW($D$2:$D$151)-1),COUNTIF($D$2:$D$151,3)+1-ROW(D17))),\"\")","v":""},"",17,{"$f":"IFERROR(INDEX($B$2:$B$151,LARGE(($D$2:$D$151=4)*(ROW($D$2:$D$151)-1),COUNTIF($D$2:$D$151,4)+1-ROW(D17))),\"\")","v":""},"",17,{"$f":"IFERROR(INDEX($B$2:$B$151,LARGE(($D$2:$D$151=5)*(ROW($D$2:$D$151)-1),COUNTIF($D$2:$D$151,5)+1-ROW(D17))),\"\")","v":""},"",null,17,0,0,"-"]
[18,0,0,"-",null,18,{"$f":"IFERROR(INDEX($B$2:$B$151,LARGE(($D$2:$D$151=1)*(ROW($D$2:$D$151)-1),COUNTIF($D$2:$D$151,1)+1-ROW(D18))),\"\")","v":""},"",18,{"$f":"IFERROR(INDEX($B$2:$B$151,LARGE(($D$2:$D$151=2)*(ROW($D$2:$D$151)-1),COUNTIF($D$2:$D$151,2)+1-ROW(D18))),\"\")","v":""},"",18,{"$f":"IFERROR(INDEX($B$2:$B$151,LARGE(($D$2:$D$151=3)*(ROW($D$2:$D$151)-1),COUNTIF($D$2:$D$151,3)+1-ROW(D18))),\"\")","v":""},"",18,{"$f":"IFERROR(INDEX($B$2:$B$151,LARGE(($D$2:$D$151=4)*(ROW($D$2:$D$151)-1),COUNTIF($D$2:$D$151,4)+1-ROW(D18))),\"\")","v":""},"",18,{"$f":"IFERROR(INDEX($B$2:$B$151,LARGE(($D$2:$D$151=5)*(ROW($D$2:$D$151)-1),COUNTIF($D$2:$D$151,5)+1-ROW(D18))),\"\")","v":""},"",null,18,0,0,"-"]
[19,0,0,"-",null,19,{"$f":"IFERROR(INDEX($B$2:$B$151,LARGE(($D$2:$D$151=1)*(ROW($D$2:$D$151)-1),COUNTIF($D$2:$D$151,1)+1-ROW(D19))),\"\")","v":""},"",19,{"$f":"IFERROR(INDEX($B$2:$B$151,LARGE(($D$2:$D$151=2)*(ROW($D$2:$D$151)-1),COUNTIF($D$2:$D$151,2)+1-ROW(D19))),\"\")","v":""},"",19,{"$f":"IFERROR(INDEX($B$2:$B$151,LARGE(($D$2:$D$151=3)*(ROW($D$2:$D$151)-1),COUNTIF($D$2:$D$151,3)+1-ROW(D19))),\"\")","v":""},"",19,{"$f":"IFERROR(INDEX($B$2:$B$151,LARGE(($D$2:$D$151=4)*(ROW($D$2:$D$151)-1),COUNTIF($D$2:$D$151,4)+1-ROW(D19))),\"\")","v":""},"",19,{"$f":"IFERROR(INDEX($B$2:$B$151,LARGE(($D$2:$D$151=5)*(ROW($D$2:$D$151)-1),COUNTIF($D$2:$D$151,5)+1-ROW(D19))),\"\")","v":""},"",null,19,0,0,"-"]
[20,0,0,"-",null,20,{"$f":"IFERROR(INDEX($B$2:$B$151,LARGE(($D$2:$D$151=1)*(ROW($D$2:$D$151)-1),COUNTIF($D$2:$D$151,1)+1-ROW(D20))),\"\")","v":""},"",20,{"$f":"IFERROR(INDEX($B$2:$B$151,LARGE(($D$2:$D$151=2)*(ROW($D$2:$D$151)-1),COUNTIF($D$2:$D$151,2)+1-ROW(D20))),\"\")","v":""},"",20,{"$f":"IFERROR(INDEX($B$2:$B$151,LARGE(($D$2:$D$151=3)*(ROW($D$2:$D$151)-1),COUNTIF($D$2:$D$151,3)+1-ROW(D20))),\"\")","v":""},"",20,{"$f":"IFERROR(INDEX($B$2:$B$151,LARGE(($D$2:$D$151=4)*(ROW($D$2:$D$151)-1),COUNTIF($D$2:$D$151,4)+1-ROW(D20))),\"\")","v":""},"",20,{"$f":"IFERROR(INDEX($B$2:$B$151,LARGE(($D$2:$D$151=5)*(ROW($D$2:$D$151)-1),COUNTIF($D$2:$D$151,5)+1-ROW(D20))),\"\")","v":""},"",null,20,0,0,"-"]
[21,0,0,"-",null,21,{"$f":"IFERROR(INDEX($B$2:$B$151,LARGE(($D$2:$D$151=1)*(ROW($D$2:$D$151)-1),COUNTIF($D$2:$D$151,1)+1-ROW(D21))),\"\")","v":""},"",21,{"$f":"IFERROR(INDEX($B$2:$B$151,LARGE(($D$2:$D$151=2)*(ROW($D$2:$D$151)-1),COUNTIF($D$2:$D$151,2)+1-ROW(D21))),\"\")","v":""},"",21,{"$f":"IFERROR(INDEX($B$2:$B$151,LARGE(($D$2:$D$151=3)*(ROW($D$2:$D$151)-1),COUNTIF($D$2:$D$151,3)+1-ROW(D21))),\"\")","v":""},"",21,{"$f":"IFERROR(INDEX($B$2:$B$151,LARGE(($D$2:$D$151=4)*(ROW($D$2:$D$151)-1),COUNTIF($D$2:$D$151,4)+1-ROW(D21))),\"\")","v":""},"",21,{"$f":"IFERROR(INDEX($B$2:$B$151,LARGE(($D$2:$D$151=5)*(ROW($D$2:$D$151)-1),COUNTIF($D$2:$D$151,5)+1-ROW(D21))),\"\")","v":""},"",null,21,0,0,"-"]
[22,0,0,"-",null,22,{"$f":"IFERROR(INDEX($B$2:$B$151,LARGE(($D$2:$D$151=1)*(ROW($D$2:$D$151)-1),COUNTIF($D$2:$D$151,1)+1-ROW(D22))),\"\")","v":""},"",22,{"$f":"IFERROR(INDEX($B$2:$B$151,LARGE(($D$2:$D$151=2)*(ROW($D$2:$D$151)-1),COUNTIF($D$2:$D$151,2)+1-ROW(D22))),\"\")","v":""},"",22,{"$f":"IFERROR(INDEX($B$2:$B$151,LARGE(($D$2:$D$151=3)*(ROW($D$2:$D$151)-1),COUNTIF($D$2:$D$151,3)+1-ROW(D22))),\"\")","v":""},"",22,{"$f":"IFERROR(INDEX($B$2:$B$151,LARGE(($D$2:$D$151=4)*(ROW($D$2:$D$151)-1),COUNTIF($D$2:$D$151,4)+1-ROW(D22))),\"\")","v":""},"",22,{"$f":"IFERROR(INDEX($B$2:$B$151,LARGE(($D$2:$D$151=5)*(ROW($D$2:$D$151)-1),COUNTIF($D$2:$D$151,5)+1-ROW(D22))),\"\")","v":""},"",null,22,0,0,"-"]
[23,0,0,"-",null,23,{"$f":"IFERROR(INDEX($B$2:$B$151,LARGE(($D$2:$D$151=1)*(ROW($D$2:$D$151)-1),COUNTIF($D$2:$D$151,1)+1-ROW(D23))),\"\")","v":""},"",23,{"$f":"IFERROR(INDEX($B$2:$B$151,LARGE(($D$2:$D$151=2)*(ROW($D$2:$D$151)-1),COUNTIF($D$2:$D$151,2)+1-ROW(D23))),\"\")","v":""},"",23,{"$f":"IFERROR(INDEX($B$2:$B$151,LARGE(($D$2:$D$151=3)*(ROW($D$2:$D$151)-1),COUNTIF($D$2:$D$151,3)+1-ROW(D23))),\"\")","v":""},"",23,{"$f":"IFERROR(INDEX($B$2:$B$151,LARGE(($D$2:$D$151=4)*(ROW($D$2:$D$151)-1),COUNTIF($D$2:$D$151,4)+1-ROW(D23))),\"\")","v":""},"",23,{"$f":"IFERROR(INDEX($B$2:$B$151,LARGE(($D$2:$D$151=5)*(ROW($D$2:$D$151)-1),COUNTIF($D$2:$D$151,5)+1-ROW(D23))),\"\")","v":""},"",null,23,0,0,"-"]
[24,0,0,"-",null,24,{"$f":"IFERROR(INDEX($B$2:$B$151,LARGE(($D$2:$D$151=1)*(ROW($D$2:$D$151)-1),COUNTIF($D$2:$D$151,1)+1-ROW(D24))),\"\")","v":""},"",24,{"$f":"IFERROR(INDEX($B$2:$B$151,LARGE(($D$2:$D$151=2)*(ROW($D$2:$D$151)-1),COUNTIF($D$2:$D$151,2)+1-ROW(D24))),\"\")","v":""},"",24,{"$f":"IFERROR(INDEX($B$2:$B$151,LARGE(($D$2:$D$151=3)*(ROW($D$2:$D$151)-1),COUNTIF($D$2:$D$151,3)+1-ROW(D24))),\"\")","v":""},"",24,{"$f":"IFERROR(INDEX($B$2:$B$151,LARGE(($D$2:$D$151=4)*(ROW($D$2:$D$151)-1),COUNTIF($D$2:$D$151,4)+1-ROW(D24))),\"\")","v":""},"",24,{"$f":"IFERROR(INDEX($B$2:$B$151,LARGE(($D$2:$D$151=5)*(ROW($D$2:$D$151)-1),COUNTIF($D$2:$D$151,5)+1-ROW(D24))),\"\")","v":""},"",null,24,0,0,"-"]
[25,0,0,"-",null,25,{"$f":"IFERROR(INDEX($B$2:$B$151,LARGE(($D$2:$D$151=1)*(ROW($D$2:$D$151)-1),COUNTIF($D$2:$D$151,1)+1-ROW(D25))),\"\")","v":""},"",25,{"$f":"IFERROR(INDEX($B$2:$B$151,LARGE(($D$2:$D$151=2)*(ROW($D$2:$D$151)-1),COUNTIF($D$2:$D$151,2)+1-ROW(D25))),\"\")","v":""},"",25,{"$f":"IFERROR(INDEX($B$2:$B$151,LARGE(($D$2:$D$151=3)*(ROW($D$2:$D$151)-1),COUNTIF($D$2:$D$151,3)+1-ROW(D25))),\"\")","v":""},"",25,{"$f":"IFERROR(INDEX($B$2:$B$151,LARGE(($D$2:$D$151=4)*(ROW($D$2:$D$151)-1),COUNTIF($D$2:$D$151,4)+1-ROW(D25))),\"\")","v":""},"",25,{"$f":"IFERROR(INDEX($B$2:$B$151,LARGE(($D$2:$D$151=5)*(ROW($D$2:$D$151)-1),COUNTIF($D$2:$D$151,5)+1-ROW(D25))),\"\")","v":""},"",null,25,0,0,"-"]
[26,0,0,"-",null,26,{"$f":"IFERROR(INDEX($B$2:$B$151,LARGE(($D$2:$D$151=1)*(ROW($D$2:$D$151)-1),COUNTIF($D$2:$D$151,1)+1-ROW(D26))),\"\")","v":""},"",26,{"$f":"IFERROR(INDEX($B$2:$B$151,LARGE(($D$2:$D$151=2)*(ROW($D$2:$D$151)-1),COUNTIF($D$2:$D$151,2)+1-ROW(D26))),\"\")","v":""},"",26,{"$f":"IFERROR(INDEX($B$2:$B$151,LARGE(($D$2:$D$151=3)*(ROW($D$2:$D$151)-1),COUNTIF($D$2:$D$151,3)+1-ROW(D26))),\"\")","v":""},"",26,{"$f":"IFERROR(INDEX($B$2:$B$151,LARGE(($D$2:$D$151=4)*(ROW($D$2:$D$151)-1),COUNTIF($D$2:$D$151,4)+1-ROW(D26))),\"\")","v":""},"",26,{"$f":"IFERROR(INDEX($B$2:$B$151,LARGE(($D$2:$D$151=5)*(ROW($D$2:$D$151)-1),COUNTIF($D$2:$D$151,5)+1-ROW(D26))),\"\")","v":""},"",null,26,0,0,"-"]
[27,0,0,"-",null,27,{"$f":"IFERROR(INDEX($B$2:$B$151,LARGE(($D$2:$D$151=1)*(ROW($D$2:$D$151)-1),COUNTIF($D$2:$D$151,1)+1-ROW(D27))),\"\")","v":""},"",27,{"$f":"IFERROR(INDEX($B$2:$B$151,LARGE(($D$2:$D$151=2)*(ROW($D$2:$D$151)-1),COUNTIF($D$2:$D$151,2)+1-ROW(D27))),\"\")","v":""},"",27,{"$f":"IFERROR(INDEX($B$2:$B$151,LARGE(($D$2:$D$151=3)*(ROW($D$2:$D$151)-1),COUNTIF($D$2:$D$151,3)+1-ROW(D27))),\"\")","v":""},"",27,{"$f":"IFERROR(INDEX($B$2:$B$151,LARGE(($D$2:$D$151=4)*(ROW($D$2:$D$151)-1),COUNTIF($D$2:$D$151,4)+1-ROW(D27))),\"\")","v":""},"",27,{"$f":"IFERROR(INDEX($B$2:$B$151,LARGE(($D$2:$D$151=5)*(ROW($D$2:$D$151)-1),COUNTIF($D$2:$D$151,5)+1-ROW(D27))),\"\")","v":""},"",null,27,0,0,"-"]
[28,0,0,"-",null,28,{"$f":"IFERROR(INDEX($B$2:$B$151,LARGE(($D$2:$D$151=1)*(ROW($D$2:$D$151)-1),COUNTIF($D$2:$D$151,1)+1-ROW(D28))),\"\")","v":""},"",28,{"$f":"IFERROR(INDEX($B$2:$B$151,LARGE(($D$2:$D$151=2)*(ROW($D$2:$D$151)-1),COUNTIF($D$2:$D$151,2)+1-ROW(D28))),\"\")","v":""},"",28,{"$f":"IFERROR(INDEX($B$2:$B$151,LARGE(($D$2:$D$151=3)*(ROW($D$2:$D$151)-1),COUNTIF($D$2:$D$151,3)+1-ROW(D28))),\"\")","v":""},"",28,{"$f":"IFERROR(INDEX($B$2:$B$151,LARGE(($D$2:$D$151=4)*(ROW($D$2:$D$151)-1),COUNTIF($D$2:$D$151,4)+1-ROW(D28))),\"\")","v":""},"",28,{"$f":"IFERROR(INDEX($B$2:$B$151,LARGE(($D$2:$D$151=5)*(ROW($D$2:$D$151)-1),COUNTIF($D$2:$D$151,5)+1-ROW(D28))),\"\")","v":""},"",null,28,0,0,"-"]
[29,0,0,"-",null,29,{"$f":"IFERROR(INDEX($B$2:$B$151,LARGE(($D$2:$D$151=1)*(ROW($D$2:$D$151)-1),COUNTIF($D$2:$D$151,1)+1-ROW(D29))),\"\")","v":""},"",29,{"$f":"IFERROR(INDEX($B$2:$B$151,LARGE(($D$2:$D$151=2)*(ROW($D$2:$D$151)-1),COUNTIF($D$2:$D$151,2)+1-ROW(D29))),\"\")","v":""},"",29,{"$f":"IFERROR(INDEX($B$2:$B$151,LARGE(($D$2:$D$151=3)*(ROW($D$2:$D$151)-1),COUNTIF($D$2:$D$151,3)+1-ROW(D29))),\"\")","v":""},"",29,{"$f":"IFERROR(INDEX($B$2:$B$151,LARGE(($D$2:$D$151=4)*(ROW($D$2:$D$151)-1),COUNTIF($D$2:$D$151,4)+1-ROW(D29))),\"\")","v":""},"",29,{"$f":"IFERROR(INDEX($B$2:$B$151,LARGE(($D$2:$D$151=5)*(ROW($D$2:$D$151)-1),COUNTIF($D$2:$D$151,5)+1-ROW(D29))),\"\")","v":""},"",null,29,0,0,"-"]
[30,0,0,"-",null,30,{"$f":"IFERROR(INDEX($B$2:$B$151,LARGE(($D$2:$D$151=1)*(ROW($D$2:$D$151)-1),COUNTIF($D$2:$D$151,1)+1-ROW(D30))),\"\")","v":""},"",30,{"$f":"IFERROR(INDEX($B$2:$B$151,LARGE(($D$2:$D$151=2)*(ROW($D$2:$D$151)-1),COUNTIF($D$2:$D$151,2)+1-ROW(D30))),\"\")","v":""},"",30,{"$f":"IFERROR(INDEX($B$2:$B$151,LARGE(($D$2:$D$151=3)*(ROW($D$2:$D$151)-1),COUNTIF($D$2:$D$151,3)+1-ROW(D30))),\"\")","v":""},"",30,{"$f":"IFERROR(INDEX($B$2:$B$151,LARGE(($D$2:$D$151=4)*(ROW($D$2:$D$151)-1),COUNTIF($D$2:$D$151,4)+1-ROW(D30))),\"\")","v":""},"",30,{"$f":"IFERROR(INDEX($B$2:$B$151,LARGE(($D$2:$D$151=5)*(ROW($D$2:$D$151)-1),COUNTIF($D$2:$D$151,5)+1-ROW(D30))),\"\")","v":""},"",null,30,0,0,"-"]
[31,0,0,"-",null,31,{"$f":"IFERROR(INDEX($B$2:$B$151,LARGE(($D$2:$D$151=1)*(ROW($D$2:$D$151)-1),COUNTIF($D$2:$D$151,1)+1-ROW(D31))),\"\")","v":""},"",31,{"$f":"IFERROR(INDEX($B$2:$B$151,LARGE(($D$2:$D$151=2)*(ROW($D$2:$D$151)-1),COUNTIF($D$2:$D$151,2)+1-ROW(D31))),\"\")","v":""},"",31,{"$f":"IFERROR(INDEX($B$2:$B$151,LARGE(($D$2:$D$151=3)*(ROW($D$2:$D$151)-1),COUNTIF($D$2:$D$151,3)+1-ROW(D31))),\"\")","v":""},"",31,{"$f":"IFERROR(INDEX($B$2:$B$151,LARGE(($D$2:$D$151=4)*(ROW($D$2:$D$151)-1),COUNTIF($D$2:$D$151,4)+1-ROW(D31))),\"\")","v":""},"",31,{"$f":"IFERROR(INDEX($B$2:$B$151,LARGE(($D$2:$D$151=5)*(ROW($D$2:$D$151)-1),COUNTIF($D$2:$D$151,5)+1-ROW(D31))),\"\")","v":""},"",null,31,0,0,"-"]
[32,0,0,"-",null,32,{"$f":"IFERROR(INDEX($B$2:$B$151,LARGE(($D$2:$D$151=1)*(ROW($D$2:$D$151)-1),COUNTIF($D$2:$D$151,1)+1-ROW(D32))),\"\")","v":""},"",32,{"$f":"IFERROR(INDEX($B$2:$B$151,LARGE(($D$2:$D$151=2)*(ROW($D$2:$D$151)-1),COUNTIF($D$2:$D$151,2)+1-ROW(D32))),\"\")","v":""},"",32,{"$f":"IFERROR(INDEX($B$2:$B$151,LARGE(($D$2:$D$151=3)*(ROW($D$2:$D$151)-1),COUNTIF($D$2:$D$151,3)+1-ROW(D32))),\"\")","v":""},"",32,{"$f":"IFERROR(INDEX($B$2:$B$151,LARGE(($D$2:$D$151=4)*(ROW($D$2:$D$151)-1),COUNTIF($D$2:$D$151,4)+1-ROW(D32))),\"\")","v":""},"",32,{"$f":"IFERROR(INDEX($B$2:$B$151,LARGE(($D$2:$D$151=5)*(ROW($D$2:$D$151)-1),COUNTIF($D$2:$D$151,5)+1-ROW(D32))),\"\")","v":""},"",null,32,0,0,"-"]
[33,0,0,"-",null,33,{"$f":"IFERROR(INDEX($B$2:$B$151,LARGE(($D$2:$D$151=1)*(ROW($D$2:$D$151)-1),COUNTIF($D$2:$D$151,1)+1-ROW(D33))),\"\")","v":""},"",33,{"$f":"IFERROR(INDEX($B$2:$B$151,LARGE(($D$2:$D$151=2)*(ROW($D$2:$D$151)-1),COUNTIF($D$2:$D$151,2)+1-ROW(D33))),\"\")","v":""},"",33,{"$f":"IFERROR(INDEX($B$2:$B$151,LARGE(($D$2:$D$151=3)*(ROW($D$2:$D$151)-1),COUNTIF($D$2:$D$151,3)+1-ROW(D33))),\"\")","v":""},"",33,{"$f":"IFERROR(INDEX($B$2:$B$151,LARGE(($D$2:$D$151=4)*(ROW($D$2:$D$151)-1),COUNTIF($D$2:$D$151,4)+1-ROW(D33))),\"\")","v":""},"",33,{"$f":"IFERROR(INDEX($B$2:$B$151,LARGE(($D$2:$D$151=5)*(ROW($D$2:$D$151)-1),COUNTIF($D$2:$D$151,5)+1-ROW(D33))),\"\")","v":""},"",null,33,0,0,"-"]
[34,0,0,"-",null,34,{"$f":"IFERROR(INDEX($B$2:$B$151,LARGE(($D$2:$D$151=1)*(ROW($D$2:$D$151)-1),COUNTIF($D$2:$D$151,1)+1-ROW(D34))),\"\")","v":""},"",34,{"$f":"IFERROR(INDEX($B$2:$B$151,LARGE(($D$2:$D$151=2)*(ROW($D$2:$D$151)-1),COUNTIF($D$2:$D$151,2)+1-ROW(D34))),\"\")","v":""},"",34,{"$f":"IFERROR(INDEX($B$2:$B$151,LARGE(($D$2:$D$151=3)*(ROW($D$2:$D$151)-1),COUNTIF($D$2:$D$151,3)+1-ROW(D34))),\"\")","v":""},"",34,{"$f":"IFERROR(INDEX($B$2:$B$151,LARGE(($D$2:$D$151=4)*(ROW($D$2:$D$151)-1),COUNTIF($D$2:$D$151,4)+1-ROW(D34))),\"\")","v":""},"",34,{"$f":"IFERROR(INDEX($B$2:$B$151,LARGE(($D$2:$D$151=5)*(ROW($D$2:$D$151)-1),COUNTIF($D$2:$D$151,5)+1-ROW(D34))),\"\")","v":""},"",null,34,0,0,"-"]
[35,0,0,"-",null,35,{"$f":"IFERROR(INDEX($B$2:$B$151,LARGE(($D$2:$D$151=1)*(ROW($D$2:$D$151)-1),COUNTIF($D$2:$D$151,1)+1-ROW(D35))),\"\")","v":""},"",35,{"$f":"IFERROR(INDEX($B$2:$B$151,LARGE(($D$2:$D$151=2)*(ROW($D$2:$D$151)-1),COUNTIF($D$2:$D$151,2)+1-ROW(D35))),\"\")","v":""},"",35,{"$f":"IFERROR(INDEX($B$2:$B$151,LARGE(($D$2:$D$151=3)*(ROW($D$2:$D$151)-1),COUNTIF($D$2:$D$151,3)+1-ROW(D35))),\"\")","v":""},"",35,{"$f":"IFERROR(INDEX($B$2:$B$151,LARGE(($D$2:$D$151=4)*(ROW($D$2:$D$151)-1),COUNTIF($D$2:$D$151,4)+1-ROW(D35))),\"\")","v":""},"",35,{"$f":"IFERROR(INDEX($B$2:$B$151,LARGE(($D$2:$D$151=5)*(ROW($D$2:$D$151)-1),COUNTIF($D$2:$D$151,5)+1-ROW(D35))),\"\")","v":""},"",null,35,0,0,"-"]
[36,0,0,"-",null,36,{"$f":"IFERROR(INDEX($B$2:$B$151,LARGE(($D$2:$D$151=1)*(ROW($D$2:$D$151)-1),COUNTIF($D$2:$D$151,1)+1-ROW(D36))),\"\")","v":""},"",36,{"$f":"IFERROR(INDEX($B$2:$B$151,LARGE(($D$2:$D$151=2)*(ROW($D$2:$D$151)-1),COUNTIF($D$2:$D$151,2)+1-ROW(D36))),\"\")","v":""},"",36,{"$f":"IFERROR(INDEX($B$2:$B$151,LARGE(($D$2:$D$151=3)*(ROW($D$2:$D$151)-1),COUNTIF($D$2:$D$151,3)+1-ROW(D36))),\"\")","v":""},"",36,{"$f":"IFERROR(INDEX($B$2:$B$151,LARGE(($D$2:$D$151=4)*(ROW($D$2:$D$151)-1),COUNTIF($D$2:$D$151,4)+1-ROW(D36))),\"\")","v":""},"",36,{"$f":"IFERROR(INDEX($B$2:$B$151,LARGE(($D$2:$D$151=5)*(ROW($D$2:$D$151)-1),COUNTIF($D$2:$D$151,5)+1-ROW(D36))),\"\")","v":""},"",null,36,0,0,"-"]
[37,0,0,"-",null,37,{"$f":"IFERROR(INDEX($B$2:$B$151,LARGE(($D$2:$D$151=1)*(ROW($D$2:$D$151)-1),COUNTIF($D$2:$D$151,1)+1-ROW(D37))),\"\")","v":""},"",37,{"$f":"IFERROR(INDEX($B$2:$B$151,LARGE(($D$2:$D$151=2)*(ROW($D$2:$D$151)-1),COUNTIF($D$2:$D$151,2)+1-ROW(D37))),\"\")","v":""},"",37,{"$f":"IFERROR(INDEX($B$2:$B$151,LARGE(($D$2:$D$151=3)*(ROW($D$2:$D$151)-1),COUNTIF($D$2:$D$151,3)+1-ROW(D37))),\"\")","v":""},"",37,{"$f":"IFERROR(INDEX($B$2:$B$151,LARGE(($D$2:$D$151=4)*(ROW($D$2:$D$151)-1),COUNTIF($D$2:$D$151,4)+1-ROW(D37))),\"\")","v":""},"",37,{"$f":"IFERROR(INDEX($B$2:$B$151,LARGE(($D$2:$D$151=5)*(ROW($D$2:$D$151)-1),COUNTIF($D$2:$D$151,5)+1-ROW(D37))),\"\")","v":""},"",null,37,0,0,"-"]
[38,0,0,"-",null,38,{"$f":"IFERROR(INDEX($B$2:$B$151,LARGE(($D$2:$D$151=1)*(ROW($D$2:$D$151)-1),COUNTIF($D$2:$D$151,1)+1-ROW(D38))),\"\")","v":""},"",38,{"$f":"IFERROR(INDEX($B$2:$B$151,LARGE(($D$2:$D$151=2)*(ROW($D$2:$D$151)-1),COUNTIF($D$2:$D$151,2)+1-ROW(D38))),\"\")","v":""},"",38,{"$f":"IFERROR(INDEX($B$2:$B$151,LARGE(($D$2:$D$151=3)*(ROW($D$2:$D$151)-1),COUNTIF($D$2:$D$151,3)+1-ROW(D38))),\"\")","v":""},"",38,{"$f":"IFERROR(INDEX($B$2:$B$151,LARGE(($D$2:$D$151=4)*(ROW($D$2:$D$151)-1),COUNTIF($D$2:$D$151,4)+1-ROW(D38))),\"\")","v":""},"",38,{"$f":"IFERROR(INDEX($B$2:$B$151,LARGE(($D$2:$D$151=5)*(ROW($D$2:$D$151)-1),COUNTIF($D$2:$D$151,5)+1-ROW(D38))),\"\")","v":""},"",null,38,0,0,"-"]
[39,0,0,"-",null,39,{"$f":"IFERROR(INDEX($B$2:$B$151,LARGE(($D$2:$D$151=1)*(ROW($D$2:$D$151)-1),COUNTIF($D$2:$D$151,1)+1-ROW(D39))),\"\")","v":""},"",39,{"$f":"IFERROR(INDEX($B$2:$B$151,LARGE(($D$2:$D$151=2)*(ROW($D$2:$D$151)-1),COUNTIF($D$2:$D$151,2)+1-ROW(D39))),\"\")","v":""},"",39,{"$f":"IFERROR(INDEX($B$2:$B$151,LARGE(($D$2:$D$151=3)*(ROW($D$2:$D$151)-1),COUNTIF($D$2:$D$151,3)+1-ROW(D39))),\"\")","v":""},"",39,{"$f":"IFERROR(INDEX($B$2:$B$151,LARGE(($D$2:$D$151=4)*(ROW($D$2:$D$151)-1),COUNTIF($D$2:$D$151,4)+1-ROW(D39))),\"\")","v":""},"",39,{"$f":"IFERROR(INDEX($B$2:$B$151,LARGE(($D$2:$D$151=5)*(ROW($D$2:$D$151)-1),COUNTIF($D$2:$D$151,5)+1-ROW(D39))),\"\")","v":""},"",null,39,0,0,"-"]
[40,0,0,"-",null,40,{"$f":"IFERROR(INDEX($B$2:$B$151,LARGE(($D$2:$D$151=1)*(ROW($D$2:$D$151)-1),COUNTIF($D$2:$D$151,1)+1-ROW(D40))),\"\")","v":""},"",40,{"$f":"IFERROR(INDEX($B$2:$B$151,LARGE(($D$2:$D$151=2)*(ROW($D$2:$D$151)-1),COUNTIF($D$2:$D$151,2)+1-ROW(D40))),\"\")","v":""},"",40,{"$f":"IFERROR(INDEX($B$2:$B$151,LARGE(($D$2:$D$151=3)*(ROW($D$2:$D$151)-1),COUNTIF($D$2:$D$151,3)+1-ROW(D40))),\"\")","v":""},"",40,{"$f":"IFERROR(INDEX($B$2:$B$151,LARGE(($D$2:$D$151=4)*(ROW($D$2:$D$151)-1),COUNTIF($D$2:$D$151,4)+1-ROW(D40))),\"\")","v":""},"",40,{"$f":"IFERROR(INDEX($B$2:$B$151,LARGE(($D$2:$D$151=5)*(ROW($D$2:$D$151)-1),COUNTIF($D$2:$D$151,5)+1-ROW(D40))),\"\")","v":""},"",null,40,0,0,"-"]
[41,0,0,"-",null,41,{"$f":"IFERROR(INDEX($B$2:$B$151,LARGE(($D$2:$D$151=1)*(ROW($D$2:$D$151)-1),COUNTIF($D$2:$D$151,1)+1-ROW(D41))),\"\")","v":""},"",41,{"$f":"IFERROR(INDEX($B$2:$B$151,LARGE(($D$2:$D$151=2)*(ROW($D$2:$D$151)-1),COUNTIF($D$2:$D$151,2)+1-ROW(D41))),\"\")","v":""},"",41,{"$f":"IFERROR(INDEX($B$2:$B$151,LARGE(($D$2:$D$151=3)*(ROW($D$2:$D$151)-1),COUNTIF($D$2:$D$151,3)+1-ROW(D41))),\"\")","v":""},"",41,{"$f":"IFERROR(INDEX($B$2:$B$151,LARGE(($D$2:$D$151=4)*(ROW($D$2:$D$151)-1),COUNTIF($D$2:$D$151,4)+1-ROW(D41))),\"\")","v":""},"",41,{"$f":"IFERROR(INDEX($B$2:$B$151,LARGE(($D$2:$D$151=5)*(ROW($D$2:$D$151)-1),COUNTIF($D$2:$D$151,5)+1-ROW(D41))),\"\")","v":""},"",null,41,0,0,"-"]
[42,0,0,"-",null,42,{"$f":"IFERROR(INDEX($B$2:$B$151,LARGE(($D$2:$D$151=1)*(ROW($D$2:$D$151)-1),COUNTIF($D$2:$D$151,1)+1-ROW(D42))),\"\")","v":""},"",42,{"$f":"IFERROR(INDEX($B$2:$B$151,LARGE(($D$2:$D$151=2)*(ROW($D$2:$D$151)-1),COUNTIF($D$2:$D$151,2)+1-ROW(D42))),\"\")","v":""},"",42,{"$f":"IFERROR(INDEX($B$2:$B$151,LARGE(($D$2:$D$151=3)*(ROW($D$2:$D$151)-1),COUNTIF($D$2:$D$151,3)+1-ROW(D42))),\"\")","v":""},"",42,{"$f":"IFERROR(INDEX($B$2:$B$151,LARGE(($D$2:$D$151=4)*(ROW($D$2:$D$151)-1),COUNTIF($D$2:$D$151,4)+1-ROW(D42))),\"\")","v":""},"",42,{"$f":"IFERROR(INDEX($B$2:$B$151,LARGE(($D$2:$D$151=5)*(ROW($D$2:$D$151)-1),COUNTIF($D$2:$D$151,5)+1-ROW(D42))),\"\")","v":""},"",null,42,0,0,"-"]
[43,0,0,"-",null,43,{"$f":"IFERROR(INDEX($B$2:$B$151,LARGE(($D$2:$D$151=1)*(ROW($D$2:$D$151)-1),COUNTIF($D$2:$D$151,1)+1-ROW(D43))),\"\")","v":""},"",43,{"$f":"IFERROR(INDEX($B$2:$B$151,LARGE(($D$2:$D$151=2)*(ROW($D$2:$D$151)-1),COUNTIF($D$2:$D$151,2)+1-ROW(D43))),\"\")","v":""},"",43,{"$f":"IFERROR(INDEX($B$2:$B$151,LARGE(($D$2:$D$151=3)*(ROW($D$2:$D$151)-1),COUNTIF($D$2:$D$151,3)+1-ROW(D43))),\"\")","v":""},"",43,{"$f":"IFERROR(INDEX($B$2:$B$151,LARGE(($D$2:$D$151=4)*(ROW($D$2:$D$151)-1),COUNTIF($D$2:$D$151,4)+1-ROW(D43))),\"\")","v":""},"",43,{"$f":"IFERROR(INDEX($B$2:$B$151,LARGE(($D$2:$D$151=5)*(ROW($D$2:$D$151)-1),COUNTIF($D$2:$D$151,5)+1-ROW(D43))),\"\")","v":""},"",null,43,0,0,"-"]
[44,0,0,"-",null,44,{"$f":"IFERROR(INDEX($B$2:$B$151,LARGE(($D$2:$D$151=1)*(ROW($D$2:$D$151)-1),COUNTIF($D$2:$D$151,1)+1-ROW(D44))),\"\")","v":""},"",44,{"$f":"IFERROR(INDEX($B$2:$B$151,LARGE(($D$2:$D$151=2)*(ROW($D$2:$D$151)-1),COUNTIF($D$2:$D$151,2)+1-ROW(D44))),\"\")","v":""},"",44,{"$f":"IFERROR(INDEX($B$2:$B$151,LARGE(($D$2:$D$151=3)*(ROW($D$2:$D$151)-1),COUNTIF($D$2:$D$151,3)+1-ROW(D44))),\"\")","v":""},"",44,{"$f":"IFERROR(INDEX($B$2:$B$151,LARGE(($D$2:$D$151=4)*(ROW($D$2:$D$151)-1),COUNTIF($D$2:$D$151,4)+1-ROW(D44))),\"\")","v":""},"",44,{"$f":"IFERROR(INDEX($B$2:$B$151,LARGE(($D$2:$D$151=5)*(ROW($D$2:$D$151)-1),COUNTIF($D$2:$D$151,5)+1-ROW(D44))),\"\")","v":""},"",null,44,0,0,"-"]
[45,0,0,"-",null,45,{"$f":"IFERROR(INDEX($B$2:$B$151,LARGE(($D$2:$D$151=1)*(ROW($D$2:$D$151)-1),COUNTIF($D$2:$D$151,1)+1-ROW(D45))),\"\")","v":""},"",45,{"$f":"IFERROR(INDEX($B$2:$B$151,LARGE(($D$2:$D$151=2)*(ROW($D$2:$D$151)-1),COUNTIF($D$2:$D$151,2)+1-ROW(D45))),\"\")","v":""},"",45,{"$f":"IFERROR(INDEX($B$2:$B$151,LARGE(($D$2:$D$151=3)*(ROW($D$2:$D$151)-1),COUNTIF($D$2:$D$151,3)+1-ROW(D45))),\"\")","v":""},"",45,{"$f":"IFERROR(INDEX($B$2:$B$151,LARGE(($D$2:$D$151=4)*(ROW($D$2:$D$151)-1),COUNTIF($D$2:$D$151,4)+1-ROW(D45))),\"\")","v":""},"",45,{"$f":"IFERROR(INDEX($B$2:$B$151,LARGE(($D$2:$D$151=5)*(ROW($D$2:$D$151)-1),COUNTIF($D$2:$D$151,5)+1-ROW(D45))),\"\")","v":""},"",null,45,0,0,"-"]
[46,0,0,"-",null,46,{"$f":"IFERROR(INDEX($B$2:$B$151,LARGE(($D$2:$D$151=1)*(ROW($D$2:$D$151)-1),COUNTIF($D$2:$D$151,1)+1-ROW(D46))),\"\")","v":""},"",46,{"$f":"IFERROR(INDEX($B$2:$B$151,LARGE(($D$2:$D$151=2)*(ROW($D$2:$D$151)-1),COUNTIF($D$2:$D$151,2)+1-ROW(D46))),\"\")","v":""},"",46,{"$f":"IFERROR(INDEX($B$2:$B$151,LARGE(($D$2:$D$151=3)*(ROW($D$2:$D$151)-1),COUNTIF($D$2:$D$151,3)+1-ROW(D46))),\"\")","v":""},"",46,{"$f":"IFERROR(INDEX($B$2:$B$151,LARGE(($D$2:$D$151=4)*(ROW($D$2:$D$151)-1),COUNTIF($D$2:$D$151,4)+1-ROW(D46))),\"\")","v":""},"",46,{"$f":"IFERROR(INDEX($B$2:$B$151,LARGE(($D$2:$D$151=5)*(ROW($D$2:$D$151)-1),COUNTIF($D$2:$D$151,5)+1-ROW(D46))),\"\")","v":""},"",null,46,0,0,"-"]
[47,0,0,"-",null,47,{"$f":"IFERROR(INDEX($B$2:$B$151,LARGE(($D$2:$D$151=1)*(ROW($D$2:$D$151)-1),COUNTIF($D$2:$D$151,1)+1-ROW(D47))),\"\")","v":""},"",47,{"$f":"IFERROR(INDEX($B$2:$B$151,LARGE(($D$2:$D$151=2)*(ROW($D$2:$D$151)-1),COUNTIF($D$2:$D$151,2)+1-ROW(D47))),\"\")","v":""},"",47,{"$f":"IFERROR(INDEX($B$2:$B$151,LARGE(($D$2:$D$151=3)*(ROW($D$2:$D$151)-1),COUNTIF($D$2:$D$151,3)+1-ROW(D47))),\"\")","v":""},"",47,{"$f":"IFERROR(INDEX($B$2:$B$151,LARGE(($D$2:$D$151=4)*(ROW($D$2:$D$151)-1),COUNTIF($D$2:$D$151,4)+1-ROW(D47))),\"\")","v":""},"",47,{"$f":"IFERROR(INDEX($B$2:$B$151,LARGE(($D$2:$D$151=5)*(ROW($D$2:$D$151)-1),COUNTIF($D$2:$D$151,5)+1-ROW(D47))),\"\")","v":""},"",null,47,0,0,"-"]
[48,0,0,"-",null,48,{"$f":"IFERROR(INDEX($B$2:$B$151,LARGE(($D$2:$D$151=1)*(ROW($D$2:$D$151)-1),COUNTIF($D$2:$D$151,1)+1-ROW(D48))),\"\")","v":""},"",48,{"$f":"IFERROR(INDEX($B$2:$B$151,LARGE(($D$2:$D$151=2)*(ROW($D$2:$D$151)-1),COUNTIF($D$2:$D$151,2)+1-ROW(D48))),\"\")","v":""},"",48,{"$f":"IFERROR(INDEX($B$2:$B$151,LARGE(($D$2:$D$151=3)*(ROW($D$2:$D$151)-1),COUNTIF($D$2:$D$151,3)+1-ROW(D48))),\"\")","v":""},"",48,{"$f":"IFERROR(INDEX($B$2:$B$151,LARGE(($D$2:$D$151=4)*(ROW($D$2:$D$151)-1),COUNTIF($D$2:$D$151,4)+1-ROW(D48))),\"\")","v":""},"",48,{"$f":"IFERROR(INDEX($B$2:$B$151,LARGE(($D$2:$D$151=5)*(ROW($D$2:$D$151)-1),COUNTIF($D$2:$D$151,5)+1-ROW(D48))),\"\")","v":""},"",null,48,0,0,"-"]
[49,0,0,"-",null,49,{"$f":"IFERROR(INDEX($B$2:$B$151,LARGE(($D$2:$D$151=1)*(ROW($D$2:$D$151)-1),COUNTIF($D$2:$D$151,1)+1-ROW(D49))),\"\")","v":""},"",49,{"$f":"IFERROR(INDEX($B$2:$B$151,LARGE(($D$2:$D$151=2)*(ROW($D$2:$D$151)-1),COUNTIF($D$2:$D$151,2)+1-ROW(D49))),\"\")","v":""},"",49,{"$f":"IFERROR(INDEX($B$2:$B$151,LARGE(($D$2:$D$151=3)*(ROW($D$2:$D$151)-1),COUNTIF($D$2:$D$151,3)+1-ROW(D49))),\"\")","v":""},"",49,{"$f":"IFERROR(INDEX($B$2:$B$151,LARGE(($D$2:$D$151=4)*(ROW($D$2:$D$151)-1),COUNTIF($D$2:$D$151,4)+1-ROW(D49))),\"\")","v":""},"",49,{"$f":"IFERROR(INDEX($B$2:$B$151,LARGE(($D$2:$D$151=5)*(ROW($D$2:$D$151)-1),COUNTIF($D$2:$D$151,5)+1-ROW(D49))),\"\")","v":""},"",null,49,0,0,"-"]
[50,0,0,"-",null,50,{"$f":"IFERROR(INDEX($B$2:$B$151,LARGE(($D$2:$D$151=1)*(ROW($D$2:$D$151)-1),COUNTIF($D$2:$D$151,1)+1-ROW(D50))),\"\")","v":""},"",50,{"$f":"IFERROR(INDEX($B$2:$B$151,LARGE(($D$2:$D$151=2)*(ROW($D$2:$D$151)-1),COUNTIF($D$2:$D$151,2)+1-ROW(D50))),\"\")","v":""},"",50,{"$f":"IFERROR(INDEX($B$2:$B$151,LARGE(($D$2:$D$151=3)*(ROW($D$2:$D$151)-1),COUNTIF($D$2:$D$151,3)+1-ROW(D50))),\"\")","v":""},"",50,{"$f":"IFERROR(INDEX($B$2:$B$151,LARGE(($D$2:$D$151=4)*(ROW($D$2:$D$151)-1),COUNTIF($D$2:$D$151,4)+1-ROW(D50))),\"\")","v":""},"",50,{"$f":"IFERROR(INDEX($B$2:$B$151,LARGE(($D$2:$D$151=5)*(ROW($D$2:$D$151)-1),COUNTIF($D$2:$D$151,5)+1-ROW(D50))),\"\")","v":""},"",null,50,0,0,"-"]
[51,0,0,"-",null,51,{"$f":"IFERROR(INDEX($B$2:$B$151,LARGE(($D$2:$D$151=1)*(ROW($D$2:$D$151)-1),COUNTIF($D$2:$D$151,1)+1-ROW(D51))),\"\")","v":""},"",51,{"$f":"IFERROR(INDEX($B$2:$B$151,LARGE(($D$2:$D$151=2)*(ROW($D$2:$D$151)-1),COUNTIF($D$2:$D$151,2)+1-ROW(D51))),\"\")","v":""},"",51,{"$f":"IFERROR(INDEX($B$2:$B$151,LARGE(($D$2:$D$151=3)*(ROW($D$2:$D$151)-1),COUNTIF($D$2:$D$151,3)+1-ROW(D51))),\"\")","v":""},"",51,{"$f":"IFERROR(INDEX($B$2:$B$151,LARGE(($D$2:$D$151=4)*(ROW($D$2:$D$151)-1),COUNTIF($D$2:$D$151,4)+1-ROW(D51))),\"\")","v":""},"",51,{"$f":"IFERROR(INDEX($B$2:$B$151,LARGE(($D$2:$D$151=5)*(ROW($D$2:$D$151)-1),COUNTIF($D$2:$D$151,5)+1-ROW(D51))),\"\")","v":""},"",null,51,0,0,"-"]
[52,0,0,"-",null,52,{"$f":"IFERROR(INDEX($B$2:$B$151,LARGE(($D$2:$D$151=1)*(ROW($D$2:$D$151)-1),COUNTIF($D$2:$D$151,1)+1-ROW(D52))),\"\")","v":""},"",52,{"$f":"IFERROR(INDEX($B$2:$B$151,LARGE(($D$2:$D$151=2)*(ROW($D$2:$D$151)-1),COUNTIF($D$2:$D$151,2)+1-ROW(D52))),\"\")","v":""},"",52,{"$f":"IFERROR(INDEX($B$2:$B$151,LARGE(($D$2:$D$151=3)*(ROW($D$2:$D$151)-1),COUNTIF($D$2:$D$151,3)+1-ROW(D52))),\"\")","v":""},"",52,{"$f":"IFERROR(INDEX($B$2:$B$151,LARGE(($D$2:$D$151=4)*(ROW($D$2:$D$151)-1),COUNTIF($D$2:$D$151,4)+1-ROW(D52))),\"\")","v":""},"",52,{"$f":"IFERROR(INDEX($B$2:$B$151,LARGE(($D$2:$D$151=5)*(ROW($D$2:$D$151)-1),COUNTIF($D$2:$D$151,5)+1-ROW(D52))),\"\")","v":""},"",null,52,0,0,"-"]
[53,0,0,"-",null,53,{"$f":"IFERROR(INDEX($B$2:$B$151,LARGE(($D$2:$D$151=1)*(ROW($D$2:$D$151)-1),COUNTIF($D$2:$D$151,1)+1-ROW(D53))),\"\")","v":""},"",53,{"$f":"IFERROR(INDEX($B$2:$B$151,LARGE(($D$2:$D$151=2)*(ROW($D$2:$D$151)-1),COUNTIF($D$2:$D$151,2)+1-ROW(D53))),\"\")","v":""},"",53,{"$f":"IFERROR(INDEX($B$2:$B$151,LARGE(($D$2:$D$151=3)*(ROW($D$2:$D$151)-1),COUNTIF($D$2:$D$151,3)+1-ROW(D53))),\"\")","v":""},"",53,{"$f":"IFERROR(INDEX($B$2:$B$151,LARGE(($D$2:$D$151=4)*(ROW($D$2:$D$151)-1),COUNTIF($D$2:$D$151,4)+1-ROW(D53))),\"\")","v":""},"",53,{"$f":"IFERROR(INDEX($B$2:$B$151,LARGE(($D$2:$D$151=5)*(ROW($D$2:$D$151)-1),COUNTIF($D$2:$D$151,5)+1-ROW(D53))),\"\")","v":""},"",null,53,0,0,"-"]
[54,0,0,"-",null,54,{"$f":"IFERROR(INDEX($B$2:$B$151,LARGE(($D$2:$D$151=1)*(ROW($D$2:$D$151)-1),COUNTIF($D$2:$D$151,1)+1-ROW(D54))),\"\")","v":""},"",54,{"$f":"IFERROR(INDEX($B$2:$B$151,LARGE(($D$2:$D$151=2)*(ROW($D$2:$D$151)-1),COUNTIF($D$2:$D$151,2)+1-ROW(D54))),\"\")","v":""},"",54,{"$f":"IFERROR(INDEX($B$2:$B$151,LARGE(($D$2:$D$151=3)*(ROW($D$2:$D$151)-1),COUNTIF($D$2:$D$151,3)+1-ROW(D54))),\"\")","v":""},"",54,{"$f":"IFERROR(INDEX($B$2:$B$151,LARGE(($D$2:$D$151=4)*(ROW($D$2:$D$151)-1),COUNTIF($D$2:$D$151,4)+1-ROW(D54))),\"\")","v":""},"",54,{"$f":"IFERROR(INDEX($B$2:$B$151,LARGE(($D$2:$D$151=5)*(ROW($D$2:$D$151)-1),COUNTIF($D$2:$D$151,5)+1-ROW(D54))),\"\")","v":""},"",null,54,0,0,"-"]
[55,0,0,"-",null,55,{"$f":"IFERROR(INDEX($B$2:$B$151,LARGE(($D$2:$D$151=1)*(ROW($D$2:$D$151)-1),COUNTIF($D$2:$D$151,1)+1-ROW(D55))),\"\")","v":""},"",55,{"$f":"IFERROR(INDEX($B$2:$B$151,LARGE(($D$2:$D$151=2)*(ROW($D$2:$D$151)-1),COUNTIF($D$2:$D$151,2)+1-ROW(D55))),\"\")","v":""},"",55,{"$f":"IFERROR(INDEX($B$2:$B$151,LARGE(($D$2:$D$151=3)*(ROW($D$2:$D$151)-1),COUNTIF($D$2:$D$151,3)+1-ROW(D55))),\"\")","v":""},"",55,{"$f":"IFERROR(INDEX($B$2:$B$151,LARGE(($D$2:$D$151=4)*(ROW($D$2:$D$151)-1),COUNTIF($D$2:$D$151,4)+1-ROW(D55))),\"\")","v":""},"",55,{"$f":"IFERROR(INDEX($B$2:$B$151,LARGE(($D$2:$D$151=5)*(ROW($D$2:$D$151)-1),COUNTIF($D$2:$D$151,5)+1-ROW(D55))),\"\")","v":""},"",null,55,0,0,"-"]
[56,0,0,"-",null,56,{"$f":"IFERROR(INDEX($B$2:$B$151,LARGE(($D$2:$D$151=1)*(ROW($D$2:$D$151)-1),COUNTIF($D$2:$D$151,1)+1-ROW(D56))),\"\")","v":""},"",56,{"$f":"IFERROR(INDEX($B$2:$B$151,LARGE(($D$2:$D$151=2)*(ROW($D$2:$D$151)-1),COUNTIF($D$2:$D$151,2)+1-ROW(D56))),\"\")","v":""},"",56,{"$f":"IFERROR(INDEX($B$2:$B$151,LARGE(($D$2:$D$151=3)*(ROW($D$2:$D$151)-1),COUNTIF($D$2:$D$151,3)+1-ROW(D56))),\"\")","v":""},"",56,{"$f":"IFERROR(INDEX($B$2:$B$151,LARGE(($D$2:$D$151=4)*(ROW($D$2:$D$151)-1),COUNTIF($D$2:$D$151,4)+1-ROW(D56))),\"\")","v":""},"",56,{"$f":"IFERROR(INDEX($B$2:$B$151,LARGE(($D$2:$D$151=5)*(ROW($D$2:$D$151)-1),COUNTIF($D$2:$D$151,5)+1-ROW(D56))),\"\")","v":""},"",null,56,0,0,"-"]
[57,0,0,"-",null,57,{"$f":"IFERROR(INDEX($B$2:$B$151,LARGE(($D$2:$D$151=1)*(ROW($D$2:$D$151)-1),COUNTIF($D$2:$D$151,1)+1-ROW(D57))),\"\")","v":""},"",57,{"$f":"IFERROR(INDEX($B$2:$B$151,LARGE(($D$2:$D$151=2)*(ROW($D$2:$D$151)-1),COUNTIF($D$2:$D$151,2)+1-ROW(D57))),\"\")","v":""},"",57,{"$f":"IFERROR(INDEX($B$2:$B$151,LARGE(($D$2:$D$151=3)*(ROW($D$2:$D$151)-1),COUNTIF($D$2:$D$151,3)+1-ROW(D57))),\"\")","v":""},"",57,{"$f":"IFERROR(INDEX($B$2:$B$151,LARGE(($D$2:$D$151=4)*(ROW($D$2:$D$151)-1),COUNTIF($D$2:$D$151,4)+1-ROW(D57))),\"\")","v":""},"",57,{"$f":"IFERROR(INDEX($B$2:$B$151,LARGE(($D$2:$D$151=5)*(ROW($D$2:$D$151)-1),COUNTIF($D$2:$D$151,5)+1-ROW(D57))),\"\")","v":""},"",null,57,0,0,"-"]
[58,0,0,"-",null,58,{"$f":"IFERROR(INDEX($B$2:$B$151,LARGE(($D$2:$D$151=1)*(ROW($D$2:$D$151)-1),COUNTIF($D$2:$D$151,1)+1-ROW(D58))),\"\")","v":""},"",58,{"$f":"IFERROR(INDEX($B$2:$B$151,LARGE(($D$2:$D$151=2)*(ROW($D$2:$D$151)-1),COUNTIF($D$2:$D$151,2)+1-ROW(D58))),\"\")","v":""},"",58,{"$f":"IFERROR(INDEX($B$2:$B$151,LARGE(($D$2:$D$151=3)*(ROW($D$2:$D$151)-1),COUNTIF($D$2:$D$151,3)+1-ROW(D58))),\"\")","v":""},"",58,{"$f":"IFERROR(INDEX($B$2:$B$151,LARGE(($D$2:$D$151=4)*(ROW($D$2:$D$151)-1),COUNTIF($D$2:$D$151,4)+1-ROW(D58))),\"\")","v":""},"",58,{"$f":"IFERROR(INDEX($B$2:$B$151,LARGE(($D$2:$D$151=5)*(ROW($D$2:$D$151)-1),COUNTIF($D$2:$D$151,5)+1-ROW(D58))),\"\")","v":""},"",null,58,0,0,"-"]
[59,0,0,"-",null,59,{"$f":"IFERROR(INDEX($B$2:$B$151,LARGE(($D$2:$D$151=1)*(ROW($D$2:$D$151)-1),COUNTIF($D$2:$D$151,1)+1-ROW(D59))),\"\")","v":""},"",59,{"$f":"IFERROR(INDEX($B$2:$B$151,LARGE(($D$2:$D$151=2)*(ROW($D$2:$D$151)-1),COUNTIF($D$2:$D$151,2)+1-ROW(D59))),\"\")","v":""},"",59,{"$f":"IFERROR(INDEX($B$2:$B$151,LARGE(($D$2:$D$151=3)*(ROW($D$2:$D$151)-1),COUNTIF($D$2:$D$151,3)+1-ROW(D59))),\"\")","v":""},"",59,{"$f":"IFERROR(INDEX($B$2:$B$151,LARGE(($D$2:$D$151=4)*(ROW($D$2:$D$151)-1),COUNTIF($D$2:$D$151,4)+1-ROW(D59))),\"\")","v":""},"",59,{"$f":"IFERROR(INDEX($B$2:$B$151,LARGE(($D$2:$D$151=5)*(ROW($D$2:$D$151)-1),COUNTIF($D$2:$D$151,5)+1-ROW(D59))),\"\")","v":""},"",null,59,0,0,"-"]
[60,0,0,"-",null,60,{"$f":"IFERROR(INDEX($B$2:$B$151,LARGE(($D$2:$D$151=1)*(ROW($D$2:$D$151)-1),COUNTIF($D$2:$D$151,1)+1-ROW(D60))),\"\")","v":""},"",60,{"$f":"IFERROR(INDEX($B$2:$B$151,LARGE(($D$2:$D$151=2)*(ROW($D$2:$D$151)-1),COUNTIF($D$2:$D$151,2)+1-ROW(D60))),\"\")","v":""},"",60,{"$f":"IFERROR(INDEX($B$2:$B$151,LARGE(($D$2:$D$151=3)*(ROW($D$2:$D$151)-1),COUNTIF($D$2:$D$151,3)+1-ROW(D60))),\"\")","v":""},"",60,{"$f":"IFERROR(INDEX($B$2:$B$151,LARGE(($D$2:$D$151=4)*(ROW($D$2:$D$151)-1),COUNTIF($D$2:$D$151,4)+1-ROW(D60))),\"\")","v":""},"",60,{"$f":"IFERROR(INDEX($B$2:$B$151,LARGE(($D$2:$D$151=5)*(ROW($D$2:$D$151)-1),COUNTIF($D$2:$D$151,5)+1-ROW(D60))),\"\")","v":""},"",null,60,0,0,"-"]
[61,0,0,"-",null,61,{"$f":"IFERROR(INDEX($B$2:$B$151,LARGE(($D$2:$D$151=1)*(ROW($D$2:$D$151)-1),COUNTIF($D$2:$D$151,1)+1-ROW(D61))),\"\")","v":""},"",61,{"$f":"IFERROR(INDEX($B$2:$B$151,LARGE(($D$2:$D$151=2)*(ROW($D$2:$D$151)-1),COUNTIF($D$2:$D$151,2)+1-ROW(D61))),\"\")","v":""},"",61,{"$f":"IFERROR(INDEX($B$2:$B$151,LARGE(($D$2:$D$151=3)*(ROW($D$2:$D$151)-1),COUNTIF($D$2:$D$151,3)+1-ROW(D61))),\"\")","v":""},"",61,{"$f":"IFERROR(INDEX($B$2:$B$151,LARGE(($D$2:$D$151=4)*(ROW($D$2:$D$151)-1),COUNTIF($D$2:$D$151,4)+1-ROW(D61))),\"\")","v":""},"",61,{"$f":"IFERROR(INDEX($B$2:$B$151,LARGE(($D$2:$D$151=5)*(ROW($D$2:$D$151)-1),COUNTIF($D$2:$D$151,5)+1-ROW(D61))),\"\")","v":""},"",null,61,0,0,"-"]
[62,0,0,"-",null,62,{"$f":"IFERROR(INDEX($B$2:$B$151,LARGE(($D$2:$D$151=1)*(ROW($D$2:$D$151)-1),COUNTIF($D$2:$D$151,1)+1-ROW(D62))),\"\")","v":""},"",62,{"$f":"IFERROR(INDEX($B$2:$B$151,LARGE(($D$2:$D$151=2)*(ROW($D$2:$D$151)-1),COUNTIF($D$2:$D$151,2)+1-ROW(D62))),\"\")","v":""},"",62,{"$f":"IFERROR(INDEX($B$2:$B$151,LARGE(($D$2:$D$151=3)*(ROW($D$2:$D$151)-1),COUNTIF($D$2:$D$151,3)+1-ROW(D62))),\"\")","v":""},"",62,{"$f":"IFERROR(INDEX($B$2:$B$151,LARGE(($D$2:$D$151=4)*(ROW($D$2:$D$151)-1),COUNTIF($D$2:$D$151,4)+1-ROW(D62))),\"\")","v":""},"",62,{"$f":"IFERROR(INDEX($B$2:$B$151,LARGE(($D$2:$D$151=5)*(ROW($D$2:$D$151)-1),COUNTIF($D$2:$D$151,5)+1-ROW(D62))),\"\")","v":""},"",null,62,0,0,"-"]
[63,0,0,"-",null,63,{"$f":"IFERROR(INDEX($B$2:$B$151,LARGE(($D$2:$D$151=1)*(ROW($D$2:$D$151)-1),COUNTIF($D$2:$D$151,1)+1-ROW(D63))),\"\")","v":""},"",63,{"$f":"IFERROR(INDEX($B$2:$B$151,LARGE(($D$2:$D$151=2)*(ROW($D$2:$D$151)-1),COUNTIF($D$2:$D$151,2)+1-ROW(D63))),\"\")","v":""},"",63,{"$f":"IFERROR(INDEX($B$2:$B$151,LARGE(($D$2:$D$151=3)*(ROW($D$2:$D$151)-1),COUNTIF($D$2:$D$151,3)+1-ROW(D63))),\"\")","v":""},"",63,{"$f":"IFERROR(INDEX($B$2:$B$151,LARGE(($D$2:$D$151=4)*(ROW($D$2:$D$151)-1),COUNTIF($D$2:$D$151,4)+1-ROW(D63))),\"\")","v":""},"",63,{"$f":"IFERROR(INDEX($B$2:$B$151,LARGE(($D$2:$D$151=5)*(ROW($D$2:$D$151)-1),COUNTIF($D$2:$D$151,5)+1-ROW(D63))),\"\")","v":""},"",null,63,0,0,"-"]
[64,0,0,"-",null,64,{"$f":"IFERROR(INDEX($B$2:$B$151,LARGE(($D$2:$D$151=1)*(ROW($D$2:$D$151)-1),COUNTIF($D$2:$D$151,1)+1-ROW(D64))),\"\")","v":""},"",64,{"$f":"IFERROR(INDEX($B$2:$B$151,LARGE(($D$2:$D$151=2)*(ROW($D$2:$D$151)-1),COUNTIF($D$2:$D$151,2)+1-ROW(D64))),\"\")","v":""},"",64,{"$f":"IFERROR(INDEX($B$2:$B$151,LARGE(($D$2:$D$151=3)*(ROW($D$2:$D$151)-1),COUNTIF($D$2:$D$151,3)+1-ROW(D64))),\"\")","v":""},"",64,{"$f":"IFERROR(INDEX($B$2:$B$151,LARGE(($D$2:$D$151=4)*(ROW($D$2:$D$151)-1),COUNTIF($D$2:$D$151,4)+1-ROW(D64))),\"\")","v":""},"",64,{"$f":"IFERROR(INDEX($B$2:$B$151,LARGE(($D$2:$D$151=5)*(ROW($D$2:$D$151)-1),COUNTIF($D$2:$D$151,5)+1-ROW(D64))),\"\")","v":""},"",null,64,0,0,"-"]
[65,0,0,"-",null,65,{"$f":"IFERROR(INDEX($B$2:$B$151,LARGE(($D$2:$D$151=1)*(ROW($D$2:$D$151)-1),COUNTIF($D$2:$D$151,1)+1-ROW(D65))),\"\")","v":""},"",65,{"$f":"IFERROR(INDEX($B$2:$B$151,LARGE(($D$2:$D$151=2)*(ROW($D$2:$D$151)-1),COUNTIF($D$2:$D$151,2)+1-ROW(D65))),\"\")","v":""},"",65,{"$f":"IFERROR(INDEX($B$2:$B$151,LARGE(($D$2:$D$151=3)*(ROW($D$2:$D$151)-1),COUNTIF($D$2:$D$151,3)+1-ROW(D65))),\"\")","v":""},"",65,{"$f":"IFERROR(INDEX($B$2:$B$151,LARGE(($D$2:$D$151=4)*(ROW($D$2:$D$151)-1),COUNTIF($D$2:$D$151,4)+1-ROW(D65))),\"\")","v":""},"",65,{"$f":"IFERROR(INDEX($B$2:$B$151,LARGE(($D$2:$D$151=5)*(ROW($D$2:$D$151)-1),COUNTIF($D$2:$D$151,5)+1-ROW(D65))),\"\")","v":""},"",null,65,0,0,"-"]
[66,0,0,"-",null,66,{"$f":"IFERROR(INDEX($B$2:$B$151,LARGE(($D$2:$D$151=1)*(ROW($D$2:$D$151)-1),COUNTIF($D$2:$D$151,1)+1-ROW(D66))),\"\")","v":""},{"$f":"IF(G67=\"\",\"\",VLOOKUP(G67,$B$2:$C$151,2,0))","v":""},66,{"$f":"IFERROR(INDEX($B$2:$B$151,LARGE(($D$2:$D$151=2)*(ROW($D$2:$D$151)-1),COUNTIF($D$2:$D$151,2)+1-ROW(D66))),\"\")","v":""},{"$f":"IF(J67=\"\",\"\",VLOOKUP(J67,$B$2:$C$151,2,0))","v":""},66,{"$f":"IFERROR(INDEX($B$2:$B$151,LARGE(($D$2:$D$151=3)*(ROW($D$2:$D$151)-1),COUNTIF($D$2:$D$151,3)+1-ROW(D66))),\"\")","v":""},{"$f":"IF(M67=\"\",\"\",VLOOKUP(M67,$B$2:$C$151,2,0))","v":""},66,{"$f":"IFERROR(INDEX($B$2:$B$151,LARGE(($D$2:$D$151=4)*(ROW($D$2:$D$151)-1),COUNTIF($D$2:$D$151,4)+1-ROW(D66))),\"\")","v":""},{"$f":"IF(P67=\"\",\"\",VLOOKUP(P67,$B$2:$C$151,2,0))","v":""},66,{"$f":"IFERROR(INDEX($B$2:$B$151,LARGE(($D$2:$D$151=5)*(ROW($D$2:$D$151)-1),COUNTIF($D$2:$D$151,5)+1-ROW(D66))),\"\")","v":""},{"$f":"IF(S67=\"\",\"\",VLOOKUP(S67,$B$2:$C$151,2,0))","v":""},null,66,0,0,"-"]
[67,0,0,"-",null,67,{"$f":"IFERROR(INDEX($B$2:$B$151,LARGE(($D$2:$D$151=1)*(ROW($D$2:$D$151)-1),COUNTIF($D$2:$D$151,1)+1-ROW(D67))),\"\")","v":""},"",67,{"$f":"IFERROR(INDEX($B$2:$B$151,LARGE(($D$2:$D$151=2)*(ROW($D$2:$D$151)-1),COUNTIF($D$2:$D$151,2)+1-ROW(D67))),\"\")","v":""},"",67,{"$f":"IFERROR(INDEX($B$2:$B$151,LARGE(($D$2:$D$151=3)*(ROW($D$2:$D$151)-1),COUNTIF($D$2:$D$151,3)+1-ROW(D67))),\"\")","v":""},"",67,{"$f":"IFERROR(INDEX($B$2:$B$151,LARGE(($D$2:$D$151=4)*(ROW($D$2:$D$151)-1),COUNTIF($D$2:$D$151,4)+1-ROW(D67))),\"\")","v":""},"",67,{"$f":"IFERROR(INDEX($B$2:$B$151,LARGE(($D$2:$D$151=5)*(ROW($D$2:$D$151)-1),COUNTIF($D$2:$D$151,5)+1-ROW(D67))),\"\")","v":""},"",null,67,0,0,"-"]
[68,0,0,"-",null,68,{"$f":"IFERROR(INDEX($B$2:$B$151,LARGE(($D$2:$D$151=1)*(ROW($D$2:$D$151)-1),COUNTIF($D$2:$D$151,1)+1-ROW(D68))),\"\")","v":""},"",68,{"$f":"IFERROR(INDEX($B$2:$B$151,LARGE(($D$2:$D$151=2)*(ROW($D$2:$D$151)-1),COUNTIF($D$2:$D$151,2)+1-ROW(D68))),\"\")","v":""},"",68,{"$f":"IFERROR(INDEX($B$2:$B$151,LARGE(($D$2:$D$151=3)*(ROW($D$2:$D$151)-1),COUNTIF($D$2:$D$151,3)+1-ROW(D68))),\"\")","v":""},"",68,{"$f":"IFERROR(INDEX($B$2:$B$151,LARGE(($D$2:$D$151=4)*(ROW($D$2:$D$151)-1),COUNTIF($D$2:$D$151,4)+1-ROW(D68))),\"\")","v":""},"",68,{"$f":"IFERROR(INDEX($B$2:$B$151,LARGE(($D$2:$D$151=5)*(ROW($D$2:$D$151)-1),COUNTIF($D$2:$D$151,5)+1-ROW(D68))),\"\")","v":""},"",null,68,0,0,"-"]
[69,0,0,"-",null,69,{"$f":"IFERROR(INDEX($B$2:$B$151,LARGE(($D$2:$D$151=1)*(ROW($D$2:$D$151)-1),COUNTIF($D$2:$D$151,1)+1-ROW(D69))),\"\")","v":""},"",69,{"$f":"IFERROR(INDEX($B$2:$B$151,LARGE(($D$2:$D$151=2)*(ROW($D$2:$D$151)-1),COUNTIF($D$2:$D$151,2)+1-ROW(D69))),\"\")","v":""},"",69,{"$f":"IFERROR(INDEX($B$2:$B$151,LARGE(($D$2:$D$151=3)*(ROW($D$2:$D$151)-1),COUNTIF($D$2:$D$151,3)+1-ROW(D69))),\"\")","v":""},"",69,{"$f":"IFERROR(INDEX($B$2:$B$151,LARGE(($D$2:$D$151=4)*(ROW($D$2:$D$151)-1),COUNTIF($D$2:$D$151,4)+1-ROW(D69))),\"\")","v":""},"",69,{"$f":"IFERROR(INDEX($B$2:$B$151,LARGE(($D$2:$D$151=5)*(ROW($D$2:$D$151)-1),COUNTIF($D$2:$D$151,5)+1-ROW(D69))),\"\")","v":""},"",null,69,0,0,"-"]
[70,0,0,"-",null,70,{"$f":"IFERROR(INDEX($B$2:$B$151,LARGE(($D$2:$D$151=1)*(ROW($D$2:$D$151)-1),COUNTIF($D$2:$D$151,1)+1-ROW(D70))),\"\")","v":""},"",70,{"$f":"IFERROR(INDEX($B$2:$B$151,LARGE(($D$2:$D$151=2)*(ROW($D$2:$D$151)-1),COUNTIF($D$2:$D$151,2)+1-ROW(D70))),\"\")","v":""},"",70,{"$f":"IFERROR(INDEX($B$2:$B$151,LARGE(($D$2:$D$151=3)*(ROW($D$2:$D$151)-1),COUNTIF($D$2:$D$151,3)+1-ROW(D70))),\"\")","v":""},"",70,{"$f":"IFERROR(INDEX($B$2:$B$151,LARGE(($D$2:$D$151=4)*(ROW($D$2:$D$151)-1),COUNTIF($D$2:$D$151,4)+1-ROW(D70))),\"\")","v":""},"",70,{"$f":"IFERROR(INDEX($B$2:$B$151,LARGE(($D$2:$D$151=5)*(ROW($D$2:$D$151)-1),COUNTIF($D$2:$D$151,5)+1-ROW(D70))),\"\")","v":""},"",null,70,0,0,"-"]
[71,0,0,"-",null,71,{"$f":"IFERROR(INDEX($B$2:$B$151,LARGE(($D$2:$D$151=1)*(ROW($D$2:$D$151)-1),COUNTIF($D$2:$D$151,1)+1-ROW(D71))),\"\")","v":""},"",71,{"$f":"IFERROR(INDEX($B$2:$B$151,LARGE(($D$2:$D$151=2)*(ROW($D$2:$D$151)-1),COUNTIF($D$2:$D$151,2)+1-ROW(D71))),\"\")","v":""},"",71,{"$f":"IFERROR(INDEX($B$2:$B$151,LARGE(($D$2:$D$151=3)*(ROW($D$2:$D$151)-1),COUNTIF($D$2:$D$151,3)+1-ROW(D71))),\"\")","v":""},"",71,{"$f":"IFERROR(INDEX($B$2:$B$151,LARGE(($D$2:$D$151=4)*(ROW($D$2:$D$151)-1),COUNTIF($D$2:$D$151,4)+1-ROW(D71))),\"\")","v":""},"",71,{"$f":"IFERROR(INDEX($B$2:$B$151,LARGE(($D$2:$D$151=5)*(ROW($D$2:$D$151)-1),COUNTIF($D$2:$D$151,5)+1-ROW(D71))),\"\")","v":""},"",null,71,0,0,"-"]
[72,0,0,"-",null,72,{"$f":"IFERROR(INDEX($B$2:$B$151,LARGE(($D$2:$D$151=1)*(ROW($D$2:$D$151)-1),COUNTIF($D$2:$D$151,1)+1-ROW(D72))),\"\")","v":""},"",72,{"$f":"IFERROR(INDEX($B$2:$B$151,LARGE(($D$2:$D$151=2)*(ROW($D$2:$D$151)-1),COUNTIF($D$2:$D$151,2)+1-ROW(D72))),\"\")","v":""},"",72,{"$f":"IFERROR(INDEX($B$2:$B$151,LARGE(($D$2:$D$151=3)*(ROW($D$2:$D$151)-1),COUNTIF($D$2:$D$151,3)+1-ROW(D72))),\"\")","v":""},"",72,{"$f":"IFERROR(INDEX($B$2:$B$151,LARGE(($D$2:$D$151=4)*(ROW($D$2:$D$151)-1),COUNTIF($D$2:$D$151,4)+1-ROW(D72))),\"\")","v":""},"",72,{"$f":"IFERROR(INDEX($B$2:$B$151,LARGE(($D$2:$D$151=5)*(ROW($D$2:$D$151)-1),COUNTIF($D$2:$D$151,5)+1-ROW(D72))),\"\")","v":""},"",null,72,0,0,"-"]
[73,0,0,"-",null,73,{"$f":"IFERROR(INDEX($B$2:$B$151,LARGE(($D$2:$D$151=1)*(ROW($D$2:$D$151)-1),COUNTIF($D$2:$D$151,1)+1-ROW(D73))),\"\")","v":""},"",73,{"$f":"IFERROR(INDEX($B$2:$B$151,LARGE(($D$2:$D$151=2)*(ROW($D$2:$D$151)-1),COUNTIF($D$2:$D$151,2)+1-ROW(D73))),\"\")","v":""},"",73,{"$f":"IFERROR(INDEX($B$2:$B$151,LARGE(($D$2:$D$151=3)*(ROW($D$2:$D$151)-1),COUNTIF($D$2:$D$151,3)+1-ROW(D73))),\"\")","v":""},"",73,{"$f":"IFERROR(INDEX($B$2:$B$151,LARGE(($D$2:$D$151=4)*(ROW($D$2:$D$151)-1),COUNTIF($D$2:$D$151,4)+1-ROW(D73))),\"\")","v":""},"",73,{"$f":"IFERROR(INDEX($B$2:$B$151,LARGE(($D$2:$D$151=5)*(ROW($D$2:$D$151)-1),COUNTIF($D$2:$D$151,5)+1-ROW(D73))),\"\")","v":""},"",null,73,0,0,"-"]
[74,0,0,"-",null,74,{"$f":"IFERROR(INDEX($B$2:$B$151,LARGE(($D$2:$D$151=1)*(ROW($D$2:$D$151)-1),COUNTIF($D$2:$D$151,1)+1-ROW(D74))),\"\")","v":""},"",74,{"$f":"IFERROR(INDEX($B$2:$B$151,LARGE(($D$2:$D$151=2)*(ROW($D$2:$D$151)-1),COUNTIF($D$2:$D$151,2)+1-ROW(D74))),\"\")","v":""},"",74,{"$f":"IFERROR(INDEX($B$2:$B$151,LARGE(($D$2:$D$151=3)*(ROW($D$2:$D$151)-1),COUNTIF($D$2:$D$151,3)+1-ROW(D74))),\"\")","v":""},"",74,{"$f":"IFERROR(INDEX($B$2:$B$151,LARGE(($D$2:$D$151=4)*(ROW($D$2:$D$151)-1),COUNTIF($D$2:$D$151,4)+1-ROW(D74))),\"\")","v":""},"",74,{"$f":"IFERROR(INDEX($B$2:$B$151,LARGE(($D$2:$D$151=5)*(ROW($D$2:$D$151)-1),COUNTIF($D$2:$D$151,5)+1-ROW(D74))),\"\")","v":""},"",null,74,0,0,"-"]
[75,0,0,"-",null,75,{"$f":"IFERROR(INDEX($B$2:$B$151,LARGE(($D$2:$D$151=1)*(ROW($D$2:$D$151)-1),COUNTIF($D$2:$D$151,1)+1-ROW(D75))),\"\")","v":""},"",75,{"$f":"IFERROR(INDEX($B$2:$B$151,LARGE(($D$2:$D$151=2)*(ROW($D$2:$D$151)-1),COUNTIF($D$2:$D$151,2)+1-ROW(D75))),\"\")","v":""},"",75,{"$f":"IFERROR(INDEX($B$2:$B$151,LARGE(($D$2:$D$151=3)*(ROW($D$2:$D$151)-1),COUNTIF($D$2:$D$151,3)+1-ROW(D75))),\"\")","v":""},"",75,{"$f":"IFERROR(INDEX($B$2:$B$151,LARGE(($D$2:$D$151=4)*(ROW($D$2:$D$151)-1),COUNTIF($D$2:$D$151,4)+1-ROW(D75))),\"\")","v":""},"",75,{"$f":"IFERROR(INDEX($B$2:$B$151,LARGE(($D$2:$D$151=5)*(ROW($D$2:$D$151)-1),COUNTIF($D$2:$D$151,5)+1-ROW(D75))),\"\")","v":""},"",null,75,0,0,"-"]
[76,0,0,"-",null,76,{"$f":"IFERROR(INDEX($B$2:$B$151,LARGE(($D$2:$D$151=1)*(ROW($D$2:$D$151)-1),COUNTIF($D$2:$D$151,1)+1-ROW(D76))),\"\")","v":""},"",76,{"$f":"IFERROR(INDEX($B$2:$B$151,LARGE(($D$2:$D$151=2)*(ROW($D$2:$D$151)-1),COUNTIF($D$2:$D$151,2)+1-ROW(D76))),\"\")","v":""},"",76,{"$f":"IFERROR(INDEX($B$2:$B$151,LARGE(($D$2:$D$151=3)*(ROW($D$2:$D$151)-1),COUNTIF($D$2:$D$151,3)+1-ROW(D76))),\"\")","v":""},"",76,{"$f":"IFERROR(INDEX($B$2:$B$151,LARGE(($D$2:$D$151=4)*(ROW($D$2:$D$151)-1),COUNTIF($D$2:$D$151,4)+1-ROW(D76))),\"\")","v":""},"",76,{"$f":"IFERROR(INDEX($B$2:$B$151,LARGE(($D$2:$D$151=5)*(ROW($D$2:$D$151)-1),COUNTIF($D$2:$D$151,5)+1-ROW(D76))),\"\")","v":""},"",null,76,0,0,"-"]
[77,0,0,"-",null,77,{"$f":"IFERROR(INDEX($B$2:$B$151,LARGE(($D$2:$D$151=1)*(ROW($D$2:$D$151)-1),COUNTIF($D$2:$D$151,1)+1-ROW(D77))),\"\")","v":""},"",77,{"$f":"IFERROR(INDEX($B$2:$B$151,LARGE(($D$2:$D$151=2)*(ROW($D$2:$D$151)-1),COUNTIF($D$2:$D$151,2)+1-ROW(D77))),\"\")","v":""},"",77,{"$f":"IFERROR(INDEX($B$2:$B$151,LARGE(($D$2:$D$151=3)*(ROW($D$2:$D$151)-1),COUNTIF($D$2:$D$151,3)+1-ROW(D77))),\"\")","v":""},"",77,{"$f":"IFERROR(INDEX($B$2:$B$151,LARGE(($D$2:$D$151=4)*(ROW($D$2:$D$151)-1),COUNTIF($D$2:$D$151,4)+1-ROW(D77))),\"\")","v":""},"",77,{"$f":"IFERROR(INDEX($B$2:$B$151,LARGE(($D$2:$D$151=5)*(ROW($D$2:$D$151)-1),COUNTIF($D$2:$D$151,5)+1-ROW(D77))),\"\")","v":""},"",null,77,0,0,"-"]
[78,0,0,"-",null,78,{"$f":"IFERROR(INDEX($B$2:$B$151,LARGE(($D$2:$D$151=1)*(ROW($D$2:$D$151)-1),COUNTIF($D$2:$D$151,1)+1-ROW(D78))),\"\")","v":""},"",78,{"$f":"IFERROR(INDEX($B$2:$B$151,LARGE(($D$2:$D$151=2)*(ROW($D$2:$D$151)-1),COUNTIF($D$2:$D$151,2)+1-ROW(D78))),\"\")","v":""},"",78,{"$f":"IFERROR(INDEX($B$2:$B$151,LARGE(($D$2:$D$151=3)*(ROW($D$2:$D$151)-1),COUNTIF($D$2:$D$151,3)+1-ROW(D78))),\"\")","v":""},"",78,{"$f":"IFERROR(INDEX($B$2:$B$151,LARGE(($D$2:$D$151=4)*(ROW($D$2:$D$151)-1),COUNTIF($D$2:$D$151,4)+1-ROW(D78))),\"\")","v":""},"",78,{"$f":"IFERROR(INDEX($B$2:$B$151,LARGE(($D$2:$D$151=5)*(ROW($D$2:$D$151)-1),COUNTIF($D$2:$D$151,5)+1-ROW(D78))),\"\")","v":""},"",null,78,0,0,"-"]
[79,0,0,"-",null,79,{"$f":"IFERROR(INDEX($B$2:$B$151,LARGE(($D$2:$D$151=1)*(ROW($D$2:$D$151)-1),COUNTIF($D$2:$D$151,1)+1-ROW(D79))),\"\")","v":""},"",79,{"$f":"IFERROR(INDEX($B$2:$B$151,LARGE(($D$2:$D$151=2)*(ROW($D$2:$D$151)-1),COUNTIF($D$2:$D$151,2)+1-ROW(D79))),\"\")","v":""},"",79,{"$f":"IFERROR(INDEX($B$2:$B$151,LARGE(($D$2:$D$151=3)*(ROW($D$2:$D$151)-1),COUNTIF($D$2:$D$151,3)+1-ROW(D79))),\"\")","v":""},"",79,{"$f":"IFERROR(INDEX($B$2:$B$151,LARGE(($D$2:$D$151=4)*(ROW($D$2:$D$151)-1),COUNTIF($D$2:$D$151,4)+1-ROW(D79))),\"\")","v":""},"",79,{"$f":"IFERROR(INDEX($B$2:$B$151,LARGE(($D$2:$D$151=5)*(ROW($D$2:$D$151)-1),COUNTIF($D$2:$D$151,5)+1-ROW(D79))),\"\")","v":""},"",null,79,0,0,"-"]
[80,0,0,"-",null,80,{"$f":"IFERROR(INDEX($B$2:$B$151,LARGE(($D$2:$D$151=1)*(ROW($D$2:$D$151)-1),COUNTIF($D$2:$D$151,1)+1-ROW(D80))),\"\")","v":""},"",80,{"$f":"IFERROR(INDEX($B$2:$B$151,LARGE(($D$2:$D$151=2)*(ROW($D$2:$D$151)-1),COUNTIF($D$2:$D$151,2)+1-ROW(D80))),\"\")","v":""},"",80,{"$f":"IFERROR(INDEX($B$2:$B$151,LARGE(($D$2:$D$151=3)*(ROW($D$2:$D$151)-1),COUNTIF($D$2:$D$151,3)+1-ROW(D80))),\"\")","v":""},"",80,{"$f":"IFERROR(INDEX($B$2:$B$151,LARGE(($D$2:$D$151=4)*(ROW($D$2:$D$151)-1),COUNTIF($D$2:$D$151,4)+1-ROW(D80))),\"\")","v":""},"",80,{"$f":"IFERROR(INDEX($B$2:$B$151,LARGE(($D$2:$D$151=5)*(ROW($D$2:$D$151)-1),COUNTIF($D$2:$D$151,5)+1-ROW(D80))),\"\")","v":""},"",null,80,0,0,"-"]
[81,0,0,"-",null,81,{"$f":"IFERROR(INDEX($B$2:$B$151,LARGE(($D$2:$D$151=1)*(ROW($D$2:$D$151)-1),COUNTIF($D$2:$D$151,1)+1-ROW(D81))),\"\")","v":""},"",81,{"$f":"IFERROR(INDEX($B$2:$B$151,LARGE(($D$2:$D$151=2)*(ROW($D$2:$D$151)-1),COUNTIF($D$2:$D$151,2)+1-ROW(D81))),\"\")","v":""},"",81,{"$f":"IFERROR(INDEX($B$2:$B$151,LARGE(($D$2:$D$151=3)*(ROW($D$2:$D$151)-1),COUNTIF($D$2:$D$151,3)+1-ROW(D81))),\"\")","v":""},"",81,{"$f":"IFERROR(INDEX($B$2:$B$151,LARGE(($D$2:$D$151=4)*(ROW($D$2:$D$151)-1),COUNTIF($D$2:$D$151,4)+1-ROW(D81))),\"\")","v":""},"",81,{"$f":"IFERROR(INDEX($B$2:$B$151,LARGE(($D$2:$D$151=5)*(ROW($D$2:$D$151)-1),COUNTIF($D$2:$D$151,5)+1-ROW(D81))),\"\")","v":""},"",null,81,0,0,"-"]
[82,0,0,"-",null,82,{"$f":"IFERROR(INDEX($B$2:$B$151,LARGE(($D$2:$D$151=1)*(ROW($D$2:$D$151)-1),COUNTIF($D$2:$D$151,1)+1-ROW(D82))),\"\")","v":""},"",82,{"$f":"IFERROR(INDEX($B$2:$B$151,LARGE(($D$2:$D$151=2)*(ROW($D$2:$D$151)-1),COUNTIF($D$2:$D$151,2)+1-ROW(D82))),\"\")","v":""},"",82,{"$f":"IFERROR(INDEX($B$2:$B$151,LARGE(($D$2:$D$151=3)*(ROW($D$2:$D$151)-1),COUNTIF($D$2:$D$151,3)+1-ROW(D82))),\"\")","v":""},"",82,{"$f":"IFERROR(INDEX($B$2:$B$151,LARGE(($D$2:$D$151=4)*(ROW($D$2:$D$151)-1),COUNTIF($D$2:$D$151,4)+1-ROW(D82))),\"\")","v":""},"",82,{"$f":"IFERROR(INDEX($B$2:$B$151,LARGE(($D$2:$D$151=5)*(ROW($D$2:$D$151)-1),COUNTIF($D$2:$D$151,5)+1-ROW(D82))),\"\")","v":""},"",null,82,0,0,"-"]
[83,0,0,"-",null,83,{"$f":"IFERROR(INDEX($B$2:$B$151,LARGE(($D$2:$D$151=1)*(ROW($D$2:$D$151)-1),COUNTIF($D$2:$D$151,1)+1-ROW(D83))),\"\")","v":""},"",83,{"$f":"IFERROR(INDEX($B$2:$B$151,LARGE(($D$2:$D$151=2)*(ROW($D$2:$D$151)-1),COUNTIF($D$2:$D$151,2)+1-ROW(D83))),\"\")","v":""},"",83,{"$f":"IFERROR(INDEX($B$2:$B$151,LARGE(($D$2:$D$151=3)*(ROW($D$2:$D$151)-1),COUNTIF($D$2:$D$151,3)+1-ROW(D83))),\"\")","v":""},"",83,{"$f":"IFERROR(INDEX($B$2:$B$151,LARGE(($D$2:$D$151=4)*(ROW($D$2:$D$151)-1),COUNTIF($D$2:$D$151,4)+1-ROW(D83))),\"\")","v":""},"",83,{"$f":"IFERROR(INDEX($B$2:$B$151,LARGE(($D$2:$D$151=5)*(ROW($D$2:$D$151)-1),COUNTIF($D$2:$D$151,5)+1-ROW(D83))),\"\")","v":""},"",null,83,0,0,"-"]
[84,0,0,"-",null,84,{"$f":"IFERROR(INDEX($B$2:$B$151,LARGE(($D$2:$D$151=1)*(ROW($D$2:$D$151)-1),COUNTIF($D$2:$D$151,1)+1-ROW(D84))),\"\")","v":""},"",84,{"$f":"IFERROR(INDEX($B$2:$B$151,LARGE(($D$2:$D$151=2)*(ROW($D$2:$D$151)-1),COUNTIF($D$2:$D$151,2)+1-ROW(D84))),\"\")","v":""},"",84,{"$f":"IFERROR(INDEX($B$2:$B$151,LARGE(($D$2:$D$151=3)*(ROW($D$2:$D$151)-1),COUNTIF($D$2:$D$151,3)+1-ROW(D84))),\"\")","v":""},"",84,{"$f":"IFERROR(INDEX($B$2:$B$151,LARGE(($D$2:$D$151=4)*(ROW($D$2:$D$151)-1),COUNTIF($D$2:$D$151,4)+1-ROW(D84))),\"\")","v":""},"",84,{"$f":"IFERROR(INDEX($B$2:$B$151,LARGE(($D$2:$D$151=5)*(ROW($D$2:$D$151)-1),COUNTIF($D$2:$D$151,5)+1-ROW(D84))),\"\")","v":""},"",null,84,0,0,"-"]
[85,0,0,"-",null,85,{"$f":"IFERROR(INDEX($B$2:$B$151,LARGE(($D$2:$D$151=1)*(ROW($D$2:$D$151)-1),COUNTIF($D$2:$D$151,1)+1-ROW(D85))),\"\")","v":""},"",85,{"$f":"IFERROR(INDEX($B$2:$B$151,LARGE(($D$2:$D$151=2)*(ROW($D$2:$D$151)-1),COUNTIF($D$2:$D$151,2)+1-ROW(D85))),\"\")","v":""},"",85,{"$f":"IFERROR(INDEX($B$2:$B$151,LARGE(($D$2:$D$151=3)*(ROW($D$2:$D$151)-1),COUNTIF($D$2:$D$151,3)+1-ROW(D85))),\"\")","v":""},"",85,{"$f":"IFERROR(INDEX($B$2:$B$151,LARGE(($D$2:$D$151=4)*(ROW($D$2:$D$151)-1),COUNTIF($D$2:$D$151,4)+1-ROW(D85))),\"\")","v":""},"",85,{"$f":"IFERROR(INDEX($B$2:$B$151,LARGE(($D$2:$D$151=5)*(ROW($D$2:$D$151)-1),COUNTIF($D$2:$D$151,5)+1-ROW(D85))),\"\")","v":""},"",null,85,0,0,"-"]
[86,0,0,"-",null,86,{"$f":"IFERROR(INDEX($B$2:$B$151,LARGE(($D$2:$D$151=1)*(ROW($D$2:$D$151)-1),COUNTIF($D$2:$D$151,1)+1-ROW(D86))),\"\")","v":""},"",86,{"$f":"IFERROR(INDEX($B$2:$B$151,LARGE(($D$2:$D$151=2)*(ROW($D$2:$D$151)-1),COUNTIF($D$2:$D$151,2)+1-ROW(D86))),\"\")","v":""},"",86,{"$f":"IFERROR(INDEX($B$2:$B$151,LARGE(($D$2:$D$151=3)*(ROW($D$2:$D$151)-1),COUNTIF($D$2:$D$151,3)+1-ROW(D86))),\"\")","v":""},"",86,{"$f":"IFERROR(INDEX($B$2:$B$151,LARGE(($D$2:$D$151=4)*(ROW($D$2:$D$151)-1),COUNTIF($D$2:$D$151,4)+1-ROW(D86))),\"\")","v":""},"",86,{"$f":"IFERROR(INDEX($B$2:$B$151,LARGE(($D$2:$D$151=5)*(ROW($D$2:$D$151)-1),COUNTIF($D$2:$D$151,5)+1-ROW(D86))),\"\")","v":""},"",null,86,0,0,"-"]
[87,0,0,"-",null,87,{"$f":"IFERROR(INDEX($B$2:$B$151,LARGE(($D$2:$D$151=1)*(ROW($D$2:$D$151)-1),COUNTIF($D$2:$D$151,1)+1-ROW(D87))),\"\")","v":""},"",87,{"$f":"IFERROR(INDEX($B$2:$B$151,LARGE(($D$2:$D$151=2)*(ROW($D$2:$D$151)-1),COUNTIF($D$2:$D$151,2)+1-ROW(D87))),\"\")","v":""},"",87,{"$f":"IFERROR(INDEX($B$2:$B$151,LARGE(($D$2:$D$151=3)*(ROW($D$2:$D$151)-1),COUNTIF($D$2:$D$151,3)+1-ROW(D87))),\"\")","v":""},"",87,{"$f":"IFERROR(INDEX($B$2:$B$151,LARGE(($D$2:$D$151=4)*(ROW($D$2:$D$151)-1),COUNTIF($D$2:$D$151,4)+1-ROW(D87))),\"\")","v":""},"",87,{"$f":"IFERROR(INDEX($B$2:$B$151,LARGE(($D$2:$D$151=5)*(ROW($D$2:$D$151)-1),COUNTIF($D$2:$D$151,5)+1-ROW(D87))),\"\")","v":""},"",null,87,0,0,"-"]
[88,0,0,"-",null,88,{"$f":"IFERROR(INDEX($B$2:$B$151,LARGE(($D$2:$D$151=1)*(ROW($D$2:$D$151)-1),COUNTIF($D$2:$D$151,1)+1-ROW(D88))),\"\")","v":""},"",88,{"$f":"IFERROR(INDEX($B$2:$B$151,LARGE(($D$2:$D$151=2)*(ROW($D$2:$D$151)-1),COUNTIF($D$2:$D$151,2)+1-ROW(D88))),\"\")","v":""},"",88,{"$f":"IFERROR(INDEX($B$2:$B$151,LARGE(($D$2:$D$151=3)*(ROW($D$2:$D$151)-1),COUNTIF($D$2:$D$151,3)+1-ROW(D88))),\"\")","v":""},"",88,{"$f":"IFERROR(INDEX($B$2:$B$151,LARGE(($D$2:$D$151=4)*(ROW($D$2:$D$151)-1),COUNTIF($D$2:$D$151,4)+1-ROW(D88))),\"\")","v":""},"",88,{"$f":"IFERROR(INDEX($B$2:$B$151,LARGE(($D$2:$D$151=5)*(ROW($D$2:$D$151)-1),COUNTIF($D$2:$D$151,5)+1-ROW(D88))),\"\")","v":""},"",null,88,0,0,"-"]
[89,0,0,"-",null,89,{"$f":"IFERROR(INDEX($B$2:$B$151,LARGE(($D$2:$D$151=1)*(ROW($D$2:$D$151)-1),COUNTIF($D$2:$D$151,1)+1-ROW(D89))),\"\")","v":""},"",89,{"$f":"IFERROR(INDEX($B$2:$B$151,LARGE(($D$2:$D$151=2)*(ROW($D$2:$D$151)-1),COUNTIF($D$2:$D$151,2)+1-ROW(D89))),\"\")","v":""},"",89,{"$f":"IFERROR(INDEX($B$2:$B$151,LARGE(($D$2:$D$151=3)*(ROW($D$2:$D$151)-1),COUNTIF($D$2:$D$151,3)+1-ROW(D89))),\"\")","v":""},"",89,{"$f":"IFERROR(INDEX($B$2:$B$151,LARGE(($D$2:$D$151=4)*(ROW($D$2:$D$151)-1),COUNTIF($D$2:$D$151,4)+1-ROW(D89))),\"\")","v":""},"",89,{"$f":"IFERROR(INDEX($B$2:$B$151,LARGE(($D$2:$D$151=5)*(ROW($D$2:$D$151)-1),COUNTIF($D$2:$D$151,5)+1-ROW(D89))),\"\")","v":""},"",null,89,0,0,"-"]
[90,0,0,"-",null,90,{"$f":"IFERROR(INDEX($B$2:$B$151,LARGE(($D$2:$D$151=1)*(ROW($D$2:$D$151)-1),COUNTIF($D$2:$D$151,1)+1-ROW(D90))),\"\")","v":""},"",90,{"$f":"IFERROR(INDEX($B$2:$B$151,LARGE(($D$2:$D$151=2)*(ROW($D$2:$D$151)-1),COUNTIF($D$2:$D$151,2)+1-ROW(D90))),\"\")","v":""},"",90,{"$f":"IFERROR(INDEX($B$2:$B$151,LARGE(($D$2:$D$151=3)*(ROW($D$2:$D$151)-1),COUNTIF($D$2:$D$151,3)+1-ROW(D90))),\"\")","v":""},"",90,{"$f":"IFERROR(INDEX($B$2:$B$151,LARGE(($D$2:$D$151=4)*(ROW($D$2:$D$151)-1),COUNTIF($D$2:$D$151,4)+1-ROW(D90))),\"\")","v":""},"",90,{"$f":"IFERROR(INDEX($B$2:$B$151,LARGE(($D$2:$D$151=5)*(ROW($D$2:$D$151)-1),COUNTIF($D$2:$D$151,5)+1-ROW(D90))),\"\")","v":""},"",null,90,0,0,"-"]
[91,0,0,"-",null,91,{"$f":"IFERROR(INDEX($B$2:$B$151,LARGE(($D$2:$D$151=1)*(ROW($D$2:$D$151)-1),COUNTIF($D$2:$D$151,1)+1-ROW(D91))),\"\")","v":""},"",91,{"$f":"IFERROR(INDEX($B$2:$B$151,LARGE(($D$2:$D$151=2)*(ROW($D$2:$D$151)-1),COUNTIF($D$2:$D$151,2)+1-ROW(D91))),\"\")","v":""},"",91,{"$f":"IFERROR(INDEX($B$2:$B$151,LARGE(($D$2:$D$151=3)*(ROW($D$2:$D$151)-1),COUNTIF($D$2:$D$151,3)+1-ROW(D91))),\"\")","v":""},"",91,{"$f":"IFERROR(INDEX($B$2:$B$151,LARGE(($D$2:$D$151=4)*(ROW($D$2:$D$151)-1),COUNTIF($D$2:$D$151,4)+1-ROW(D91))),\"\")","v":""},"",91,{"$f":"IFERROR(INDEX($B$2:$B$151,LARGE(($D$2:$D$151=5)*(ROW($D$2:$D$151)-1),COUNTIF($D$2:$D$151,5)+1-ROW(D91))),\"\")","v":""},"",null,91,0,0,"-"]
[92,0,0,"-",null,92,{"$f":"IFERROR(INDEX($B$2:$B$151,LARGE(($D$2:$D$151=1)*(ROW($D$2:$D$151)-1),COUNTIF($D$2:$D$151,1)+1-ROW(D92))),\"\")","v":""},"",92,{"$f":"IFERROR(INDEX($B$2:$B$151,LARGE(($D$2:$D$151=2)*(ROW($D$2:$D$151)-1),COUNTIF($D$2:$D$151,2)+1-ROW(D92))),\"\")","v":""},"",92,{"$f":"IFERROR(INDEX($B$2:$B$151,LARGE(($D$2:$D$151=3)*(ROW($D$2:$D$151)-1),COUNTIF($D$2:$D$151,3)+1-ROW(D92))),\"\")","v":""},"",92,{"$f":"IFERROR(INDEX($B$2:$B$151,LARGE(($D$2:$D$151=4)*(ROW($D$2:$D$151)-1),COUNTIF($D$2:$D$151,4)+1-ROW(D92))),\"\")","v":""},"",92,{"$f":"IFERROR(INDEX($B$2:$B$151,LARGE(($D$2:$D$151=5)*(ROW($D$2:$D$151)-1),COUNTIF($D$2:$D$151,5)+1-ROW(D92))),\"\")","v":""},"",null,92,0,0,"-"]
[93,0,0,"-",null,93,{"$f":"IFERROR(INDEX($B$2:$B$151,LARGE(($D$2:$D$151=1)*(ROW($D$2:$D$151)-1),COUNTIF($D$2:$D$151,1)+1-ROW(D93))),\"\")","v":""},"",93,{"$f":"IFERROR(INDEX($B$2:$B$151,LARGE(($D$2:$D$151=2)*(ROW($D$2:$D$151)-1),COUNTIF($D$2:$D$151,2)+1-ROW(D93))),\"\")","v":""},"",93,{"$f":"IFERROR(INDEX($B$2:$B$151,LARGE(($D$2:$D$151=3)*(ROW($D$2:$D$151)-1),COUNTIF($D$2:$D$151,3)+1-ROW(D93))),\"\")","v":""},"",93,{"$f":"IFERROR(INDEX($B$2:$B$151,LARGE(($D$2:$D$151=4)*(ROW($D$2:$D$151)-1),COUNTIF($D$2:$D$151,4)+1-ROW(D93))),\"\")","v":""},"",93,{"$f":"IFERROR(INDEX($B$2:$B$151,LARGE(($D$2:$D$151=5)*(ROW($D$2:$D$151)-1),COUNTIF($D$2:$D$151,5)+1-ROW(D93))),\"\")","v":""},"",null,93,0,0,"-"]
[94,0,0,"-",null,94,{"$f":"IFERROR(INDEX($B$2:$B$151,LARGE(($D$2:$D$151=1)*(ROW($D$2:$D$151)-1),COUNTIF($D$2:$D$151,1)+1-ROW(D94))),\"\")","v":""},"",94,{"$f":"IFERROR(INDEX($B$2:$B$151,LARGE(($D$2:$D$151=2)*(ROW($D$2:$D$151)-1),COUNTIF($D$2:$D$151,2)+1-ROW(D94))),\"\")","v":""},"",94,{"$f":"IFERROR(INDEX($B$2:$B$151,LARGE(($D$2:$D$151=3)*(ROW($D$2:$D$151)-1),COUNTIF($D$2:$D$151,3)+1-ROW(D94))),\"\")","v":""},"",94,{"$f":"IFERROR(INDEX($B$2:$B$151,LARGE(($D$2:$D$151=4)*(ROW($D$2:$D$151)-1),COUNTIF($D$2:$D$151,4)+1-ROW(D94))),\"\")","v":""},"",94,{"$f":"IFERROR(INDEX($B$2:$B$151,LARGE(($D$2:$D$151=5)*(ROW($D$2:$D$151)-1),COUNTIF($D$2:$D$151,5)+1-ROW(D94))),\"\")","v":""},"",null,94,0,0,"-"]
[95,0,0,"-",null,95,{"$f":"IFERROR(INDEX($B$2:$B$151,LARGE(($D$2:$D$151=1)*(ROW($D$2:$D$151)-1),COUNTIF($D$2:$D$151,1)+1-ROW(D95))),\"\")","v":""},"",95,{"$f":"IFERROR(INDEX($B$2:$B$151,LARGE(($D$2:$D$151=2)*(ROW($D$2:$D$151)-1),COUNTIF($D$2:$D$151,2)+1-ROW(D95))),\"\")","v":""},"",95,{"$f":"IFERROR(INDEX($B$2:$B$151,LARGE(($D$2:$D$151=3)*(ROW($D$2:$D$151)-1),COUNTIF($D$2:$D$151,3)+1-ROW(D95))),\"\")","v":""},"",95,{"$f":"IFERROR(INDEX($B$2:$B$151,LARGE(($D$2:$D$151=4)*(ROW($D$2:$D$151)-1),COUNTIF($D$2:$D$151,4)+1-ROW(D95))),\"\")","v":""},"",95,{"$f":"IFERROR(INDEX($B$2:$B$151,LARGE(($D$2:$D$151=5)*(ROW($D$2:$D$151)-1),COUNTIF($D$2:$D$151,5)+1-ROW(D95))),\"\")","v":""},"",null,95,0,0,"-"]
[96,0,0,"-",null,96,{"$f":"IFERROR(INDEX($B$2:$B$151,LARGE(($D$2:$D$151=1)*(ROW($D$2:$D$151)-1),COUNTIF($D$2:$D$151,1)+1-ROW(D96))),\"\")","v":""},"",96,{"$f":"IFERROR(INDEX($B$2:$B$151,LARGE(($D$2:$D$151=2)*(ROW($D$2:$D$151)-1),COUNTIF($D$2:$D$151,2)+1-ROW(D96))),\"\")","v":""},"",96,{"$f":"IFERROR(INDEX($B$2:$B$151,LARGE(($D$2:$D$151=3)*(ROW($D$2:$D$151)-1),COUNTIF($D$2:$D$151,3)+1-ROW(D96))),\"\")","v":""},"",96,{"$f":"IFERROR(INDEX($B$2:$B$151,LARGE(($D$2:$D$151=4)*(ROW($D$2:$D$151)-1),COUNTIF($D$2:$D$151,4)+1-ROW(D96))),\"\")","v":""},"",96,{"$f":"IFERROR(INDEX($B$2:$B$151,LARGE(($D$2:$D$151=5)*(ROW($D$2:$D$151)-1),COUNTIF($D$2:$D$151,5)+1-ROW(D96))),\"\")","v":""},"",null,96,0,0,"-"]
[97,0,0,"-",null,97,{"$f":"IFERROR(INDEX($B$2:$B$151,LARGE(($D$2:$D$151=1)*(ROW($D$2:$D$151)-1),COUNTIF($D$2:$D$151,1)+1-ROW(D97))),\"\")","v":""},"",97,{"$f":"IFERROR(INDEX($B$2:$B$151,LARGE(($D$2:$D$151=2)*(ROW($D$2:$D$151)-1),COUNTIF($D$2:$D$151,2)+1-ROW(D97))),\"\")","v":""},"",97,{"$f":"IFERROR(INDEX($B$2:$B$151,LARGE(($D$2:$D$151=3)*(ROW($D$2:$D$151)-1),COUNTIF($D$2:$D$151,3)+1-ROW(D97))),\"\")","v":""},"",97,{"$f":"IFERROR(INDEX($B$2:$B$151,LARGE(($D$2:$D$151=4)*(ROW($D$2:$D$151)-1),COUNTIF($D$2:$D$151,4)+1-ROW(D97))),\"\")","v":""},"",97,{"$f":"IFERROR(INDEX($B$2:$B$151,LARGE(($D$2:$D$151=5)*(ROW($D$2:$D$151)-1),COUNTIF($D$2:$D$151,5)+1-ROW(D97))),\"\")","v":""},"",null,97,0,0,"-"]
[98,0,0,"-",null,98,{"$f":"IFERROR(INDEX($B$2:$B$151,LARGE(($D$2:$D$151=1)*(ROW($D$2:$D$151)-1),COUNTIF($D$2:$D$151,1)+1-ROW(D98))),\"\")","v":""},"",98,{"$f":"IFERROR(INDEX($B$2:$B$151,LARGE(($D$2:$D$151=2)*(ROW($D$2:$D$151)-1),COUNTIF($D$2:$D$151,2)+1-ROW(D98))),\"\")","v":""},"",98,{"$f":"IFERROR(INDEX($B$2:$B$151,LARGE(($D$2:$D$151=3)*(ROW($D$2:$D$151)-1),COUNTIF($D$2:$D$151,3)+1-ROW(D98))),\"\")","v":""},"",98,{"$f":"IFERROR(INDEX($B$2:$B$151,LARGE(($D$2:$D$151=4)*(ROW($D$2:$D$151)-1),COUNTIF($D$2:$D$151,4)+1-ROW(D98))),\"\")","v":""},"",98,{"$f":"IFERROR(INDEX($B$2:$B$151,LARGE(($D$2:$D$151=5)*(ROW($D$2:$D$151)-1),COUNTIF($D$2:$D$151,5)+1-ROW(D98))),\"\")","v":""},"",null,98,0,0,"-"]
[99,0,0,"-",null,99,{"$f":"IFERROR(INDEX($B$2:$B$151,LARGE(($D$2:$D$151=1)*(ROW($D$2:$D$151)-1),COUNTIF($D$2:$D$151,1)+1-ROW(D99))),\"\")","v":""},"",99,{"$f":"IFERROR(INDEX($B$2:$B$151,LARGE(($D$2:$D$151=2)*(ROW($D$2:$D$151)-1),COUNTIF($D$2:$D$151,2)+1-ROW(D99))),\"\")","v":""},"",99,{"$f":"IFERROR(INDEX($B$2:$B$151,LARGE(($D$2:$D$151=3)*(ROW($D$2:$D$151)-1),COUNTIF($D$2:$D$151,3)+1-ROW(D99))),\"\")","v":""},"",99,{"$f":"IFERROR(INDEX($B$2:$B$151,LARGE(($D$2:$D$151=4)*(ROW($D$2:$D$151)-1),COUNTIF($D$2:$D$151,4)+1-ROW(D99))),\"\")","v":""},"",99,{"$f":"IFERROR(INDEX($B$2:$B$151,LARGE(($D$2:$D$151=5)*(ROW($D$2:$D$151)-1),COUNTIF($D$2:$D$151,5)+1-ROW(D99))),\"\")","v":""},"",null,99,0,0,"-"]
[100,0,0,"-",null,100,{"$f":"IFERROR(INDEX($B$2:$B$151,LARGE(($D$2:$D$151=1)*(ROW($D$2:$D$151)-1),COUNTIF($D$2:$D$151,1)+1-ROW(D100))),\"\")","v":""},"",100,{"$f":"IFERROR(INDEX($B$2:$B$151,LARGE(($D$2:$D$151=2)*(ROW($D$2:$D$151)-1),COUNTIF($D$2:$D$151,2)+1-ROW(D100))),\"\")","v":""},"",100,{"$f":"IFERROR(INDEX($B$2:$B$151,LARGE(($D$2:$D$151=3)*(ROW($D$2:$D$151)-1),COUNTIF($D$2:$D$151,3)+1-ROW(D100))),\"\")","v":""},"",100,{"$f":"IFERROR(INDEX($B$2:$B$151,LARGE(($D$2:$D$151=4)*(ROW($D$2:$D$151)-1),COUNTIF($D$2:$D$151,4)+1-ROW(D100))),\"\")","v":""},"",100,{"$f":"IFERROR(INDEX($B$2:$B$151,LARGE(($D$2:$D$151=5)*(ROW($D$2:$D$151)-1),COUNTIF($D$2:$D$151,5)+1-ROW(D100))),\"\")","v":""},"",null,100,0,0,"-"]
[101,0,0,"-",null,101,{"$f":"IFERROR(INDEX($B$2:$B$151,LARGE(($D$2:$D$151=1)*(ROW($D$2:$D$151)-1),COUNTIF($D$2:$D$151,1)+1-ROW(D101))),\"\")","v":""},"",101,{"$f":"IFERROR(INDEX($B$2:$B$151,LARGE(($D$2:$D$151=2)*(ROW($D$2:$D$151)-1),COUNTIF($D$2:$D$151,2)+1-ROW(D101))),\"\")","v":""},"",101,{"$f":"IFERROR(INDEX($B$2:$B$151,LARGE(($D$2:$D$151=3)*(ROW($D$2:$D$151)-1),COUNTIF($D$2:$D$151,3)+1-ROW(D101))),\"\")","v":""},"",101,{"$f":"IFERROR(INDEX($B$2:$B$151,LARGE(($D$2:$D$151=4)*(ROW($D$2:$D$151)-1),COUNTIF($D$2:$D$151,4)+1-ROW(D101))),\"\")","v":""},"",101,{"$f":"IFERROR(INDEX($B$2:$B$151,LARGE(($D$2:$D$151=5)*(ROW($D$2:$D$151)-1),COUNTIF($D$2:$D$151,5)+1-ROW(D101))),\"\")","v":""},"",null,101,0,0,"-"]
[102,0,0,"-",null,102,{"$f":"IFERROR(INDEX($B$2:$B$151,LARGE(($D$2:$D$151=1)*(ROW($D$2:$D$151)-1),COUNTIF($D$2:$D$151,1)+1-ROW(D102))),\"\")","v":""},"",102,{"$f":"IFERROR(INDEX($B$2:$B$151,LARGE(($D$2:$D$151=2)*(ROW($D$2:$D$151)-1),COUNTIF($D$2:$D$151,2)+1-ROW(D102))),\"\")","v":""},"",102,{"$f":"IFERROR(INDEX($B$2:$B$151,LARGE(($D$2:$D$151=3)*(ROW($D$2:$D$151)-1),COUNTIF($D$2:$D$151,3)+1-ROW(D102))),\"\")","v":""},"",102,{"$f":"IFERROR(INDEX($B$2:$B$151,LARGE(($D$2:$D$151=4)*(ROW($D$2:$D$151)-1),COUNTIF($D$2:$D$151,4)+1-ROW(D102))),\"\")","v":""},"",102,{"$f":"IFERROR(INDEX($B$2:$B$151,LARGE(($D$2:$D$151=5)*(ROW($D$2:$D$151)-1),COUNTIF($D$2:$D$151,5)+1-ROW(D102))),\"\")","v":""},"",null,102,0,0,"-"]
[103,0,0,"-",null,103,{"$f":"IFERROR(INDEX($B$2:$B$151,LARGE(($D$2:$D$151=1)*(ROW($D$2:$D$151)-1),COUNTIF($D$2:$D$151,1)+1-ROW(D103))),\"\")","v":""},"",103,{"$f":"IFERROR(INDEX($B$2:$B$151,LARGE(($D$2:$D$151=2)*(ROW($D$2:$D$151)-1),COUNTIF($D$2:$D$151,2)+1-ROW(D103))),\"\")","v":""},"",103,{"$f":"IFERROR(INDEX($B$2:$B$151,LARGE(($D$2:$D$151=3)*(ROW($D$2:$D$151)-1),COUNTIF($D$2:$D$151,3)+1-ROW(D103))),\"\")","v":""},"",103,{"$f":"IFERROR(INDEX($B$2:$B$151,LARGE(($D$2:$D$151=4)*(ROW($D$2:$D$151)-1),COUNTIF($D$2:$D$151,4)+1-ROW(D103))),\"\")","v":""},"",103,{"$f":"IFERROR(INDEX($B$2:$B$151,LARGE(($D$2:$D$151=5)*(ROW($D$2:$D$151)-1),COUNTIF($D$2:$D$151,5)+1-ROW(D103))),\"\")","v":""},"",null,103,0,0,"-"]
[104,0,0,"-",null,104,{"$f":"IFERROR(INDEX($B$2:$B$151,LARGE(($D$2:$D$151=1)*(ROW($D$2:$D$151)-1),COUNTIF($D$2:$D$151,1)+1-ROW(D104))),\"\")","v":""},"",104,{"$f":"IFERROR(INDEX($B$2:$B$151,LARGE(($D$2:$D$151=2)*(ROW($D$2:$D$151)-1),COUNTIF($D$2:$D$151,2)+1-ROW(D104))),\"\")","v":""},"",104,{"$f":"IFERROR(INDEX($B$2:$B$151,LARGE(($D$2:$D$151=3)*(ROW($D$2:$D$151)-1),COUNTIF($D$2:$D$151,3)+1-ROW(D104))),\"\")","v":""},"",104,{"$f":"IFERROR(INDEX($B$2:$B$151,LARGE(($D$2:$D$151=4)*(ROW($D$2:$D$151)-1),COUNTIF($D$2:$D$151,4)+1-ROW(D104))),\"\")","v":""},"",104,{"$f":"IFERROR(INDEX($B$2:$B$151,LARGE(($D$2:$D$151=5)*(ROW($D$2:$D$151)-1),COUNTIF($D$2:$D$151,5)+1-ROW(D104))),\"\")","v":""},"",null,104,0,0,"-"]
[105,0,0,"-",null,105,{"$f":"IFERROR(INDEX($B$2:$B$151,LARGE(($D$2:$D$151=1)*(ROW($D$2:$D$151)-1),COUNTIF($D$2:$D$151,1)+1-ROW(D105))),\"\")","v":""},"",105,{"$f":"IFERROR(INDEX($B$2:$B$151,LARGE(($D$2:$D$151=2)*(ROW($D$2:$D$151)-1),COUNTIF($D$2:$D$151,2)+1-ROW(D105))),\"\")","v":""},"",105,{"$f":"IFERROR(INDEX($B$2:$B$151,LARGE(($D$2:$D$151=3)*(ROW($D$2:$D$151)-1),COUNTIF($D$2:$D$151,3)+1-ROW(D105))),\"\")","v":""},"",105,{"$f":"IFERROR(INDEX($B$2:$B$151,LARGE(($D$2:$D$151=4)*(ROW($D$2:$D$151)-1),COUNTIF($D$2:$D$151,4)+1-ROW(D105))),\"\")","v":""},"",105,{"$f":"IFERROR(INDEX($B$2:$B$151,LARGE(($D$2:$D$151=5)*(ROW($D$2:$D$151)-1),COUNTIF($D$2:$D$151,5)+1-ROW(D105))),\"\")","v":""},"",null,105,0,0,"-"]
[106,0,0,"-",null,106,{"$f":"IFERROR(INDEX($B$2:$B$151,LARGE(($D$2:$D$151=1)*(ROW($D$2:$D$151)-1),COUNTIF($D$2:$D$151,1)+1-ROW(D106))),\"\")","v":""},"",106,{"$f":"IFERROR(INDEX($B$2:$B$151,LARGE(($D$2:$D$151=2)*(ROW($D$2:$D$151)-1),COUNTIF($D$2:$D$151,2)+1-ROW(D106))),\"\")","v":""},"",106,{"$f":"IFERROR(INDEX($B$2:$B$151,LARGE(($D$2:$D$151=3)*(ROW($D$2:$D$151)-1),COUNTIF($D$2:$D$151,3)+1-ROW(D106))),\"\")","v":""},"",106,{"$f":"IFERROR(INDEX($B$2:$B$151,LARGE(($D$2:$D$151=4)*(ROW($D$2:$D$151)-1),COUNTIF($D$2:$D$151,4)+1-ROW(D106))),\"\")","v":""},"",106,{"$f":"IFERROR(INDEX($B$2:$B$151,LARGE(($D$2:$D$151=5)*(ROW($D$2:$D$151)-1),COUNTIF($D$2:$D$151,5)+1-ROW(D106))),\"\")","v":""},"",null,106,0,0,"-"]
[107,0,0,"-",null,107,{"$f":"IFERROR(INDEX($B$2:$B$151,LARGE(($D$2:$D$151=1)*(ROW($D$2:$D$151)-1),COUNTIF($D$2:$D$151,1)+1-ROW(D107))),\"\")","v":""},"",107,{"$f":"IFERROR(INDEX($B$2:$B$151,LARGE(($D$2:$D$151=2)*(ROW($D$2:$D$151)-1),COUNTIF($D$2:$D$151,2)+1-ROW(D107))),\"\")","v":""},"",107,{"$f":"IFERROR(INDEX($B$2:$B$151,LARGE(($D$2:$D$151=3)*(ROW($D$2:$D$151)-1),COUNTIF($D$2:$D$151,3)+1-ROW(D107))),\"\")","v":""},"",107,{"$f":"IFERROR(INDEX($B$2:$B$151,LARGE(($D$2:$D$151=4)*(ROW($D$2:$D$151)-1),COUNTIF($D$2:$D$151,4)+1-ROW(D107))),\"\")","v":""},"",107,{"$f":"IFERROR(INDEX($B$2:$B$151,LARGE(($D$2:$D$151=5)*(ROW($D$2:$D$151)-1),COUNTIF($D$2:$D$151,5)+1-ROW(D107))),\"\")","v":""},"",null,107,0,0,"-"]
[108,0,0,"-",null,108,{"$f":"IFERROR(INDEX($B$2:$B$151,LARGE(($D$2:$D$151=1)*(ROW($D$2:$D$151)-1),COUNTIF($D$2:$D$151,1)+1-ROW(D108))),\"\")","v":""},"",108,{"$f":"IFERROR(INDEX($B$2:$B$151,LARGE(($D$2:$D$151=2)*(ROW($D$2:$D$151)-1),COUNTIF($D$2:$D$151,2)+1-ROW(D108))),\"\")","v":""},"",108,{"$f":"IFERROR(INDEX($B$2:$B$151,LARGE(($D$2:$D$151=3)*(ROW($D$2:$D$151)-1),COUNTIF($D$2:$D$151,3)+1-ROW(D108))),\"\")","v":""},"",108,{"$f":"IFERROR(INDEX($B$2:$B$151,LARGE(($D$2:$D$151=4)*(ROW($D$2:$D$151)-1),COUNTIF($D$2:$D$151,4)+1-ROW(D108))),\"\")","v":""},"",108,{"$f":"IFERROR(INDEX($B$2:$B$151,LARGE(($D$2:$D$151=5)*(ROW($D$2:$D$151)-1),COUNTIF($D$2:$D$151,5)+1-ROW(D108))),\"\")","v":""},"",null,108,0,0,"-"]
[109,0,0,"-",null,109,{"$f":"IFERROR(INDEX($B$2:$B$151,LARGE(($D$2:$D$151=1)*(ROW($D$2:$D$151)-1),COUNTIF($D$2:$D$151,1)+1-ROW(D109))),\"\")","v":""},"",109,{"$f":"IFERROR(INDEX($B$2:$B$151,LARGE(($D$2:$D$151=2)*(ROW($D$2:$D$151)-1),COUNTIF($D$2:$D$151,2)+1-ROW(D109))),\"\")","v":""},"",109,{"$f":"IFERROR(INDEX($B$2:$B$151,LARGE(($D$2:$D$151=3)*(ROW($D$2:$D$151)-1),COUNTIF($D$2:$D$151,3)+1-ROW(D109))),\"\")","v":""},"",109,{"$f":"IFERROR(INDEX($B$2:$B$151,LARGE(($D$2:$D$151=4)*(ROW($D$2:$D$151)-1),COUNTIF($D$2:$D$151,4)+1-ROW(D109))),\"\")","v":""},"",109,{"$f":"IFERROR(INDEX($B$2:$B$151,LARGE(($D$2:$D$151=5)*(ROW($D$2:$D$151)-1),COUNTIF($D$2:$D$151,5)+1-ROW(D109))),\"\")","v":""},"",null,109,0,0,"-"]
[110,0,0,"-",null,110,{"$f":"IFERROR(INDEX($B$2:$B$151,LARGE(($D$2:$D$151=1)*(ROW($D$2:$D$151)-1),COUNTIF($D$2:$D$151,1)+1-ROW(D110))),\"\")","v":""},"",110,{"$f":"IFERROR(INDEX($B$2:$B$151,LARGE(($D$2:$D$151=2)*(ROW($D$2:$D$151)-1),COUNTIF($D$2:$D$151,2)+1-ROW(D110))),\"\")","v":""},"",110,{"$f":"IFERROR(INDEX($B$2:$B$151,LARGE(($D$2:$D$151=3)*(ROW($D$2:$D$151)-1),COUNTIF($D$2:$D$151,3)+1-ROW(D110))),\"\")","v":""},"",110,{"$f":"IFERROR(INDEX($B$2:$B$151,LARGE(($D$2:$D$151=4)*(ROW($D$2:$D$151)-1),COUNTIF($D$2:$D$151,4)+1-ROW(D110))),\"\")","v":""},"",110,{"$f":"IFERROR(INDEX($B$2:$B$151,LARGE(($D$2:$D$151=5)*(ROW($D$2:$D$151)-1),COUNTIF($D$2:$D$151,5)+1-ROW(D110))),\"\")","v":""},"",null,110,0,0,"-"]
[111,0,0,"-",null,111,{"$f":"IFERROR(INDEX($B$2:$B$151,LARGE(($D$2:$D$151=1)*(ROW($D$2:$D$151)-1),COUNTIF($D$2:$D$151,1)+1-ROW(D111))),\"\")","v":""},"",111,{"$f":"IFERROR(INDEX($B$2:$B$151,LARGE(($D$2:$D$151=2)*(ROW($D$2:$D$151)-1),COUNTIF($D$2:$D$151,2)+1-ROW(D111))),\"\")","v":""},"",111,{"$f":"IFERROR(INDEX($B$2:$B$151,LARGE(($D$2:$D$151=3)*(ROW($D$2:$D$151)-1),COUNTIF($D$2:$D$151,3)+1-ROW(D111))),\"\")","v":""},"",111,{"$f":"IFERROR(INDEX($B$2:$B$151,LARGE(($D$2:$D$151=4)*(ROW($D$2:$D$151)-1),COUNTIF($D$2:$D$151,4)+1-ROW(D111))),\"\")","v":""},"",111,{"$f":"IFERROR(INDEX($B$2:$B$151,LARGE(($D$2:$D$151=5)*(ROW($D$2:$D$151)-1),COUNTIF($D$2:$D$151,5)+1-ROW(D111))),\"\")","v":""},"",null,111,0,0,"-"]
[112,0,0,"-",null,112,{"$f":"IFERROR(INDEX($B$2:$B$151,LARGE(($D$2:$D$151=1)*(ROW($D$2:$D$151)-1),COUNTIF($D$2:$D$151,1)+1-ROW(D112))),\"\")","v":""},"",112,{"$f":"IFERROR(INDEX($B$2:$B$151,LARGE(($D$2:$D$151=2)*(ROW($D$2:$D$151)-1),COUNTIF($D$2:$D$151,2)+1-ROW(D112))),\"\")","v":""},"",112,{"$f":"IFERROR(INDEX($B$2:$B$151,LARGE(($D$2:$D$151=3)*(ROW($D$2:$D$151)-1),COUNTIF($D$2:$D$151,3)+1-ROW(D112))),\"\")","v":""},"",112,{"$f":"IFERROR(INDEX($B$2:$B$151,LARGE(($D$2:$D$151=4)*(ROW($D$2:$D$151)-1),COUNTIF($D$2:$D$151,4)+1-ROW(D112))),\"\")","v":""},"",112,{"$f":"IFERROR(INDEX($B$2:$B$151,LARGE(($D$2:$D$151=5)*(ROW($D$2:$D$151)-1),COUNTIF($D$2:$D$151,5)+1-ROW(D112))),\"\")","v":""},"",null,112,0,0,"-"]
[113,0,0,"-",null,113,{"$f":"IFERROR(INDEX($B$2:$B$151,LARGE(($D$2:$D$151=1)*(ROW($D$2:$D$151)-1),COUNTIF($D$2:$D$151,1)+1-ROW(D113))),\"\")","v":""},"",113,{"$f":"IFERROR(INDEX($B$2:$B$151,LARGE(($D$2:$D$151=2)*(ROW($D$2:$D$151)-1),COUNTIF($D$2:$D$151,2)+1-ROW(D113))),\"\")","v":""},"",113,{"$f":"IFERROR(INDEX($B$2:$B$151,LARGE(($D$2:$D$151=3)*(ROW($D$2:$D$151)-1),COUNTIF($D$2:$D$151,3)+1-ROW(D113))),\"\")","v":""},"",113,{"$f":"IFERROR(INDEX($B$2:$B$151,LARGE(($D$2:$D$151=4)*(ROW($D$2:$D$151)-1),COUNTIF($D$2:$D$151,4)+1-ROW(D113))),\"\")","v":""},"",113,{"$f":"IFERROR(INDEX($B$2:$B$151,LARGE(($D$2:$D$151=5)*(ROW($D$2:$D$151)-1),COUNTIF($D$2:$D$151,5)+1-ROW(D113))),\"\")","v":""},"",null,113,0,0,"-"]
[114,0,0,"-",null,114,{"$f":"IFERROR(INDEX($B$2:$B$151,LARGE(($D$2:$D$151=1)*(ROW($D$2:$D$151)-1),COUNTIF($D$2:$D$151,1)+1-ROW(D114))),\"\")","v":""},"",114,{"$f":"IFERROR(INDEX($B$2:$B$151,LARGE(($D$2:$D$151=2)*(ROW($D$2:$D$151)-1),COUNTIF($D$2:$D$151,2)+1-ROW(D114))),\"\")","v":""},"",114,{"$f":"IFERROR(INDEX($B$2:$B$151,LARGE(($D$2:$D$151=3)*(ROW($D$2:$D$151)-1),COUNTIF($D$2:$D$151,3)+1-ROW(D114))),\"\")","v":""},"",114,{"$f":"IFERROR(INDEX($B$2:$B$151,LARGE(($D$2:$D$151=4)*(ROW($D$2:$D$151)-1),COUNTIF($D$2:$D$151,4)+1-ROW(D114))),\"\")","v":""},"",114,{"$f":"IFERROR(INDEX($B$2:$B$151,LARGE(($D$2:$D$151=5)*(ROW($D$2:$D$151)-1),COUNTIF($D$2:$D$151,5)+1-ROW(D114))),\"\")","v":""},"",null,114,0,0,"-"]
[115,0,0,"-",null,115,{"$f":"IFERROR(INDEX($B$2:$B$151,LARGE(($D$2:$D$151=1)*(ROW($D$2:$D$151)-1),COUNTIF($D$2:$D$151,1)+1-ROW(D115))),\"\")","v":""},"",115,{"$f":"IFERROR(INDEX($B$2:$B$151,LARGE(($D$2:$D$151=2)*(ROW($D$2:$D$151)-1),COUNTIF($D$2:$D$151,2)+1-ROW(D115))),\"\")","v":""},"",115,{"$f":"IFERROR(INDEX($B$2:$B$151,LARGE(($D$2:$D$151=3)*(ROW($D$2:$D$151)-1),COUNTIF($D$2:$D$151,3)+1-ROW(D115))),\"\")","v":""},"",115,{"$f":"IFERROR(INDEX($B$2:$B$151,LARGE(($D$2:$D$151=4)*(ROW($D$2:$D$151)-1),COUNTIF($D$2:$D$151,4)+1-ROW(D115))),\"\")","v":""},"",115,{"$f":"IFERROR(INDEX($B$2:$B$151,LARGE(($D$2:$D$151=5)*(ROW($D$2:$D$151)-1),COUNTIF($D$2:$D$151,5)+1-ROW(D115))),\"\")","v":""},"",null,115,0,0,"-"]
[116,0,0,"-",null,116,{"$f":"IFERROR(INDEX($B$2:$B$151,LARGE(($D$2:$D$151=1)*(ROW($D$2:$D$151)-1),COUNTIF($D$2:$D$151,1)+1-ROW(D116))),\"\")","v":""},"",116,{"$f":"IFERROR(INDEX($B$2:$B$151,LARGE(($D$2:$D$151=2)*(ROW($D$2:$D$151)-1),COUNTIF($D$2:$D$151,2)+1-ROW(D116))),\"\")","v":""},"",116,{"$f":"IFERROR(INDEX($B$2:$B$151,LARGE(($D$2:$D$151=3)*(ROW($D$2:$D$151)-1),COUNTIF($D$2:$D$151,3)+1-ROW(D116))),\"\")","v":""},"",116,{"$f":"IFERROR(INDEX($B$2:$B$151,LARGE(($D$2:$D$151=4)*(ROW($D$2:$D$151)-1),COUNTIF($D$2:$D$151,4)+1-ROW(D116))),\"\")","v":""},"",116,{"$f":"IFERROR(INDEX($B$2:$B$151,LARGE(($D$2:$D$151=5)*(ROW($D$2:$D$151)-1),COUNTIF($D$2:$D$151,5)+1-ROW(D116))),\"\")","v":""},"",null,116,0,0,"-"]
[117,0,0,"-",null,117,{"$f":"IFERROR(INDEX($B$2:$B$151,LARGE(($D$2:$D$151=1)*(ROW($D$2:$D$151)-1),COUNTIF($D$2:$D$151,1)+1-ROW(D117))),\"\")","v":""},"",117,{"$f":"IFERROR(INDEX($B$2:$B$151,LARGE(($D$2:$D$151=2)*(ROW($D$2:$D$151)-1),COUNTIF($D$2:$D$151,2)+1-ROW(D117))),\"\")","v":""},"",117,{"$f":"IFERROR(INDEX($B$2:$B$151,LARGE(($D$2:$D$151=3)*(ROW($D$2:$D$151)-1),COUNTIF($D$2:$D$151,3)+1-ROW(D117))),\"\")","v":""},"",117,{"$f":"IFERROR(INDEX($B$2:$B$151,LARGE(($D$2:$D$151=4)*(ROW($D$2:$D$151)-1),COUNTIF($D$2:$D$151,4)+1-ROW(D117))),\"\")","v":""},"",117,{"$f":"IFERROR(INDEX($B$2:$B$151,LARGE(($D$2:$D$151=5)*(ROW($D$2:$D$151)-1),COUNTIF($D$2:$D$151,5)+1-ROW(D117))),\"\")","v":""},"",null,117,0,0,"-"]
[118,0,0,"-",null,118,{"$f":"IFERROR(INDEX($B$2:$B$151,LARGE(($D$2:$D$151=1)*(ROW($D$2:$D$151)-1),COUNTIF($D$2:$D$151,1)+1-ROW(D118))),\"\")","v":""},"",118,{"$f":"IFERROR(INDEX($B$2:$B$151,LARGE(($D$2:$D$151=2)*(ROW($D$2:$D$151)-1),COUNTIF($D$2:$D$151,2)+1-ROW(D118))),\"\")","v":""},"",118,{"$f":"IFERROR(INDEX($B$2:$B$151,LARGE(($D$2:$D$151=3)*(ROW($D$2:$D$151)-1),COUNTIF($D$2:$D$151,3)+1-ROW(D118))),\"\")","v":""},"",118,{"$f":"IFERROR(INDEX($B$2:$B$151,LARGE(($D$2:$D$151=4)*(ROW($D$2:$D$151)-1),COUNTIF($D$2:$D$151,4)+1-ROW(D118))),\"\")","v":""},"",118,{"$f":"IFERROR(INDEX($B$2:$B$151,LARGE(($D$2:$D$151=5)*(ROW($D$2:$D$151)-1),COUNTIF($D$2:$D$151,5)+1-ROW(D118))),\"\")","v":""},"",null,118,0,0,"-"]
[119,0,0,"-",null,119,{"$f":"IFERROR(INDEX($B$2:$B$151,LARGE(($D$2:$D$151=1)*(ROW($D$2:$D$151)-1),COUNTIF($D$2:$D$151,1)+1-ROW(D119))),\"\")","v":""},"",119,{"$f":"IFERROR(INDEX($B$2:$B$151,LARGE(($D$2:$D$151=2)*(ROW($D$2:$D$151)-1),COUNTIF($D$2:$D$151,2)+1-ROW(D119))),\"\")","v":""},"",119,{"$f":"IFERROR(INDEX($B$2:$B$151,LARGE(($D$2:$D$151=3)*(ROW($D$2:$D$151)-1),COUNTIF($D$2:$D$151,3)+1-ROW(D119))),\"\")","v":""},"",119,{"$f":"IFERROR(INDEX($B$2:$B$151,LARGE(($D$2:$D$151=4)*(ROW($D$2:$D$151)-1),COUNTIF($D$2:$D$151,4)+1-ROW(D119))),\"\")","v":""},"",119,{"$f":"IFERROR(INDEX($B$2:$B$151,LARGE(($D$2:$D$151=5)*(ROW($D$2:$D$151)-1),COUNTIF($D$2:$D$151,5)+1-ROW(D119))),\"\")","v":""},"",null,119,0,0,"-"]
[120,0,0,"-",null,120,{"$f":"IFERROR(INDEX($B$2:$B$151,LARGE(($D$2:$D$151=1)*(ROW($D$2:$D$151)-1),COUNTIF($D$2:$D$151,1)+1-ROW(D120))),\"\")","v":""},"",120,{"$f":"IFERROR(INDEX($B$2:$B$151,LARGE(($D$2:$D$151=2)*(ROW($D$2:$D$151)-1),COUNTIF($D$2:$D$151,2)+1-ROW(D120))),\"\")","v":""},"",120,{"$f":"IFERROR(INDEX($B$2:$B$151,LARGE(($D$2:$D$151=3)*(ROW($D$2:$D$151)-1),COUNTIF($D$2:$D$151,3)+1-ROW(D120))),\"\")","v":""},"",120,{"$f":"IFERROR(INDEX($B$2:$B$151,LARGE(($D$2:$D$151=4)*(ROW($D$2:$D$151)-1),COUNTIF($D$2:$D$151,4)+1-ROW(D120))),\"\")","v":""},"",120,{"$f":"IFERROR(INDEX($B$2:$B$151,LARGE(($D$2:$D$151=5)*(ROW($D$2:$D$151)-1),COUNTIF($D$2:$D$151,5)+1-ROW(D120))),\"\")","v":""},"",null,120,0,0,"-"]
[121,0,0,"-",null,121,{"$f":"IFERROR(INDEX($B$2:$B$151,LARGE(($D$2:$D$151=1)*(ROW($D$2:$D$151)-1),COUNTIF($D$2:$D$151,1)+1-ROW(D121))),\"\")","v":""},"",121,{"$f":"IFERROR(INDEX($B$2:$B$151,LARGE(($D$2:$D$151=2)*(ROW($D$2:$D$151)-1),COUNTIF($D$2:$D$151,2)+1-ROW(D121))),\"\")","v":""},"",121,{"$f":"IFERROR(INDEX($B$2:$B$151,LARGE(($D$2:$D$151=3)*(ROW($D$2:$D$151)-1),COUNTIF($D$2:$D$151,3)+1-ROW(D121))),\"\")","v":""},"",121,{"$f":"IFERROR(INDEX($B$2:$B$151,LARGE(($D$2:$D$151=4)*(ROW($D$2:$D$151)-1),COUNTIF($D$2:$D$151,4)+1-ROW(D121))),\"\")","v":""},"",121,{"$f":"IFERROR(INDEX($B$2:$B$151,LARGE(($D$2:$D$151=5)*(ROW($D$2:$D$151)-1),COUNTIF($D$2:$D$151,5)+1-ROW(D121))),\"\")","v":""},"",null,121,0,0,"-"]
[122,0,0,"-",null,122,{"$f":"IFERROR(INDEX($B$2:$B$151,LARGE(($D$2:$D$151=1)*(ROW($D$2:$D$151)-1),COUNTIF($D$2:$D$151,1)+1-ROW(D122))),\"\")","v":""},"",122,{"$f":"IFERROR(INDEX($B$2:$B$151,LARGE(($D$2:$D$151=2)*(ROW($D$2:$D$151)-1),COUNTIF($D$2:$D$151,2)+1-ROW(D122))),\"\")","v":""},"",122,{"$f":"IFERROR(INDEX($B$2:$B$151,LARGE(($D$2:$D$151=3)*(ROW($D$2:$D$151)-1),COUNTIF($D$2:$D$151,3)+1-ROW(D122))),\"\")","v":""},"",122,{"$f":"IFERROR(INDEX($B$2:$B$151,LARGE(($D$2:$D$151=4)*(ROW($D$2:$D$151)-1),COUNTIF($D$2:$D$151,4)+1-ROW(D122))),\"\")","v":""},"",122,{"$f":"IFERROR(INDEX($B$2:$B$151,LARGE(($D$2:$D$151=5)*(ROW($D$2:$D$151)-1),COUNTIF($D$2:$D$151,5)+1-ROW(D122))),\"\")","v":""},"",null,122,0,0,"-"]
[123,0,0,"-",null,123,{"$f":"IFERROR(INDEX($B$2:$B$151,LARGE(($D$2:$D$151=1)*(ROW($D$2:$D$151)-1),COUNTIF($D$2:$D$151,1)+1-ROW(D123))),\"\")","v":""},"",123,{"$f":"IFERROR(INDEX($B$2:$B$151,LARGE(($D$2:$D$151=2)*(ROW($D$2:$D$151)-1),COUNTIF($D$2:$D$151,2)+1-ROW(D123))),\"\")","v":""},"",123,{"$f":"IFERROR(INDEX($B$2:$B$151,LARGE(($D$2:$D$151=3)*(ROW($D$2:$D$151)-1),COUNTIF($D$2:$D$151,3)+1-ROW(D123))),\"\")","v":""},"",123,{"$f":"IFERROR(INDEX($B$2:$B$151,LARGE(($D$2:$D$151=4)*(ROW($D$2:$D$151)-1),COUNTIF($D$2:$D$151,4)+1-ROW(D123))),\"\")","v":""},"",123,{"$f":"IFERROR(INDEX($B$2:$B$151,LARGE(($D$2:$D$151=5)*(ROW($D$2:$D$151)-1),COUNTIF($D$2:$D$151,5)+1-ROW(D123))),\"\")","v":""},"",null,123,0,0,"-"]
[124,0,0,"-",null,124,{"$f":"IFERROR(INDEX($B$2:$B$151,LARGE(($D$2:$D$151=1)*(ROW($D$2:$D$151)-1),COUNTIF($D$2:$D$151,1)+1-ROW(D124))),\"\")","v":""},"",124,{"$f":"IFERROR(INDEX($B$2:$B$151,LARGE(($D$2:$D$151=2)*(ROW($D$2:$D$151)-1),COUNTIF($D$2:$D$151,2)+1-ROW(D124))),\"\")","v":""},"",124,{"$f":"IFERROR(INDEX($B$2:$B$151,LARGE(($D$2:$D$151=3)*(ROW($D$2:$D$151)-1),COUNTIF($D$2:$D$151,3)+1-ROW(D124))),\"\")","v":""},"",124,{"$f":"IFERROR(INDEX($B$2:$B$151,LARGE(($D$2:$D$151=4)*(ROW($D$2:$D$151)-1),COUNTIF($D$2:$D$151,4)+1-ROW(D124))),\"\")","v":""},"",124,{"$f":"IFERROR(INDEX($B$2:$B$151,LARGE(($D$2:$D$151=5)*(ROW($D$2:$D$151)-1),COUNTIF($D$2:$D$151,5)+1-ROW(D124))),\"\")","v":""},"",null,124,0,0,"-"]
[125,0,0,"-",null,125,{"$f":"IFERROR(INDEX($B$2:$B$151,LARGE(($D$2:$D$151=1)*(ROW($D$2:$D$151)-1),COUNTIF($D$2:$D$151,1)+1-ROW(D125))),\"\")","v":""},"",125,{"$f":"IFERROR(INDEX($B$2:$B$151,LARGE(($D$2:$D$151=2)*(ROW($D$2:$D$151)-1),COUNTIF($D$2:$D$151,2)+1-ROW(D125))),\"\")","v":""},"",125,{"$f":"IFERROR(INDEX($B$2:$B$151,LARGE(($D$2:$D$151=3)*(ROW($D$2:$D$151)-1),COUNTIF($D$2:$D$151,3)+1-ROW(D125))),\"\")","v":""},"",125,{"$f":"IFERROR(INDEX($B$2:$B$151,LARGE(($D$2:$D$151=4)*(ROW($D$2:$D$151)-1),COUNTIF($D$2:$D$151,4)+1-ROW(D125))),\"\")","v":""},"",125,{"$f":"IFERROR(INDEX($B$2:$B$151,LARGE(($D$2:$D$151=5)*(ROW($D$2:$D$151)-1),COUNTIF($D$2:$D$151,5)+1-ROW(D125))),\"\")","v":""},"",null,125,0,0,"-"]
[126,0,0,"-",null,126,{"$f":"IFERROR(INDEX($B$2:$B$151,LARGE(($D$2:$D$151=1)*(ROW($D$2:$D$151)-1),COUNTIF($D$2:$D$151,1)+1-ROW(D126))),\"\")","v":""},"",126,{"$f":"IFERROR(INDEX($B$2:$B$151,LARGE(($D$2:$D$151=2)*(ROW($D$2:$D$151)-1),COUNTIF($D$2:$D$151,2)+1-ROW(D126))),\"\")","v":""},"",126,{"$f":"IFERROR(INDEX($B$2:$B$151,LARGE(($D$2:$D$151=3)*(ROW($D$2:$D$151)-1),COUNTIF($D$2:$D$151,3)+1-ROW(D126))),\"\")","v":""},"",126,{"$f":"IFERROR(INDEX($B$2:$B$151,LARGE(($D$2:$D$151=4)*(ROW($D$2:$D$151)-1),COUNTIF($D$2:$D$151,4)+1-ROW(D126))),\"\")","v":""},"",126,{"$f":"IFERROR(INDEX($B$2:$B$151,LARGE(($D$2:$D$151=5)*(ROW($D$2:$D$151)-1),COUNTIF($D$2:$D$151,5)+1-ROW(D126))),\"\")","v":""},"",null,126,0,0,"-"]
[127,0,0,"-",null,127,{"$f":"IFERROR(INDEX($B$2:$B$151,LARGE(($D$2:$D$151=1)*(ROW($D$2:$D$151)-1),COUNTIF($D$2:$D$151,1)+1-ROW(D127))),\"\")","v":""},"",127,{"$f":"IFERROR(INDEX($B$2:$B$151,LARGE(($D$2:$D$151=2)*(ROW($D$2:$D$151)-1),COUNTIF($D$2:$D$151,2)+1-ROW(D127))),\"\")","v":""},"",127,{"$f":"IFERROR(INDEX($B$2:$B$151,LARGE(($D$2:$D$151=3)*(ROW($D$2:$D$151)-1),COUNTIF($D$2:$D$151,3)+1-ROW(D127))),\"\")","v":""},"",127,{"$f":"IFERROR(INDEX($B$2:$B$151,LARGE(($D$2:$D$151=4)*(ROW($D$2:$D$151)-1),COUNTIF($D$2:$D$151,4)+1-ROW(D127))),\"\")","v":""},"",127,{"$f":"IFERROR(INDEX($B$2:$B$151,LARGE(($D$2:$D$151=5)*(ROW($D$2:$D$151)-1),COUNTIF($D$2:$D$151,5)+1-ROW(D127))),\"\")","v":""},"",null,127,0,0,"-"]
[128,0,0,"-",null,128,{"$f":"IFERROR(INDEX($B$2:$B$151,LARGE(($D$2:$D$151=1)*(ROW($D$2:$D$151)-1),COUNTIF($D$2:$D$151,1)+1-ROW(D128))),\"\")","v":""},"",128,{"$f":"IFERROR(INDEX($B$2:$B$151,LARGE(($D$2:$D$151=2)*(ROW($D$2:$D$151)-1),COUNTIF($D$2:$D$151,2)+1-ROW(D128))),\"\")","v":""},"",128,{"$f":"IFERROR(INDEX($B$2:$B$151,LARGE(($D$2:$D$151=3)*(ROW($D$2:$D$151)-1),COUNTIF($D$2:$D$151,3)+1-ROW(D128))),\"\")","v":""},"",128,{"$f":"IFERROR(INDEX($B$2:$B$151,LARGE(($D$2:$D$151=4)*(ROW($D$2:$D$151)-1),COUNTIF($D$2:$D$151,4)+1-ROW(D128))),\"\")","v":""},"",128,{"$f":"IFERROR(INDEX($B$2:$B$151,LARGE(($D$2:$D$151=5)*(ROW($D$2:$D$151)-1),COUNTIF($D$2:$D$151,5)+1-ROW(D128))),\"\")","v":""},"",null,128,0,0,"-"]
[129,0,0,"-",null,129,{"$f":"IFERROR(INDEX($B$2:$B$151,LARGE(($D$2:$D$151=1)*(ROW($D$2:$D$151)-1),COUNTIF($D$2:$D$151,1)+1-ROW(D129))),\"\")","v":""},"",129,{"$f":"IFERROR(INDEX($B$2:$B$151,LARGE(($D$2:$D$151=2)*(ROW($D$2:$D$151)-1),COUNTIF($D$2:$D$151,2)+1-ROW(D129))),\"\")","v":""},"",129,{"$f":"IFERROR(INDEX($B$2:$B$151,LARGE(($D$2:$D$151=3)*(ROW($D$2:$D$151)-1),COUNTIF($D$2:$D$151,3)+1-ROW(D129))),\"\")","v":""},"",129,{"$f":"IFERROR(INDEX($B$2:$B$151,LARGE(($D$2:$D$151=4)*(ROW($D$2:$D$151)-1),COUNTIF($D$2:$D$151,4)+1-ROW(D129))),\"\")","v":""},"",129,{"$f":"IFERROR(INDEX($B$2:$B$151,LARGE(($D$2:$D$151=5)*(ROW($D$2:$D$151)-1),COUNTIF($D$2:$D$151,5)+1-ROW(D129))),\"\")","v":""},"",null,129,0,0,"-"]
[130,0,0,"-",null,130,{"$f":"IFERROR(INDEX($B$2:$B$151,LARGE(($D$2:$D$151=1)*(ROW($D$2:$D$151)-1),COUNTIF($D$2:$D$151,1)+1-ROW(D130))),\"\")","v":""},{"$f":"IF(G131=\"\",\"\",VLOOKUP(G131,$B$2:$C$151,2,0))","v":""},130,{"$f":"IFERROR(INDEX($B$2:$B$151,LARGE(($D$2:$D$151=2)*(ROW($D$2:$D$151)-1),COUNTIF($D$2:$D$151,2)+1-ROW(D130))),\"\")","v":""},{"$f":"IF(J131=\"\",\"\",VLOOKUP(J131,$B$2:$C$151,2,0))","v":""},130,{"$f":"IFERROR(INDEX($B$2:$B$151,LARGE(($D$2:$D$151=3)*(ROW($D$2:$D$151)-1),COUNTIF($D$2:$D$151,3)+1-ROW(D130))),\"\")","v":""},{"$f":"IF(M131=\"\",\"\",VLOOKUP(M131,$B$2:$C$151,2,0))","v":""},130,{"$f":"IFERROR(INDEX($B$2:$B$151,LARGE(($D$2:$D$151=4)*(ROW($D$2:$D$151)-1),COUNTIF($D$2:$D$151,4)+1-ROW(D130))),\"\")","v":""},{"$f":"IF(P131=\"\",\"\",VLOOKUP(P131,$B$2:$C$151,2,0))","v":""},130,{"$f":"IFERROR(INDEX($B$2:$B$151,LARGE(($D$2:$D$151=5)*(ROW($D$2:$D$151)-1),COUNTIF($D$2:$D$151,5)+1-ROW(D130))),\"\")","v":""},{"$f":"IF(S131=\"\",\"\",VLOOKUP(S131,$B$2:$C$151,2,0))","v":""},null,130,0,0,"-"]
[131,0,0,"-",null,131,{"$f":"IFERROR(INDEX($B$2:$B$151,LARGE(($D$2:$D$151=1)*(ROW($D$2:$D$151)-1),COUNTIF($D$2:$D$151,1)+1-ROW(D131))),\"\")","v":""},"",131,{"$f":"IFERROR(INDEX($B$2:$B$151,LARGE(($D$2:$D$151=2)*(ROW($D$2:$D$151)-1),COUNTIF($D$2:$D$151,2)+1-ROW(D131))),\"\")","v":""},"",131,{"$f":"IFERROR(INDEX($B$2:$B$151,LARGE(($D$2:$D$151=3)*(ROW($D$2:$D$151)-1),COUNTIF($D$2:$D$151,3)+1-ROW(D131))),\"\")","v":""},"",131,{"$f":"IFERROR(INDEX($B$2:$B$151,LARGE(($D$2:$D$151=4)*(ROW($D$2:$D$151)-1),COUNTIF($D$2:$D$151,4)+1-ROW(D131))),\"\")","v":""},"",131,{"$f":"IFERROR(INDEX($B$2:$B$151,LARGE(($D$2:$D$151=5)*(ROW($D$2:$D$151)-1),COUNTIF($D$2:$D$151,5)+1-ROW(D131))),\"\")","v":""},"",null,131,0,0,"-"]
[132,0,0,"-",null,132,{"$f":"IFERROR(INDEX($B$2:$B$151,LARGE(($D$2:$D$151=1)*(ROW($D$2:$D$151)-1),COUNTIF($D$2:$D$151,1)+1-ROW(D132))),\"\")","v":""},"",132,{"$f":"IFERROR(INDEX($B$2:$B$151,LARGE(($D$2:$D$151=2)*(ROW($D$2:$D$151)-1),COUNTIF($D$2:$D$151,2)+1-ROW(D132))),\"\")","v":""},"",132,{"$f":"IFERROR(INDEX($B$2:$B$151,LARGE(($D$2:$D$151=3)*(ROW($D$2:$D$151)-1),COUNTIF($D$2:$D$151,3)+1-ROW(D132))),\"\")","v":""},"",132,{"$f":"IFERROR(INDEX($B$2:$B$151,LARGE(($D$2:$D$151=4)*(ROW($D$2:$D$151)-1),COUNTIF($D$2:$D$151,4)+1-ROW(D132))),\"\")","v":""},"",132,{"$f":"IFERROR(INDEX($B$2:$B$151,LARGE(($D$2:$D$151=5)*(ROW($D$2:$D$151)-1),COUNTIF($D$2:$D$151,5)+1-ROW(D132))),\"\")","v":""},"",null,132,0,0,"-"]
[133,0,0,"-",null,133,{"$f":"IFERROR(INDEX($B$2:$B$151,LARGE(($D$2:$D$151=1)*(ROW($D$2:$D$151)-1),COUNTIF($D$2:$D$151,1)+1-ROW(D133))),\"\")","v":""},"",133,{"$f":"IFERROR(INDEX($B$2:$B$151,LARGE(($D$2:$D$151=2)*(ROW($D$2:$D$151)-1),COUNTIF($D$2:$D$151,2)+1-ROW(D133))),\"\")","v":""},"",133,{"$f":"IFERROR(INDEX($B$2:$B$151,LARGE(($D$2:$D$151=3)*(ROW($D$2:$D$151)-1),COUNTIF($D$2:$D$151,3)+1-ROW(D133))),\"\")","v":""},"",133,{"$f":"IFERROR(INDEX($B$2:$B$151,LARGE(($D$2:$D$151=4)*(ROW($D$2:$D$151)-1),COUNTIF($D$2:$D$151,4)+1-ROW(D133))),\"\")","v":""},"",133,{"$f":"IFERROR(INDEX($B$2:$B$151,LARGE(($D$2:$D$151=5)*(ROW($D$2:$D$151)-1),COUNTIF($D$2:$D$151,5)+1-ROW(D133))),\"\")","v":""},"",null,133,0,0,"-"]
[134,0,0,"-",null,134,{"$f":"IFERROR(INDEX($B$2:$B$151,LARGE(($D$2:$D$151=1)*(ROW($D$2:$D$151)-1),COUNTIF($D$2:$D$151,1)+1-ROW(D134))),\"\")","v":""},"",134,{"$f":"IFERROR(INDEX($B$2:$B$151,LARGE(($D$2:$D$151=2)*(ROW($D$2:$D$151)-1),COUNTIF($D$2:$D$151,2)+1-ROW(D134))),\"\")","v":""},"",134,{"$f":"IFERROR(INDEX($B$2:$B$151,LARGE(($D$2:$D$151=3)*(ROW($D$2:$D$151)-1),COUNTIF($D$2:$D$151,3)+1-ROW(D134))),\"\")","v":""},"",134,{"$f":"IFERROR(INDEX($B$2:$B$151,LARGE(($D$2:$D$151=4)*(ROW($D$2:$D$151)-1),COUNTIF($D$2:$D$151,4)+1-ROW(D134))),\"\")","v":""},"",134,{"$f":"IFERROR(INDEX($B$2:$B$151,LARGE(($D$2:$D$151=5)*(ROW($D$2:$D$151)-1),COUNTIF($D$2:$D$151,5)+1-ROW(D134))),\"\")","v":""},"",null,134,0,0,"-"]
[135,0,0,"-",null,135,{"$f":"IFERROR(INDEX($B$2:$B$151,LARGE(($D$2:$D$151=1)*(ROW($D$2:$D$151)-1),COUNTIF($D$2:$D$151,1)+1-ROW(D135))),\"\")","v":""},"",135,{"$f":"IFERROR(INDEX($B$2:$B$151,LARGE(($D$2:$D$151=2)*(ROW($D$2:$D$151)-1),COUNTIF($D$2:$D$151,2)+1-ROW(D135))),\"\")","v":""},"",135,{"$f":"IFERROR(INDEX($B$2:$B$151,LARGE(($D$2:$D$151=3)*(ROW($D$2:$D$151)-1),COUNTIF($D$2:$D$151,3)+1-ROW(D135))),\"\")","v":""},"",135,{"$f":"IFERROR(INDEX($B$2:$B$151,LARGE(($D$2:$D$151=4)*(ROW($D$2:$D$151)-1),COUNTIF($D$2:$D$151,4)+1-ROW(D135))),\"\")","v":""},"",135,{"$f":"IFERROR(INDEX($B$2:$B$151,LARGE(($D$2:$D$151=5)*(ROW($D$2:$D$151)-1),COUNTIF($D$2:$D$151,5)+1-ROW(D135))),\"\")","v":""},"",null,135,0,0,"-"]
[136,0,0,"-",null,136,{"$f":"IFERROR(INDEX($B$2:$B$151,LARGE(($D$2:$D$151=1)*(ROW($D$2:$D$151)-1),COUNTIF($D$2:$D$151,1)+1-ROW(D136))),\"\")","v":""},"",136,{"$f":"IFERROR(INDEX($B$2:$B$151,LARGE(($D$2:$D$151=2)*(ROW($D$2:$D$151)-1),COUNTIF($D$2:$D$151,2)+1-ROW(D136))),\"\")","v":""},"",136,{"$f":"IFERROR(INDEX($B$2:$B$151,LARGE(($D$2:$D$151=3)*(ROW($D$2:$D$151)-1),COUNTIF($D$2:$D$151,3)+1-ROW(D136))),\"\")","v":""},"",136,{"$f":"IFERROR(INDEX($B$2:$B$151,LARGE(($D$2:$D$151=4)*(ROW($D$2:$D$151)-1),COUNTIF($D$2:$D$151,4)+1-ROW(D136))),\"\")","v":""},"",136,{"$f":"IFERROR(INDEX($B$2:$B$151,LARGE(($D$2:$D$151=5)*(ROW($D$2:$D$151)-1),COUNTIF($D$2:$D$151,5)+1-ROW(D136))),\"\")","v":""},"",null,136,0,0,"-"]
[137,0,0,"-",null,137,{"$f":"IFERROR(INDEX($B$2:$B$151,LARGE(($D$2:$D$151=1)*(ROW($D$2:$D$151)-1),COUNTIF($D$2:$D$151,1)+1-ROW(D137))),\"\")","v":""},"",137,{"$f":"IFERROR(INDEX($B$2:$B$151,LARGE(($D$2:$D$151=2)*(ROW($D$2:$D$151)-1),COUNTIF($D$2:$D$151,2)+1-ROW(D137))),\"\")","v":""},"",137,{"$f":"IFERROR(INDEX($B$2:$B$151,LARGE(($D$2:$D$151=3)*(ROW($D$2:$D$151)-1),COUNTIF($D$2:$D$151,3)+1-ROW(D137))),\"\")","v":""},"",137,{"$f":"IFERROR(INDEX($B$2:$B$151,LARGE(($D$2:$D$151=4)*(ROW($D$2:$D$151)-1),COUNTIF($D$2:$D$151,4)+1-ROW(D137))),\"\")","v":""},"",137,{"$f":"IFERROR(INDEX($B$2:$B$151,LARGE(($D$2:$D$151=5)*(ROW($D$2:$D$151)-1),COUNTIF($D$2:$D$151,5)+1-ROW(D137))),\"\")","v":""},"",null,137,0,0,"-"]
[138,0,0,"-",null,138,{"$f":"IFERROR(INDEX($B$2:$B$151,LARGE(($D$2:$D$151=1)*(ROW($D$2:$D$151)-1),COUNTIF($D$2:$D$151,1)+1-ROW(D138))),\"\")","v":""},"",138,{"$f":"IFERROR(INDEX($B$2:$B$151,LARGE(($D$2:$D$151=2)*(ROW($D$2:$D$151)-1),COUNTIF($D$2:$D$151,2)+1-ROW(D138))),\"\")","v":""},"",138,{"$f":"IFERROR(INDEX($B$2:$B$151,LARGE(($D$2:$D$151=3)*(ROW($D$2:$D$151)-1),COUNTIF($D$2:$D$151,3)+1-ROW(D138))),\"\")","v":""},"",138,{"$f":"IFERROR(INDEX($B$2:$B$151,LARGE(($D$2:$D$151=4)*(ROW($D$2:$D$151)-1),COUNTIF($D$2:$D$151,4)+1-ROW(D138))),\"\")","v":""},"",138,{"$f":"IFERROR(INDEX($B$2:$B$151,LARGE(($D$2:$D$151=5)*(ROW($D$2:$D$151)-1),COUNTIF($D$2:$D$151,5)+1-ROW(D138))),\"\")","v":""},"",null,138,0,0,"-"]
[139,0,0,"-",null,139,{"$f":"IFERROR(INDEX($B$2:$B$151,LARGE(($D$2:$D$151=1)*(ROW($D$2:$D$151)-1),COUNTIF($D$2:$D$151,1)+1-ROW(D139))),\"\")","v":""},"",139,{"$f":"IFERROR(INDEX($B$2:$B$151,LARGE(($D$2:$D$151=2)*(ROW($D$2:$D$151)-1),COUNTIF($D$2:$D$151,2)+1-ROW(D139))),\"\")","v":""},"",139,{"$f":"IFERROR(INDEX($B$2:$B$151,LARGE(($D$2:$D$151=3)*(ROW($D$2:$D$151)-1),COUNTIF($D$2:$D$151,3)+1-ROW(D139))),\"\")","v":""},"",139,{"$f":"IFERROR(INDEX($B$2:$B$151,LARGE(($D$2:$D$151=4)*(ROW($D$2:$D$151)-1),COUNTIF($D$2:$D$151,4)+1-ROW(D139))),\"\")","v":""},"",139,{"$f":"IFERROR(INDEX($B$2:$B$151,LARGE(($D$2:$D$151=5)*(ROW($D$2:$D$151)-1),COUNTIF($D$2:$D$151,5)+1-ROW(D139))),\"\")","v":""},"",null,139,0,0,"-"]
[140,0,0,"-",null,140,{"$f":"IFERROR(INDEX($B$2:$B$151,LARGE(($D$2:$D$151=1)*(ROW($D$2:$D$151)-1),COUNTIF($D$2:$D$151,1)+1-ROW(D140))),\"\")","v":""},"",140,{"$f":"IFERROR(INDEX($B$2:$B$151,LARGE(($D$2:$D$151=2)*(ROW($D$2:$D$151)-1),COUNTIF($D$2:$D$151,2)+1-ROW(D140))),\"\")","v":""},"",140,{"$f":"IFERROR(INDEX($B$2:$B$151,LARGE(($D$2:$D$151=3)*(ROW($D$2:$D$151)-1),COUNTIF($D$2:$D$151,3)+1-ROW(D140))),\"\")","v":""},"",140,{"$f":"IFERROR(INDEX($B$2:$B$151,LARGE(($D$2:$D$151=4)*(ROW($D$2:$D$151)-1),COUNTIF($D$2:$D$151,4)+1-ROW(D140))),\"\")","v":""},"",140,{"$f":"IFERROR(INDEX($B$2:$B$151,LARGE(($D$2:$D$151=5)*(ROW($D$2:$D$151)-1),COUNTIF($D$2:$D$151,5)+1-ROW(D140))),\"\")","v":""},"",null,140,0,0,"-"]
[141,0,0,"-",null,141,{"$f":"IFERROR(INDEX($B$2:$B$151,LARGE(($D$2:$D$151=1)*(ROW($D$2:$D$151)-1),COUNTIF($D$2:$D$151,1)+1-ROW(D141))),\"\")","v":""},"",141,{"$f":"IFERROR(INDEX($B$2:$B$151,LARGE(($D$2:$D$151=2)*(ROW($D$2:$D$151)-1),COUNTIF($D$2:$D$151,2)+1-ROW(D141))),\"\")","v":""},"",141,{"$f":"IFERROR(INDEX($B$2:$B$151,LARGE(($D$2:$D$151=3)*(ROW($D$2:$D$151)-1),COUNTIF($D$2:$D$151,3)+1-ROW(D141))),\"\")","v":""},"",141,{"$f":"IFERROR(INDEX($B$2:$B$151,LARGE(($D$2:$D$151=4)*(ROW($D$2:$D$151)-1),COUNTIF($D$2:$D$151,4)+1-ROW(D141))),\"\")","v":""},"",141,{"$f":"IFERROR(INDEX($B$2:$B$151,LARGE(($D$2:$D$151=5)*(ROW($D$2:$D$151)-1),COUNTIF($D$2:$D$151,5)+1-ROW(D141))),\"\")","v":""},"",null,141,0,0,"-"]
[142,0,0,"-",null,142,{"$f":"IFERROR(INDEX($B$2:$B$151,LARGE(($D$2:$D$151=1)*(ROW($D$2:$D$151)-1),COUNTIF($D$2:$D$151,1)+1-ROW(D142))),\"\")","v":""},"",142,{"$f":"IFERROR(INDEX($B$2:$B$151,LARGE(($D$2:$D$151=2)*(ROW($D$2:$D$151)-1),COUNTIF($D$2:$D$151,2)+1-ROW(D142))),\"\")","v":""},"",142,{"$f":"IFERROR(INDEX($B$2:$B$151,LARGE(($D$2:$D$151=3)*(ROW($D$2:$D$151)-1),COUNTIF($D$2:$D$151,3)+1-ROW(D142))),\"\")","v":""},"",142,{"$f":"IFERROR(INDEX($B$2:$B$151,LARGE(($D$2:$D$151=4)*(ROW($D$2:$D$151)-1),COUNTIF($D$2:$D$151,4)+1-ROW(D142))),\"\")","v":""},"",142,{"$f":"IFERROR(INDEX($B$2:$B$151,LARGE(($D$2:$D$151=5)*(ROW($D$2:$D$151)-1),COUNTIF($D$2:$D$151,5)+1-ROW(D142))),\"\")","v":""},"",null,142,0,0,"-"]
[143,0,0,"-",null,143,{"$f":"IFERROR(INDEX($B$2:$B$151,LARGE(($D$2:$D$151=1)*(ROW($D$2:$D$151)-1),COUNTIF($D$2:$D$151,1)+1-ROW(D143))),\"\")","v":""},"",143,{"$f":"IFERROR(INDEX($B$2:$B$151,LARGE(($D$2:$D$151=2)*(ROW($D$2:$D$151)-1),COUNTIF($D$2:$D$151,2)+1-ROW(D143))),\"\")","v":""},"",143,{"$f":"IFERROR(INDEX($B$2:$B$151,LARGE(($D$2:$D$151=3)*(ROW($D$2:$D$151)-1),COUNTIF($D$2:$D$151,3)+1-ROW(D143))),\"\")","v":""},"",143,{"$f":"IFERROR(INDEX($B$2:$B$151,LARGE(($D$2:$D$151=4)*(ROW($D$2:$D$151)-1),COUNTIF($D$2:$D$151,4)+1-ROW(D143))),\"\")","v":""},"",143,{"$f":"IFERROR(INDEX($B$2:$B$151,LARGE(($D$2:$D$151=5)*(ROW($D$2:$D$151)-1),COUNTIF($D$2:$D$151,5)+1-ROW(D143))),\"\")","v":""},"",null,143,0,0,"-"]
[144,0,0,"-",null,144,{"$f":"IFERROR(INDEX($B$2:$B$151,LARGE(($D$2:$D$151=1)*(ROW($D$2:$D$151)-1),COUNTIF($D$2:$D$151,1)+1-ROW(D144))),\"\")","v":""},"",144,{"$f":"IFERROR(INDEX($B$2:$B$151,LARGE(($D$2:$D$151=2)*(ROW($D$2:$D$151)-1),COUNTIF($D$2:$D$151,2)+1-ROW(D144))),\"\")","v":""},"",144,{"$f":"IFERROR(INDEX($B$2:$B$151,LARGE(($D$2:$D$151=3)*(ROW($D$2:$D$151)-1),COUNTIF($D$2:$D$151,3)+1-ROW(D144))),\"\")","v":""},"",144,{"$f":"IFERROR(INDEX($B$2:$B$151,LARGE(($D$2:$D$151=4)*(ROW($D$2:$D$151)-1),COUNTIF($D$2:$D$151,4)+1-ROW(D144))),\"\")","v":""},"",144,{"$f":"IFERROR(INDEX($B$2:$B$151,LARGE(($D$2:$D$151=5)*(ROW($D$2:$D$151)-1),COUNTIF($D$2:$D$151,5)+1-ROW(D144))),\"\")","v":""},"",null,144,0,0,"-"]
[145,0,0,"-",null,145,{"$f":"IFERROR(INDEX($B$2:$B$151,LARGE(($D$2:$D$151=1)*(ROW($D$2:$D$151)-1),COUNTIF($D$2:$D$151,1)+1-ROW(D145))),\"\")","v":""},"",145,{"$f":"IFERROR(INDEX($B$2:$B$151,LARGE(($D$2:$D$151=2)*(ROW($D$2:$D$151)-1),COUNTIF($D$2:$D$151,2)+1-ROW(D145))),\"\")","v":""},"",145,{"$f":"IFERROR(INDEX($B$2:$B$151,LARGE(($D$2:$D$151=3)*(ROW($D$2:$D$151)-1),COUNTIF($D$2:$D$151,3)+1-ROW(D145))),\"\")","v":""},"",145,{"$f":"IFERROR(INDEX($B$2:$B$151,LARGE(($D$2:$D$151=4)*(ROW($D$2:$D$151)-1),COUNTIF($D$2:$D$151,4)+1-ROW(D145))),\"\")","v":""},"",145,{"$f":"IFERROR(INDEX($B$2:$B$151,LARGE(($D$2:$D$151=5)*(ROW($D$2:$D$151)-1),COUNTIF($D$2:$D$151,5)+1-ROW(D145))),\"\")","v":""},"",null,145,0,0,"-"]
[146,0,0,"-",null,146,{"$f":"IFERROR(INDEX($B$2:$B$151,LARGE(($D$2:$D$151=1)*(ROW($D$2:$D$151)-1),COUNTIF($D$2:$D$151,1)+1-ROW(D146))),\"\")","v":""},"",146,{"$f":"IFERROR(INDEX($B$2:$B$151,LARGE(($D$2:$D$151=2)*(ROW($D$2:$D$151)-1),COUNTIF($D$2:$D$151,2)+1-ROW(D146))),\"\")","v":""},"",146,{"$f":"IFERROR(INDEX($B$2:$B$151,LARGE(($D$2:$D$151=3)*(ROW($D$2:$D$151)-1),COUNTIF($D$2:$D$151,3)+1-ROW(D146))),\"\")","v":""},"",146,{"$f":"IFERROR(INDEX($B$2:$B$151,LARGE(($D$2:$D$151=4)*(ROW($D$2:$D$151)-1),COUNTIF($D$2:$D$151,4)+1-ROW(D146))),\"\")","v":""},"",146,{"$f":"IFERROR(INDEX($B$2:$B$151,LARGE(($D$2:$D$151=5)*(ROW($D$2:$D$151)-1),COUNTIF($D$2:$D$151,5)+1-ROW(D146))),\"\")","v":""},"",null,146,0,0,"-"]
[147,0,0,"-",null,147,{"$f":"IFERROR(INDEX($B$2:$B$151,LARGE(($D$2:$D$151=1)*(ROW($D$2:$D$151)-1),COUNTIF($D$2:$D$151,1)+1-ROW(D147))),\"\")","v":""},"",147,{"$f":"IFERROR(INDEX($B$2:$B$151,LARGE(($D$2:$D$151=2)*(ROW($D$2:$D$151)-1),COUNTIF($D$2:$D$151,2)+1-ROW(D147))),\"\")","v":""},"",147,{"$f":"IFERROR(INDEX($B$2:$B$151,LARGE(($D$2:$D$151=3)*(ROW($D$2:$D$151)-1),COUNTIF($D$2:$D$151,3)+1-ROW(D147))),\"\")","v":""},"",147,{"$f":"IFERROR(INDEX($B$2:$B$151,LARGE(($D$2:$D$151=4)*(ROW($D$2:$D$151)-1),COUNTIF($D$2:$D$151,4)+1-ROW(D147))),\"\")","v":""},"",147,{"$f":"IFERROR(INDEX($B$2:$B$151,LARGE(($D$2:$D$151=5)*(ROW($D$2:$D$151)-1),COUNTIF($D$2:$D$151,5)+1-ROW(D147))),\"\")","v":""},"",null,147,0,0,"-"]
[148,0,0,"-",null,148,{"$f":"IFERROR(INDEX($B$2:$B$151,LARGE(($D$2:$D$151=1)*(ROW($D$2:$D$151)-1),COUNTIF($D$2:$D$151,1)+1-ROW(D148))),\"\")","v":""},"",148,{"$f":"IFERROR(INDEX($B$2:$B$151,LARGE(($D$2:$D$151=2)*(ROW($D$2:$D$151)-1),COUNTIF($D$2:$D$151,2)+1-ROW(D148))),\"\")","v":""},"",148,{"$f":"IFERROR(INDEX($B$2:$B$151,LARGE(($D$2:$D$151=3)*(ROW($D$2:$D$151)-1),COUNTIF($D$2:$D$151,3)+1-ROW(D148))),\"\")","v":""},"",148,{"$f":"IFERROR(INDEX($B$2:$B$151,LARGE(($D$2:$D$151=4)*(ROW($D$2:$D$151)-1),COUNTIF($D$2:$D$151,4)+1-ROW(D148))),\"\")","v":""},"",148,{"$f":"IFERROR(INDEX($B$2:$B$151,LARGE(($D$2:$D$151=5)*(ROW($D$2:$D$151)-1),COUNTIF($D$2:$D$151,5)+1-ROW(D148))),\"\")","v":""},"",null,148,0,0,"-"]
[149,0,0,"-",null,149,{"$f":"IFERROR(INDEX($B$2:$B$151,LARGE(($D$2:$D$151=1)*(ROW($D$2:$D$151)-1),COUNTIF($D$2:$D$151,1)+1-ROW(D149))),\"\")","v":""},"",149,{"$f":"IFERROR(INDEX($B$2:$B$151,LARGE(($D$2:$D$151=2)*(ROW($D$2:$D$151)-1),COUNTIF($D$2:$D$151,2)+1-ROW(D149))),\"\")","v":""},"",149,{"$f":"IFERROR(INDEX($B$2:$B$151,LARGE(($D$2:$D$151=3)*(ROW($D$2:$D$151)-1),COUNTIF($D$2:$D$151,3)+1-ROW(D149))),\"\")","v":""},"",149,{"$f":"IFERROR(INDEX($B$2:$B$151,LARGE(($D$2:$D$151=4)*(ROW($D$2:$D$151)-1),COUNTIF($D$2:$D$151,4)+1-ROW(D149))),\"\")","v":""},"",149,{"$f":"IFERROR(INDEX($B$2:$B$151,LARGE(($D$2:$D$151=5)*(ROW($D$2:$D$151)-1),COUNTIF($D$2:$D$151,5)+1-ROW(D149))),\"\")","v":""},"",null,149,0,0,"-"]
[150,0,0,"-",null,150,{"$f":"IFERROR(INDEX($B$2:$B$151,LARGE(($D$2:$D$151=1)*(ROW($D$2:$D$151)-1),COUNTIF($D$2:$D$151,1)+1-ROW(D150))),\"\")","v":""},"",150,{"$f":"IFERROR(INDEX($B$2:$B$151,LARGE(($D$2:$D$151=2)*(ROW($D$2:$D$151)-1),COUNTIF($D$2:$D$151,2)+1-ROW(D150))),\"\")","v":""},"",150,{"$f":"IFERROR(INDEX($B$2:$B$151,LARGE(($D$2:$D$151=3)*(ROW($D$2:$D$151)-1),COUNTIF($D$2:$D$151,3)+1-ROW(D150))),\"\")","v":""},"",150,{"$f":"IFERROR(INDEX($B$2:$B$151,LARGE(($D$2:$D$151=4)*(ROW($D$2:$D$151)-1),COUNTIF($D$2:$D$151,4)+1-ROW(D150))),\"\")","v":""},"",150,{"$f":"IFERROR(INDEX($B$2:$B$151,LARGE(($D$2:$D$151=5)*(ROW($D$2:$D$151)-1),COUNTIF($D$2:$D$151,5)+1-ROW(D150))),\"\")","v":""},"",null,150,0,0,"-"]

{"sheet":"Urkunde individuell","index":5,"n_rows":39,"n_cols":25,"rows_kept":39,"cut":false,"hidden":false,"merged":[[32,2,32,15],[33,2,33,15],[34,2,34,15],[37,9,37,16],[38,11,40,16],[31,1,31,7],[11,20,12,22],[11,23,12,23],[13,20,14,22],[13,23,14,23],[15,20,16,22],[15,23,16,23],[31,8,31,16],[25,2,25,14],[26,2,26,15],[27,2,27,15],[28,2,28,15],[29,2,29,15],[30,2,30,15],[13,2,16,15],[8,22,9,24],[20,20,24,28],[25,23,25,25],[13,24,14,28],[11,24,12,28],[15,24,16,28]]}
[]
[]
[]
[]
[]
[]
[]
[]
[null,null,null,null,null,null,null,null,null,null,null,null,null,null,null,null,null,null,null,null,null,null,"Bitte nur die \"gelben\" Felder befüllen"]
[]
[]
[null,null,null,null,null,null,null,null,null,null,null,null,null,null,null,null,null,null,null,null,"Klasse",null,null,2,{"$f":"IF(X12=\"\",\"\",VLOOKUP(X12,Stammdaten!$I$4:$J$8,2,0))","v":"Klasse \"ohne Prellschlag\""}]
[]
[null,null,{"$f":"IF(Stammdaten!$C$8=\"\",\"\",Stammdaten!$C$8)","v":"Dat Groote Püüster Scheeten"},null,null,null,null,null,null,null,null,null,null,null,null,null,null,null,null,null,"Platz",null,null,6,{"$f":"IF(X14=\"\",\"\",IF(X12=1,VLOOKUP(X14,Daten!$F$2:$G$151,2,0),IF(X12=2,VLOOKUP(X14,Daten!$I$2:$J$151,2,0),IF(X12=3,VLOOKUP(X14,Daten!$L$2:$M$151,2,0),IF(X12=4,VLOOKUP(X14,Daten!$O$2:$P$151,2,0),IF(X12=5,VLOOKUP(X14,Daten!R2:S151,2,0)))))))","v":""}]
[]
[null,null,null,null,null,null,null,null,null,null,null,null,null,null,null,null,null,null,null,null,"Punkte",null,null,{"$f":"IF(X14=\"\",\"\",IF(X12=1,VLOOKUP(X14,Daten!$F$2:$H$151,3,0),IF(X12=2,VLOOKUP(X14,Daten!$I$2:$K$151,3,0),IF(X12=3,VLOOKUP(X14,Daten!$L$2:$N$151,3,0),IF(X12=4,VLOOKUP(X14,Daten!$O$2:$Q$151,3,0),IF(X12=5,VLOOKUP(X14,Daten!R2:T151,3,0)))))))","v":""},{"$f":"IF(X14=\"\",\"\",CONCATENATE(\"den \",X14,\". Platz in der\"))","v":"den 6. Platz in der"}]
[]
[]
[]
[]
[null,null,null,null,null,null,null,null,null,null,null,null,null,null,null,null,null,null,null,null,"Hier können Urkunden individuell ausgedruckt werden. \nDazu bitte die jeweilige KLASSE und den PLATZ eingeben."]
[]
[]
[]
[]
[null,null,null,null,null,null,null,null,null,null,null,null,null,null,null,null,null,null,null,null,null,null,null,"DRUCKEN"]
[]
[]
[]
[null,null,{"$f":"Stammdaten!$J$10","v":"Hiermit verleiht der SV-Soderstorf"}]
[null,null,{"$f":"IF(X12&X14=\"\",\"\",Y14)","v":""}]
[null,{"$f":"Y16","v":"den 6. Platz in der"},null,null,null,null,null,null,{"$f":"IF(X12=\"\",\"\",Y12)","v":"Klasse \"ohne Prellschlag\""}]
[null,null,"mit einer Trefferleistung von"]
[null,null,{"$f":"IF(X12=\"\",\"\",X16)","v":""}]
[null,null,"diese Urkunde"]
[]
[]
[null,null,null,null,null,null,null,null,null,{"$f":"IF(Stammdaten!$C$4=\"\",\"\",CONCATENATE(Stammdaten!$C$5,\", den\",\" \",TEXT(Stammdaten!$C$4,\"TT.MM.JJJJ\")))","v":""}]
[null,null,null,null,null,null,null,null,null,null,null,{"$f":"CONCATENATE(Stammdaten!$C$7)","v":"Rolf Marquardt"}]

{"sheet":"Ergebnis mit Klassen","index":6,"n_rows":167,"n_cols":9,"rows_kept":167,"cut":false,"hidden":false,"merged":[[20,2,20,5],[21,2,21,5],[22,2,22,5],[23,2,23,5],[16,2,16,5],[17,2,17,5],[18,2,18,5],[19,2,19,5],[14,0,15,7],[28,2,28,5],[29,2,29,5],[30,2,30,5],[31,2,31,5],[24,2,24,5],[25,2,25,5],[26,2,26,5],[27,2,27,5],[44,2,44,5],[40,2,40,5],[41,2,41,5],[42,2,42,5],[43,2,43,5],[36,2,36,5],[37,2,37,5],[38,2,38,5],[39,2,39,5],[47,2,47,5],[48,2,48,5],[49,2,49,5],[50,2,50,5],[51,2,51,5],[32,2,32,5],[33,2,33,5],[34,2,34,5],[35,2,35,5],[45,2,45,5],[46,2,46,5],[57,2,57,5],[58,2,58,5],[59,2,59,5],[60,2,60,5],[61,2,61,5],[52,2,52,5],[53,2,53,5],[54,2,54,5],[55,2,55,5],[56,2,56,5],[67,2,67,5],[68,2,68,5],[69,2,69,5],[70,2,70,5],[71,2,71,5],[62,2,62,5],[63,2,63,5],[64,2,64,5],[65,2,65,5],[66,2,66,5],[77,2,77,5],[78,2,78,5],[79,2,79,5],[80,2,80,5],[81,2,81,5],[72,2,72,5],[73,2,73,5],[74,2,74,5],[75,2,75,5],[76,2,76,5],[87,2,87,5],[88,2,88,5],[89,2,89,5],[90,2,90,5],[91,2,91,5],[82,2,82,5],[83,2,83,5],[84,2,84,5],[85,2,85,5],[86,2,86,5],[97,2,97,5],[98,2,98,5],[99,2,99,5],[100,2,100,5],[101,2,101,5],[92,2,92,5],[93,2,93,5],[94,2,94,5],[95,2,95,5],[96,2,96,5],[107,2,107,5],[108,2,108,5],[109,2,109,5],[110,2,110,5],[111,2,111,5],[102,2,102,5],[103,2,103,5],[104,2,104,5],[105,2,105,5],[106,2,106,5],[117,2,117,5],[118,2,118,5],[119,2,119,5],[120,2,120,5],[121,2,121,5],[112,2,112,5],[113,2,113,5],[114,2,114,5],[115,2,115,5],[116,2,116,5],[127,2,127,5],[128,2,128,5],[129,2,129,5],[130,2,130,5],[131,2,131,5],[122,2,122,5],[123,2,123,5],[124,2,124,5],[125,2,125,5],[126,2,126,5],[145,2,145,5],[146,2,146,5],[137,2,137,5],[138,2,138,5],[139,2,139,5],[140,2,140,5],[141,2,141,5],[132,2,132,5],[133,2,133,5],[134,2,134,5],[135,2,135,5],[136,2,136,5],[12,5,13,7],[162,2,162,5],[163,2,163,5],[164,2,164,5],[165,2,165,5],[166,2,166,5],[157,2,157,5],[158,2,158,5],[159,2,159,5],[160,2,160,5],[161,2,161,5],[152,2,152,5],[153,2,153,5],[154,2,154,5],[155,2,155,5],[156,2,156,5],[147,2,147,5],[148,2,148,5],[149,2,149,5],[150,2,150,5],[151,2,151,5],[142,2,142,5],[143,2,143,5],[144,2,144,5]]}
[]
[]
[]
[]
[]
[]
[]
[]
[]
[]
[]
[]
[null,null,null,null,null,"Ergebnis nach Klassen  "]
[]
[{"$f":"IF(Stammdaten!$C$4=\"\",\"\",CONCATENATE(TEXT(Stammdaten!$C$4,\"TT.MM.JJJJ\"),\" \",\"in \",Stammdaten!$C$5,\" \"\"\",Stammdaten!C8,\"\"\"\"))","v":""}]
[]
["Klasse:","Platz:","Name:",null,null,null,"Treffer:"]
[{"$f":"IF(Daten!D2=\"-\",\"\",Daten!D2)","v":""},{"$f":"IF(Daten!D2=\"-\",\"\",1)","v":""},{"$f":"IF(Daten!C2=0,\"\",Daten!B2)","v":""},null,null,null,{"$f":"IF(Daten!C2=0,\"\",Daten!C2)","v":""},{"$f":"IF(A18=1,\"von \"&Stammdaten!$N$4,IF(A18=2,\"von \"&Stammdaten!$N$5,IF(A18=3,\"von \"&Stammdaten!$N$6,IF(A18=4,\"von \"&Stammdaten!$N$7,IF(A18=5,\"von \"&Stammdaten!$N$8,\"\")))))","v":""},1]
[{"$f":"IF(Daten!D3=\"-\",\"\",Daten!D3)","v":""},{"$f":"IF(A19=\"\",\"\",IF(A19<>A18,1,B18+1))","v":""},{"$f":"IF(Daten!C3=0,\"\",Daten!B3)","v":""},null,null,null,{"$f":"IF(Daten!C3=0,\"\",Daten!C3)","v":""},{"$f":"IF(A19=1,\"von \"&Stammdaten!$N$4,IF(A19=2,\"von \"&Stammdaten!$N$5,IF(A19=3,\"von \"&Stammdaten!$N$6,IF(A19=4,\"von \"&Stammdaten!$N$7,IF(A19=5,\"von \"&Stammdaten!$N$8,\"\")))))","v":""},2]
[{"$f":"IF(Daten!D4=\"-\",\"\",Daten!D4)","v":""},{"$f":"IF(A20=\"\",\"\",IF(A20<>A19,1,B19+1))","v":""},{"$f":"IF(Daten!C4=0,\"\",Daten!B4)","v":""},null,null,null,{"$f":"IF(Daten!C4=0,\"\",Daten!C4)","v":""},{"$f":"IF(A20=1,\"von \"&Stammdaten!$N$4,IF(A20=2,\"von \"&Stammdaten!$N$5,IF(A20=3,\"von \"&Stammdaten!$N$6,IF(A20=4,\"von \"&Stammdaten!$N$7,IF(A20=5,\"von \"&Stammdaten!$N$8,\"\")))))","v":""},3]
[{"$f":"IF(Daten!D5=\"-\",\"\",Daten!D5)","v":""},"",{"$f":"IF(Daten!C5=0,\"\",Daten!B5)","v":""},null,null,null,{"$f":"IF(Daten!C5=0,\"\",Daten!C5)","v":""},{"$f":"IF(A21=1,\"von \"&Stammdaten!$N$4,IF(A21=2,\"von \"&Stammdaten!$N$5,IF(A21=3,\"von \"&Stammdaten!$N$6,IF(A21=4,\"von \"&Stammdaten!$N$7,IF(A21=5,\"von \"&Stammdaten!$N$8,\"\")))))","v":""},4]
[{"$f":"IF(Daten!D6=\"-\",\"\",Daten!D6)","v":""},"",{"$f":"IF(Daten!C6=0,\"\",Daten!B6)","v":""},null,null,null,{"$f":"IF(Daten!C6=0,\"\",Daten!C6)","v":""},{"$f":"IF(A22=1,\"von \"&Stammdaten!$N$4,IF(A22=2,\"von \"&Stammdaten!$N$5,IF(A22=3,\"von \"&Stammdaten!$N$6,IF(A22=4,\"von \"&Stammdaten!$N$7,IF(A22=5,\"von \"&Stammdaten!$N$8,\"\")))))","v":""},5]
[{"$f":"IF(Daten!D7=\"-\",\"\",Daten!D7)","v":""},"",{"$f":"IF(Daten!C7=0,\"\",Daten!B7)","v":""},null,null,null,{"$f":"IF(Daten!C7=0,\"\",Daten!C7)","v":""},{"$f":"IF(A23=1,\"von \"&Stammdaten!$N$4,IF(A23=2,\"von \"&Stammdaten!$N$5,IF(A23=3,\"von \"&Stammdaten!$N$6,IF(A23=4,\"von \"&Stammdaten!$N$7,IF(A23=5,\"von \"&Stammdaten!$N$8,\"\")))))","v":""},6]
[{"$f":"IF(Daten!D8=\"-\",\"\",Daten!D8)","v":""},"",{"$f":"IF(Daten!C8=0,\"\",Daten!B8)","v":""},null,null,null,{"$f":"IF(Daten!C8=0,\"\",Daten!C8)","v":""},{"$f":"IF(A24=1,\"von \"&Stammdaten!$N$4,IF(A24=2,\"von \"&Stammdaten!$N$5,IF(A24=3,\"von \"&Stammdaten!$N$6,IF(A24=4,\"von \"&Stammdaten!$N$7,IF(A24=5,\"von \"&Stammdaten!$N$8,\"\")))))","v":""},7]
[{"$f":"IF(Daten!D9=\"-\",\"\",Daten!D9)","v":""},"",{"$f":"IF(Daten!C9=0,\"\",Daten!B9)","v":""},null,null,null,{"$f":"IF(Daten!C9=0,\"\",Daten!C9)","v":""},{"$f":"IF(A25=1,\"von \"&Stammdaten!$N$4,IF(A25=2,\"von \"&Stammdaten!$N$5,IF(A25=3,\"von \"&Stammdaten!$N$6,IF(A25=4,\"von \"&Stammdaten!$N$7,IF(A25=5,\"von \"&Stammdaten!$N$8,\"\")))))","v":""},8]
[{"$f":"IF(Daten!D10=\"-\",\"\",Daten!D10)","v":""},"",{"$f":"IF(Daten!C10=0,\"\",Daten!B10)","v":""},null,null,null,{"$f":"IF(Daten!C10=0,\"\",Daten!C10)","v":""},{"$f":"IF(A26=1,\"von \"&Stammdaten!$N$4,IF(A26=2,\"von \"&Stammdaten!$N$5,IF(A26=3,\"von \"&Stammdaten!$N$6,IF(A26=4,\"von \"&Stammdaten!$N$7,IF(A26=5,\"von \"&Stammdaten!$N$8,\"\")))))","v":""},9]
[{"$f":"IF(Daten!D11=\"-\",\"\",Daten!D11)","v":""},"",{"$f":"IF(Daten!C11=0,\"\",Daten!B11)","v":""},null,null,null,{"$f":"IF(Daten!C11=0,\"\",Daten!C11)","v":""},{"$f":"IF(A27=1,\"von \"&Stammdaten!$N$4,IF(A27=2,\"von \"&Stammdaten!$N$5,IF(A27=3,\"von \"&Stammdaten!$N$6,IF(A27=4,\"von \"&Stammdaten!$N$7,IF(A27=5,\"von \"&Stammdaten!$N$8,\"\")))))","v":""},10]
[{"$f":"IF(Daten!D12=\"-\",\"\",Daten!D12)","v":""},"",{"$f":"IF(Daten!C12=0,\"\",Daten!B12)","v":""},null,null,null,{"$f":"IF(Daten!C12=0,\"\",Daten!C12)","v":""},{"$f":"IF(A28=1,\"von \"&Stammdaten!$N$4,IF(A28=2,\"von \"&Stammdaten!$N$5,IF(A28=3,\"von \"&Stammdaten!$N$6,IF(A28=4,\"von \"&Stammdaten!$N$7,IF(A28=5,\"von \"&Stammdaten!$N$8,\"\")))))","v":""},11]
[{"$f":"IF(Daten!D13=\"-\",\"\",Daten!D13)","v":""},"",{"$f":"IF(Daten!C13=0,\"\",Daten!B13)","v":""},null,null,null,{"$f":"IF(Daten!C13=0,\"\",Daten!C13)","v":""},{"$f":"IF(A29=1,\"von \"&Stammdaten!$N$4,IF(A29=2,\"von \"&Stammdaten!$N$5,IF(A29=3,\"von \"&Stammdaten!$N$6,IF(A29=4,\"von \"&Stammdaten!$N$7,IF(A29=5,\"von \"&Stammdaten!$N$8,\"\")))))","v":""},12]
[{"$f":"IF(Daten!D14=\"-\",\"\",Daten!D14)","v":""},"",{"$f":"IF(Daten!C14=0,\"\",Daten!B14)","v":""},null,null,null,{"$f":"IF(Daten!C14=0,\"\",Daten!C14)","v":""},{"$f":"IF(A30=1,\"von \"&Stammdaten!$N$4,IF(A30=2,\"von \"&Stammdaten!$N$5,IF(A30=3,\"von \"&Stammdaten!$N$6,IF(A30=4,\"von \"&Stammdaten!$N$7,IF(A30=5,\"von \"&Stammdaten!$N$8,\"\")))))","v":""},13]
[{"$f":"IF(Daten!D15=\"-\",\"\",Daten!D15)","v":""},"",{"$f":"IF(Daten!C15=0,\"\",Daten!B15)","v":""},null,null,null,{"$f":"IF(Daten!C15=0,\"\",Daten!C15)","v":""},{"$f":"IF(A31=1,\"von \"&Stammdaten!$N$4,IF(A31=2,\"von \"&Stammdaten!$N$5,IF(A31=3,\"von \"&Stammdaten!$N$6,IF(A31=4,\"von \"&Stammdaten!$N$7,IF(A31=5,\"von \"&Stammdaten!$N$8,\"\")))))","v":""},14]
[{"$f":"IF(Daten!D16=\"-\",\"\",Daten!D16)","v":""},"",{"$f":"IF(Daten!C16=0,\"\",Daten!B16)","v":""},null,null,null,{"$f":"IF(Daten!C16=0,\"\",Daten!C16)","v":""},{"$f":"IF(A32=1,\"von \"&Stammdaten!$N$4,IF(A32=2,\"von \"&Stammdaten!$N$5,IF(A32=3,\"von \"&Stammdaten!$N$6,IF(A32=4,\"von \"&Stammdaten!$N$7,IF(A32=5,\"von \"&Stammdaten!$N$8,\"\")))))","v":""},15]
[{"$f":"IF(Daten!D17=\"-\",\"\",Daten!D17)","v":""},"",{"$f":"IF(Daten!C17=0,\"\",Daten!B17)","v":""},null,null,null,{"$f":"IF(Daten!C17=0,\"\",Daten!C17)","v":""},{"$f":"IF(A33=1,\"von \"&Stammdaten!$N$4,IF(A33=2,\"von \"&Stammdaten!$N$5,IF(A33=3,\"von \"&Stammdaten!$N$6,IF(A33=4,\"von \"&Stammdaten!$N$7,IF(A33=5,\"von \"&Stammdaten!$N$8,\"\")))))","v":""},16]
[{"$f":"IF(Daten!D18=\"-\",\"\",Daten!D18)","v":""},"",{"$f":"IF(Daten!C18=0,\"\",Daten!B18)","v":""},null,null,null,{"$f":"IF(Daten!C18=0,\"\",Daten!C18)","v":""},{"$f":"IF(A34=1,\"von \"&Stammdaten!$N$4,IF(A34=2,\"von \"&Stammdaten!$N$5,IF(A34=3,\"von \"&Stammdaten!$N$6,IF(A34=4,\"von \"&Stammdaten!$N$7,IF(A34=5,\"von \"&Stammdaten!$N$8,\"\")))))","v":""},17]
[{"$f":"IF(Daten!D19=\"-\",\"\",Daten!D19)","v":""},"",{"$f":"IF(Daten!C19=0,\"\",Daten!B19)","v":""},null,null,null,{"$f":"IF(Daten!C19=0,\"\",Daten!C19)","v":""},{"$f":"IF(A35=1,\"von \"&Stammdaten!$N$4,IF(A35=2,\"von \"&Stammdaten!$N$5,IF(A35=3,\"von \"&Stammdaten!$N$6,IF(A35=4,\"von \"&Stammdaten!$N$7,IF(A35=5,\"von \"&Stammdaten!$N$8,\"\")))))","v":""},18]
[{"$f":"IF(Daten!D20=\"-\",\"\",Daten!D20)","v":""},"",{"$f":"IF(Daten!C20=0,\"\",Daten!B20)","v":""},null,null,null,{"$f":"IF(Daten!C20=0,\"\",Daten!C20)","v":""},{"$f":"IF(A36=1,\"von \"&Stammdaten!$N$4,IF(A36=2,\"von \"&Stammdaten!$N$5,IF(A36=3,\"von \"&Stammdaten!$N$6,IF(A36=4,\"von \"&Stammdaten!$N$7,IF(A36=5,\"von \"&Stammdaten!$N$8,\"\")))))","v":""},19]
[{"$f":"IF(Daten!D21=\"-\",\"\",Daten!D21)","v":""},"",{"$f":"IF(Daten!C21=0,\"\",Daten!B21)","v":""},null,null,null,{"$f":"IF(Daten!C21=0,\"\",Daten!C21)","v":""},{"$f":"IF(A37=1,\"von \"&Stammdaten!$N$4,IF(A37=2,\"von \"&Stammdaten!$N$5,IF(A37=3,\"von \"&Stammdaten!$N$6,IF(A37=4,\"von \"&Stammdaten!$N$7,IF(A37=5,\"von \"&Stammdaten!$N$8,\"\")))))","v":""},20]
[{"$f":"IF(Daten!D22=\"-\",\"\",Daten!D22)","v":""},"",{"$f":"IF(Daten!C22=0,\"\",Daten!B22)","v":""},null,null,null,{"$f":"IF(Daten!C22=0,\"\",Daten!C22)","v":""},{"$f":"IF(A38=1,\"von \"&Stammdaten!$N$4,IF(A38=2,\"von \"&Stammdaten!$N$5,IF(A38=3,\"von \"&Stammdaten!$N$6,IF(A38=4,\"von \"&Stammdaten!$N$7,IF(A38=5,\"von \"&Stammdaten!$N$8,\"\")))))","v":""},21]
[{"$f":"IF(Daten!D23=\"-\",\"\",Daten!D23)","v":""},"",{"$f":"IF(Daten!C23=0,\"\",Daten!B23)","v":""},null,null,null,{"$f":"IF(Daten!C23=0,\"\",Daten!C23)","v":""},{"$f":"IF(A39=1,\"von \"&Stammdaten!$N$4,IF(A39=2,\"von \"&Stammdaten!$N$5,IF(A39=3,\"von \"&Stammdaten!$N$6,IF(A39=4,\"von \"&Stammdaten!$N$7,IF(A39=5,\"von \"&Stammdaten!$N$8,\"\")))))","v":""},22]
[{"$f":"IF(Daten!D24=\"-\",\"\",Daten!D24)","v":""},"",{"$f":"IF(Daten!C24=0,\"\",Daten!B24)","v":""},null,null,null,{"$f":"IF(Daten!C24=0,\"\",Daten!C24)","v":""},{"$f":"IF(A40=1,\"von \"&Stammdaten!$N$4,IF(A40=2,\"von \"&Stammdaten!$N$5,IF(A40=3,\"von \"&Stammdaten!$N$6,IF(A40=4,\"von \"&Stammdaten!$N$7,IF(A40=5,\"von \"&Stammdaten!$N$8,\"\")))))","v":""},23]
[{"$f":"IF(Daten!D25=\"-\",\"\",Daten!D25)","v":""},"",{"$f":"IF(Daten!C25=0,\"\",Daten!B25)","v":""},null,null,null,{"$f":"IF(Daten!C25=0,\"\",Daten!C25)","v":""},{"$f":"IF(A41=1,\"von \"&Stammdaten!$N$4,IF(A41=2,\"von \"&Stammdaten!$N$5,IF(A41=3,\"von \"&Stammdaten!$N$6,IF(A41=4,\"von \"&Stammdaten!$N$7,IF(A41=5,\"von \"&Stammdaten!$N$8,\"\")))))","v":""},24]
[{"$f":"IF(Daten!D26=\"-\",\"\",Daten!D26)","v":""},"",{"$f":"IF(Daten!C26=0,\"\",Daten!B26)","v":""},null,null,null,{"$f":"IF(Daten!C26=0,\"\",Daten!C26)","v":""},{"$f":"IF(A42=1,\"von \"&Stammdaten!$N$4,IF(A42=2,\"von \"&Stammdaten!$N$5,IF(A42=3,\"von \"&Stammdaten!$N$6,IF(A42=4,\"von \"&Stammdaten!$N$7,IF(A42=5,\"von \"&Stammdaten!$N$8,\"\")))))","v":""},25]
[{"$f":"IF(Daten!D27=\"-\",\"\",Daten!D27)","v":""},"",{"$f":"IF(Daten!C27=0,\"\",Daten!B27)","v":""},null,null,null,{"$f":"IF(Daten!C27=0,\"\",Daten!C27)","v":""},{"$f":"IF(A43=1,\"von \"&Stammdaten!$N$4,IF(A43=2,\"von \"&Stammdaten!$N$5,IF(A43=3,\"von \"&Stammdaten!$N$6,IF(A43=4,\"von \"&Stammdaten!$N$7,IF(A43=5,\"von \"&Stammdaten!$N$8,\"\")))))","v":""},26]
[{"$f":"IF(Daten!D28=\"-\",\"\",Daten!D28)","v":""},"",{"$f":"IF(Daten!C28=0,\"\",Daten!B28)","v":""},null,null,null,{"$f":"IF(Daten!C28=0,\"\",Daten!C28)","v":""},{"$f":"IF(A44=1,\"von \"&Stammdaten!$N$4,IF(A44=2,\"von \"&Stammdaten!$N$5,IF(A44=3,\"von \"&Stammdaten!$N$6,IF(A44=4,\"von \"&Stammdaten!$N$7,IF(A44=5,\"von \"&Stammdaten!$N$8,\"\")))))","v":""},27]
[{"$f":"IF(Daten!D29=\"-\",\"\",Daten!D29)","v":""},"",{"$f":"IF(Daten!C29=0,\"\",Daten!B29)","v":""},null,null,null,{"$f":"IF(Daten!C29=0,\"\",Daten!C29)","v":""},{"$f":"IF(A45=1,\"von \"&Stammdaten!$N$4,IF(A45=2,\"von \"&Stammdaten!$N$5,IF(A45=3,\"von \"&Stammdaten!$N$6,IF(A45=4,\"von \"&Stammdaten!$N$7,IF(A45=5,\"von \"&Stammdaten!$N$8,\"\")))))","v":""},28]
[{"$f":"IF(Daten!D30=\"-\",\"\",Daten!D30)","v":""},"",{"$f":"IF(Daten!C30=0,\"\",Daten!B30)","v":""},null,null,null,{"$f":"IF(Daten!C30=0,\"\",Daten!C30)","v":""},{"$f":"IF(A46=1,\"von \"&Stammdaten!$N$4,IF(A46=2,\"von \"&Stammdaten!$N$5,IF(A46=3,\"von \"&Stammdaten!$N$6,IF(A46=4,\"von \"&Stammdaten!$N$7,IF(A46=5,\"von \"&Stammdaten!$N$8,\"\")))))","v":""},29]
[{"$f":"IF(Daten!D31=\"-\",\"\",Daten!D31)","v":""},"",{"$f":"IF(Daten!C31=0,\"\",Daten!B31)","v":""},null,null,null,{"$f":"IF(Daten!C31=0,\"\",Daten!C31)","v":""},{"$f":"IF(A47=1,\"von \"&Stammdaten!$N$4,IF(A47=2,\"von \"&Stammdaten!$N$5,IF(A47=3,\"von \"&Stammdaten!$N$6,IF(A47=4,\"von \"&Stammdaten!$N$7,IF(A47=5,\"von \"&Stammdaten!$N$8,\"\")))))","v":""},30]
[{"$f":"IF(Daten!D32=\"-\",\"\",Daten!D32)","v":""},"",{"$f":"IF(Daten!C32=0,\"\",Daten!B32)","v":""},null,null,null,{"$f":"IF(Daten!C32=0,\"\",Daten!C32)","v":""},{"$f":"IF(A48=1,\"von \"&Stammdaten!$N$4,IF(A48=2,\"von \"&Stammdaten!$N$5,IF(A48=3,\"von \"&Stammdaten!$N$6,IF(A48=4,\"von \"&Stammdaten!$N$7,IF(A48=5,\"von \"&Stammdaten!$N$8,\"\")))))","v":""},31]
[{"$f":"IF(Daten!D33=\"-\",\"\",Daten!D33)","v":""},"",{"$f":"IF(Daten!C33=0,\"\",Daten!B33)","v":""},null,null,null,{"$f":"IF(Daten!C33=0,\"\",Daten!C33)","v":""},{"$f":"IF(A49=1,\"von \"&Stammdaten!$N$4,IF(A49=2,\"von \"&Stammdaten!$N$5,IF(A49=3,\"von \"&Stammdaten!$N$6,IF(A49=4,\"von \"&Stammdaten!$N$7,IF(A49=5,\"von \"&Stammdaten!$N$8,\"\")))))","v":""},32]
[{"$f":"IF(Daten!D34=\"-\",\"\",Daten!D34)","v":""},"",{"$f":"IF(Daten!C34=0,\"\",Daten!B34)","v":""},null,null,null,{"$f":"IF(Daten!C34=0,\"\",Daten!C34)","v":""},{"$f":"IF(A50=1,\"von \"&Stammdaten!$N$4,IF(A50=2,\"von \"&Stammdaten!$N$5,IF(A50=3,\"von \"&Stammdaten!$N$6,IF(A50=4,\"von \"&Stammdaten!$N$7,IF(A50=5,\"von \"&Stammdaten!$N$8,\"\")))))","v":""},33]
[{"$f":"IF(Daten!D35=\"-\",\"\",Daten!D35)","v":""},"",{"$f":"IF(Daten!C35=0,\"\",Daten!B35)","v":""},null,null,null,{"$f":"IF(Daten!C35=0,\"\",Daten!C35)","v":""},{"$f":"IF(A51=1,\"von \"&Stammdaten!$N$4,IF(A51=2,\"von \"&Stammdaten!$N$5,IF(A51=3,\"von \"&Stammdaten!$N$6,IF(A51=4,\"von \"&Stammdaten!$N$7,IF(A51=5,\"von \"&Stammdaten!$N$8,\"\")))))","v":""},34]
[{"$f":"IF(Daten!D36=\"-\",\"\",Daten!D36)","v":""},"",{"$f":"IF(Daten!C36=0,\"\",Daten!B36)","v":""},null,null,null,{"$f":"IF(Daten!C36=0,\"\",Daten!C36)","v":""},{"$f":"IF(A52=1,\"von \"&Stammdaten!$N$4,IF(A52=2,\"von \"&Stammdaten!$N$5,IF(A52=3,\"von \"&Stammdaten!$N$6,IF(A52=4,\"von \"&Stammdaten!$N$7,IF(A52=5,\"von \"&Stammdaten!$N$8,\"\")))))","v":""},35]
[{"$f":"IF(Daten!D37=\"-\",\"\",Daten!D37)","v":""},"",{"$f":"IF(Daten!C37=0,\"\",Daten!B37)","v":""},null,null,null,{"$f":"IF(Daten!C37=0,\"\",Daten!C37)","v":""},{"$f":"IF(A53=1,\"von \"&Stammdaten!$N$4,IF(A53=2,\"von \"&Stammdaten!$N$5,IF(A53=3,\"von \"&Stammdaten!$N$6,IF(A53=4,\"von \"&Stammdaten!$N$7,IF(A53=5,\"von \"&Stammdaten!$N$8,\"\")))))","v":""},36]
[{"$f":"IF(Daten!D38=\"-\",\"\",Daten!D38)","v":""},"",{"$f":"IF(Daten!C38=0,\"\",Daten!B38)","v":""},null,null,null,{"$f":"IF(Daten!C38=0,\"\",Daten!C38)","v":""},{"$f":"IF(A54=1,\"von \"&Stammdaten!$N$4,IF(A54=2,\"von \"&Stammdaten!$N$5,IF(A54=3,\"von \"&Stammdaten!$N$6,IF(A54=4,\"von \"&Stammdaten!$N$7,IF(A54=5,\"von \"&Stammdaten!$N$8,\"\")))))","v":""},37]
[{"$f":"IF(Daten!D39=\"-\",\"\",Daten!D39)","v":""},"",{"$f":"IF(Daten!C39=0,\"\",Daten!B39)","v":""},null,null,null,{"$f":"IF(Daten!C39=0,\"\",Daten!C39)","v":""},{"$f":"IF(A55=1,\"von \"&Stammdaten!$N$4,IF(A55=2,\"von \"&Stammdaten!$N$5,IF(A55=3,\"von \"&Stammdaten!$N$6,IF(A55=4,\"von \"&Stammdaten!$N$7,IF(A55=5,\"von \"&Stammdaten!$N$8,\"\")))))","v":""},38]
[{"$f":"IF(Daten!D40=\"-\",\"\",Daten!D40)","v":""},"",{"$f":"IF(Daten!C40=0,\"\",Daten!B40)","v":""},null,null,null,{"$f":"IF(Daten!C40=0,\"\",Daten!C40)","v":""},{"$f":"IF(A56=1,\"von \"&Stammdaten!$N$4,IF(A56=2,\"von \"&Stammdaten!$N$5,IF(A56=3,\"von \"&Stammdaten!$N$6,IF(A56=4,\"von \"&Stammdaten!$N$7,IF(A56=5,\"von \"&Stammdaten!$N$8,\"\")))))","v":""},39]
[{"$f":"IF(Daten!D41=\"-\",\"\",Daten!D41)","v":""},"",{"$f":"IF(Daten!C41=0,\"\",Daten!B41)","v":""},null,null,null,{"$f":"IF(Daten!C41=0,\"\",Daten!C41)","v":""},{"$f":"IF(A57=1,\"von \"&Stammdaten!$N$4,IF(A57=2,\"von \"&Stammdaten!$N$5,IF(A57=3,\"von \"&Stammdaten!$N$6,IF(A57=4,\"von \"&Stammdaten!$N$7,IF(A57=5,\"von \"&Stammdaten!$N$8,\"\")))))","v":""},40]
[{"$f":"IF(Daten!D42=\"-\",\"\",Daten!D42)","v":""},"",{"$f":"IF(Daten!C42=0,\"\",Daten!B42)","v":""},null,null,null,{"$f":"IF(Daten!C42=0,\"\",Daten!C42)","v":""},{"$f":"IF(A58=1,\"von \"&Stammdaten!$N$4,IF(A58=2,\"von \"&Stammdaten!$N$5,IF(A58=3,\"von \"&Stammdaten!$N$6,IF(A58=4,\"von \"&Stammdaten!$N$7,IF(A58=5,\"von \"&Stammdaten!$N$8,\"\")))))","v":""},41]
[{"$f":"IF(Daten!D43=\"-\",\"\",Daten!D43)","v":""},"",{"$f":"IF(Daten!C43=0,\"\",Daten!B43)","v":""},null,null,null,{"$f":"IF(Daten!C43=0,\"\",Daten!C43)","v":""},{"$f":"IF(A59=1,\"von \"&Stammdaten!$N$4,IF(A59=2,\"von \"&Stammdaten!$N$5,IF(A59=3,\"von \"&Stammdaten!$N$6,IF(A59=4,\"von \"&Stammdaten!$N$7,IF(A59=5,\"von \"&Stammdaten!$N$8,\"\")))))","v":""},42]
[{"$f":"IF(Daten!D44=\"-\",\"\",Daten!D44)","v":""},"",{"$f":"IF(Daten!C44=0,\"\",Daten!B44)","v":""},null,null,null,{"$f":"IF(Daten!C44=0,\"\",Daten!C44)","v":""},{"$f":"IF(A60=1,\"von \"&Stammdaten!$N$4,IF(A60=2,\"von \"&Stammdaten!$N$5,IF(A60=3,\"von \"&Stammdaten!$N$6,IF(A60=4,\"von \"&Stammdaten!$N$7,IF(A60=5,\"von \"&Stammdaten!$N$8,\"\")))))","v":""},43]
[{"$f":"IF(Daten!D45=\"-\",\"\",Daten!D45)","v":""},"",{"$f":"IF(Daten!C45=0,\"\",Daten!B45)","v":""},null,null,null,{"$f":"IF(Daten!C45=0,\"\",Daten!C45)","v":""},{"$f":"IF(A61=1,\"von \"&Stammdaten!$N$4,IF(A61=2,\"von \"&Stammdaten!$N$5,IF(A61=3,\"von \"&Stammdaten!$N$6,IF(A61=4,\"von \"&Stammdaten!$N$7,IF(A61=5,\"von \"&Stammdaten!$N$8,\"\")))))","v":""},44]
[{"$f":"IF(Daten!D46=\"-\",\"\",Daten!D46)","v":""},"",{"$f":"IF(Daten!C46=0,\"\",Daten!B46)","v":""},null,null,null,{"$f":"IF(Daten!C46=0,\"\",Daten!C46)","v":""},{"$f":"IF(A62=1,\"von \"&Stammdaten!$N$4,IF(A62=2,\"von \"&Stammdaten!$N$5,IF(A62=3,\"von \"&Stammdaten!$N$6,IF(A62=4,\"von \"&Stammdaten!$N$7,IF(A62=5,\"von \"&Stammdaten!$N$8,\"\")))))","v":""},45]
[{"$f":"IF(Daten!D47=\"-\",\"\",Daten!D47)","v":""},"",{"$f":"IF(Daten!C47=0,\"\",Daten!B47)","v":""},null,null,null,{"$f":"IF(Daten!C47=0,\"\",Daten!C47)","v":""},{"$f":"IF(A63=1,\"von \"&Stammdaten!$N$4,IF(A63=2,\"von \"&Stammdaten!$N$5,IF(A63=3,\"von \"&Stammdaten!$N$6,IF(A63=4,\"von \"&Stammdaten!$N$7,IF(A63=5,\"von \"&Stammdaten!$N$8,\"\")))))","v":""},46]
[{"$f":"IF(Daten!D48=\"-\",\"\",Daten!D48)","v":""},"",{"$f":"IF(Daten!C48=0,\"\",Daten!B48)","v":""},null,null,null,{"$f":"IF(Daten!C48=0,\"\",Daten!C48)","v":""},{"$f":"IF(A64=1,\"von \"&Stammdaten!$N$4,IF(A64=2,\"von \"&Stammdaten!$N$5,IF(A64=3,\"von \"&Stammdaten!$N$6,IF(A64=4,\"von \"&Stammdaten!$N$7,IF(A64=5,\"von \"&Stammdaten!$N$8,\"\")))))","v":""},47]
[{"$f":"IF(Daten!D49=\"-\",\"\",Daten!D49)","v":""},"",{"$f":"IF(Daten!C49=0,\"\",Daten!B49)","v":""},null,null,null,{"$f":"IF(Daten!C49=0,\"\",Daten!C49)","v":""},{"$f":"IF(A65=1,\"von \"&Stammdaten!$N$4,IF(A65=2,\"von \"&Stammdaten!$N$5,IF(A65=3,\"von \"&Stammdaten!$N$6,IF(A65=4,\"von \"&Stammdaten!$N$7,IF(A65=5,\"von \"&Stammdaten!$N$8,\"\")))))","v":""},48]
[{"$f":"IF(Daten!D50=\"-\",\"\",Daten!D50)","v":""},"",{"$f":"IF(Daten!C50=0,\"\",Daten!B50)","v":""},null,null,null,{"$f":"IF(Daten!C50=0,\"\",Daten!C50)","v":""},{"$f":"IF(A66=1,\"von \"&Stammdaten!$N$4,IF(A66=2,\"von \"&Stammdaten!$N$5,IF(A66=3,\"von \"&Stammdaten!$N$6,IF(A66=4,\"von \"&Stammdaten!$N$7,IF(A66=5,\"von \"&Stammdaten!$N$8,\"\")))))","v":""},49]
[{"$f":"IF(Daten!D51=\"-\",\"\",Daten!D51)","v":""},"",{"$f":"IF(Daten!C51=0,\"\",Daten!B51)","v":""},null,null,null,{"$f":"IF(Daten!C51=0,\"\",Daten!C51)","v":""},{"$f":"IF(A67=1,\"von \"&Stammdaten!$N$4,IF(A67=2,\"von \"&Stammdaten!$N$5,IF(A67=3,\"von \"&Stammdaten!$N$6,IF(A67=4,\"von \"&Stammdaten!$N$7,IF(A67=5,\"von \"&Stammdaten!$N$8,\"\")))))","v":""},50]
[{"$f":"IF(Daten!D52=\"-\",\"\",Daten!D52)","v":""},"",{"$f":"IF(Daten!C52=0,\"\",Daten!B52)","v":""},null,null,null,{"$f":"IF(Daten!C52=0,\"\",Daten!C52)","v":""},{"$f":"IF(A68=1,\"von \"&Stammdaten!$N$4,IF(A68=2,\"von \"&Stammdaten!$N$5,IF(A68=3,\"von \"&Stammdaten!$N$6,IF(A68=4,\"von \"&Stammdaten!$N$7,IF(A68=5,\"von \"&Stammdaten!$N$8,\"\")))))","v":""},51]
[{"$f":"IF(Daten!D53=\"-\",\"\",Daten!D53)","v":""},"",{"$f":"IF(Daten!C53=0,\"\",Daten!B53)","v":""},null,null,null,{"$f":"IF(Daten!C53=0,\"\",Daten!C53)","v":""},{"$f":"IF(A69=1,\"von \"&Stammdaten!$N$4,IF(A69=2,\"von \"&Stammdaten!$N$5,IF(A69=3,\"von \"&Stammdaten!$N$6,IF(A69=4,\"von \"&Stammdaten!$N$7,IF(A69=5,\"von \"&Stammdaten!$N$8,\"\")))))","v":""},52]
[{"$f":"IF(Daten!D54=\"-\",\"\",Daten!D54)","v":""},"",{"$f":"IF(Daten!C54=0,\"\",Daten!B54)","v":""},null,null,null,{"$f":"IF(Daten!C54=0,\"\",Daten!C54)","v":""},{"$f":"IF(A70=1,\"von \"&Stammdaten!$N$4,IF(A70=2,\"von \"&Stammdaten!$N$5,IF(A70=3,\"von \"&Stammdaten!$N$6,IF(A70=4,\"von \"&Stammdaten!$N$7,IF(A70=5,\"von \"&Stammdaten!$N$8,\"\")))))","v":""},53]
[{"$f":"IF(Daten!D55=\"-\",\"\",Daten!D55)","v":""},"",{"$f":"IF(Daten!C55=0,\"\",Daten!B55)","v":""},null,null,null,{"$f":"IF(Daten!C55=0,\"\",Daten!C55)","v":""},{"$f":"IF(A71=1,\"von \"&Stammdaten!$N$4,IF(A71=2,\"von \"&Stammdaten!$N$5,IF(A71=3,\"von \"&Stammdaten!$N$6,IF(A71=4,\"von \"&Stammdaten!$N$7,IF(A71=5,\"von \"&Stammdaten!$N$8,\"\")))))","v":""},54]
[{"$f":"IF(Daten!D56=\"-\",\"\",Daten!D56)","v":""},"",{"$f":"IF(Daten!C56=0,\"\",Daten!B56)","v":""},null,null,null,{"$f":"IF(Daten!C56=0,\"\",Daten!C56)","v":""},{"$f":"IF(A72=1,\"von \"&Stammdaten!$N$4,IF(A72=2,\"von \"&Stammdaten!$N$5,IF(A72=3,\"von \"&Stammdaten!$N$6,IF(A72=4,\"von \"&Stammdaten!$N$7,IF(A72=5,\"von \"&Stammdaten!$N$8,\"\")))))","v":""},55]
[{"$f":"IF(Daten!D57=\"-\",\"\",Daten!D57)","v":""},"",{"$f":"IF(Daten!C57=0,\"\",Daten!B57)","v":""},null,null,null,{"$f":"IF(Daten!C57=0,\"\",Daten!C57)","v":""},{"$f":"IF(A73=1,\"von \"&Stammdaten!$N$4,IF(A73=2,\"von \"&Stammdaten!$N$5,IF(A73=3,\"von \"&Stammdaten!$N$6,IF(A73=4,\"von \"&Stammdaten!$N$7,IF(A73=5,\"von \"&Stammdaten!$N$8,\"\")))))","v":""},56]
[{"$f":"IF(Daten!D58=\"-\",\"\",Daten!D58)","v":""},"",{"$f":"IF(Daten!C58=0,\"\",Daten!B58)","v":""},null,null,null,{"$f":"IF(Daten!C58=0,\"\",Daten!C58)","v":""},{"$f":"IF(A74=1,\"von \"&Stammdaten!$N$4,IF(A74=2,\"von \"&Stammdaten!$N$5,IF(A74=3,\"von \"&Stammdaten!$N$6,IF(A74=4,\"von \"&Stammdaten!$N$7,IF(A74=5,\"von \"&Stammdaten!$N$8,\"\")))))","v":""},57]
[{"$f":"IF(Daten!D59=\"-\",\"\",Daten!D59)","v":""},"",{"$f":"IF(Daten!C59=0,\"\",Daten!B59)","v":""},null,null,null,{"$f":"IF(Daten!C59=0,\"\",Daten!C59)","v":""},{"$f":"IF(A75=1,\"von \"&Stammdaten!$N$4,IF(A75=2,\"von \"&Stammdaten!$N$5,IF(A75=3,\"von \"&Stammdaten!$N$6,IF(A75=4,\"von \"&Stammdaten!$N$7,IF(A75=5,\"von \"&Stammdaten!$N$8,\"\")))))","v":""},58]
[{"$f":"IF(Daten!D60=\"-\",\"\",Daten!D60)","v":""},"",{"$f":"IF(Daten!C60=0,\"\",Daten!B60)","v":""},null,null,null,{"$f":"IF(Daten!C60=0,\"\",Daten!C60)","v":""},{"$f":"IF(A76=1,\"von \"&Stammdaten!$N$4,IF(A76=2,\"von \"&Stammdaten!$N$5,IF(A76=3,\"von \"&Stammdaten!$N$6,IF(A76=4,\"von \"&Stammdaten!$N$7,IF(A76=5,\"von \"&Stammdaten!$N$8,\"\")))))","v":""},59]
[{"$f":"IF(Daten!D61=\"-\",\"\",Daten!D61)","v":""},"",{"$f":"IF(Daten!C61=0,\"\",Daten!B61)","v":""},null,null,null,{"$f":"IF(Daten!C61=0,\"\",Daten!C61)","v":""},{"$f":"IF(A77=1,\"von \"&Stammdaten!$N$4,IF(A77=2,\"von \"&Stammdaten!$N$5,IF(A77=3,\"von \"&Stammdaten!$N$6,IF(A77=4,\"von \"&Stammdaten!$N$7,IF(A77=5,\"von \"&Stammdaten!$N$8,\"\")))))","v":""},60]
[{"$f":"IF(Daten!D62=\"-\",\"\",Daten!D62)","v":""},"",{"$f":"IF(Daten!C62=0,\"\",Daten!B62)","v":""},null,null,null,{"$f":"IF(Daten!C62=0,\"\",Daten!C62)","v":""},{"$f":"IF(A78=1,\"von \"&Stammdaten!$N$4,IF(A78=2,\"von \"&Stammdaten!$N$5,IF(A78=3,\"von \"&Stammdaten!$N$6,IF(A78=4,\"von \"&Stammdaten!$N$7,IF(A78=5,\"von \"&Stammdaten!$N$8,\"\")))))","v":""},61]
[{"$f":"IF(Daten!D63=\"-\",\"\",Daten!D63)","v":""},"",{"$f":"IF(Daten!C63=0,\"\",Daten!B63)","v":""},null,null,null,{"$f":"IF(Daten!C63=0,\"\",Daten!C63)","v":""},{"$f":"IF(A79=1,\"von \"&Stammdaten!$N$4,IF(A79=2,\"von \"&Stammdaten!$N$5,IF(A79=3,\"von \"&Stammdaten!$N$6,IF(A79=4,\"von \"&Stammdaten!$N$7,IF(A79=5,\"von \"&Stammdaten!$N$8,\"\")))))","v":""},62]
[{"$f":"IF(Daten!D64=\"-\",\"\",Daten!D64)","v":""},"",{"$f":"IF(Daten!C64=0,\"\",Daten!B64)","v":""},null,null,null,{"$f":"IF(Daten!C64=0,\"\",Daten!C64)","v":""},{"$f":"IF(A80=1,\"von \"&Stammdaten!$N$4,IF(A80=2,\"von \"&Stammdaten!$N$5,IF(A80=3,\"von \"&Stammdaten!$N$6,IF(A80=4,\"von \"&Stammdaten!$N$7,IF(A80=5,\"von \"&Stammdaten!$N$8,\"\")))))","v":""},63]
[{"$f":"IF(Daten!D65=\"-\",\"\",Daten!D65)","v":""},"",{"$f":"IF(Daten!C65=0,\"\",Daten!B65)","v":""},null,null,null,{"$f":"IF(Daten!C65=0,\"\",Daten!C65)","v":""},{"$f":"IF(A81=1,\"von \"&Stammdaten!$N$4,IF(A81=2,\"von \"&Stammdaten!$N$5,IF(A81=3,\"von \"&Stammdaten!$N$6,IF(A81=4,\"von \"&Stammdaten!$N$7,IF(A81=5,\"von \"&Stammdaten!$N$8,\"\")))))","v":""},64]
[{"$f":"IF(Daten!D66=\"-\",\"\",Daten!D66)","v":""},"",{"$f":"IF(Daten!C66=0,\"\",Daten!B66)","v":""},null,null,null,{"$f":"IF(Daten!C66=0,\"\",Daten!C66)","v":""},{"$f":"IF(A82=1,\"von \"&Stammdaten!$N$4,IF(A82=2,\"von \"&Stammdaten!$N$5,IF(A82=3,\"von \"&Stammdaten!$N$6,IF(A82=4,\"von \"&Stammdaten!$N$7,IF(A82=5,\"von \"&Stammdaten!$N$8,\"\")))))","v":""},65]
[{"$f":"IF(Daten!D67=\"-\",\"\",Daten!D67)","v":""},"",{"$f":"IF(Daten!C67=0,\"\",Daten!B67)","v":""},null,null,null,{"$f":"IF(Daten!C67=0,\"\",Daten!C67)","v":""},{"$f":"IF(A83=1,\"von \"&Stammdaten!$N$4,IF(A83=2,\"von \"&Stammdaten!$N$5,IF(A83=3,\"von \"&Stammdaten!$N$6,IF(A83=4,\"von \"&Stammdaten!$N$7,IF(A83=5,\"von \"&Stammdaten!$N$8,\"\")))))","v":""},66]
[{"$f":"IF(Daten!D68=\"-\",\"\",Daten!D68)","v":""},{"$f":"IF(A84=\"\",\"\",IF(A84<>A83,1,B83+1))","v":""},{"$f":"IF(Daten!C68=0,\"\",Daten!B68)","v":""},null,null,null,{"$f":"IF(Daten!C68=0,\"\",Daten!C68)","v":""},{"$f":"IF(A84=1,\"von \"&Stammdaten!$N$4,IF(A84=2,\"von \"&Stammdaten!$N$5,IF(A84=3,\"von \"&Stammdaten!$N$6,IF(A84=4,\"von \"&Stammdaten!$N$7,IF(A84=5,\"von \"&Stammdaten!$N$8,\"\")))))","v":""},67]
[{"$f":"IF(Daten!D69=\"-\",\"\",Daten!D69)","v":""},"",{"$f":"IF(Daten!C69=0,\"\",Daten!B69)","v":""},null,null,null,{"$f":"IF(Daten!C69=0,\"\",Daten!C69)","v":""},{"$f":"IF(A85=1,\"von \"&Stammdaten!$N$4,IF(A85=2,\"von \"&Stammdaten!$N$5,IF(A85=3,\"von \"&Stammdaten!$N$6,IF(A85=4,\"von \"&Stammdaten!$N$7,IF(A85=5,\"von \"&Stammdaten!$N$8,\"\")))))","v":""},68]
[{"$f":"IF(Daten!D70=\"-\",\"\",Daten!D70)","v":""},"",{"$f":"IF(Daten!C70=0,\"\",Daten!B70)","v":""},null,null,null,{"$f":"IF(Daten!C70=0,\"\",Daten!C70)","v":""},{"$f":"IF(A86=1,\"von \"&Stammdaten!$N$4,IF(A86=2,\"von \"&Stammdaten!$N$5,IF(A86=3,\"von \"&Stammdaten!$N$6,IF(A86=4,\"von \"&Stammdaten!$N$7,IF(A86=5,\"von \"&Stammdaten!$N$8,\"\")))))","v":""},69]
[{"$f":"IF(Daten!D71=\"-\",\"\",Daten!D71)","v":""},"",{"$f":"IF(Daten!C71=0,\"\",Daten!B71)","v":""},null,null,null,{"$f":"IF(Daten!C71=0,\"\",Daten!C71)","v":""},{"$f":"IF(A87=1,\"von \"&Stammdaten!$N$4,IF(A87=2,\"von \"&Stammdaten!$N$5,IF(A87=3,\"von \"&Stammdaten!$N$6,IF(A87=4,\"von \"&Stammdaten!$N$7,IF(A87=5,\"von \"&Stammdaten!$N$8,\"\")))))","v":""},70]
[{"$f":"IF(Daten!D72=\"-\",\"\",Daten!D72)","v":""},"",{"$f":"IF(Daten!C72=0,\"\",Daten!B72)","v":""},null,null,null,{"$f":"IF(Daten!C72=0,\"\",Daten!C72)","v":""},{"$f":"IF(A88=1,\"von \"&Stammdaten!$N$4,IF(A88=2,\"von \"&Stammdaten!$N$5,IF(A88=3,\"von \"&Stammdaten!$N$6,IF(A88=4,\"von \"&Stammdaten!$N$7,IF(A88=5,\"von \"&Stammdaten!$N$8,\"\")))))","v":""},71]
[{"$f":"IF(Daten!D73=\"-\",\"\",Daten!D73)","v":""},"",{"$f":"IF(Daten!C73=0,\"\",Daten!B73)","v":""},null,null,null,{"$f":"IF(Daten!C73=0,\"\",Daten!C73)","v":""},{"$f":"IF(A89=1,\"von \"&Stammdaten!$N$4,IF(A89=2,\"von \"&Stammdaten!$N$5,IF(A89=3,\"von \"&Stammdaten!$N$6,IF(A89=4,\"von \"&Stammdaten!$N$7,IF(A89=5,\"von \"&Stammdaten!$N$8,\"\")))))","v":""},72]
[{"$f":"IF(Daten!D74=\"-\",\"\",Daten!D74)","v":""},"",{"$f":"IF(Daten!C74=0,\"\",Daten!B74)","v":""},null,null,null,{"$f":"IF(Daten!C74=0,\"\",Daten!C74)","v":""},{"$f":"IF(A90=1,\"von \"&Stammdaten!$N$4,IF(A90=2,\"von \"&Stammdaten!$N$5,IF(A90=3,\"von \"&Stammdaten!$N$6,IF(A90=4,\"von \"&Stammdaten!$N$7,IF(A90=5,\"von \"&Stammdaten!$N$8,\"\")))))","v":""},73]
[{"$f":"IF(Daten!D75=\"-\",\"\",Daten!D75)","v":""},"",{"$f":"IF(Daten!C75=0,\"\",Daten!B75)","v":""},null,null,null,{"$f":"IF(Daten!C75=0,\"\",Daten!C75)","v":""},{"$f":"IF(A91=1,\"von \"&Stammdaten!$N$4,IF(A91=2,\"von \"&Stammdaten!$N$5,IF(A91=3,\"von \"&Stammdaten!$N$6,IF(A91=4,\"von \"&Stammdaten!$N$7,IF(A91=5,\"von \"&Stammdaten!$N$8,\"\")))))","v":""},74]
[{"$f":"IF(Daten!D76=\"-\",\"\",Daten!D76)","v":""},"",{"$f":"IF(Daten!C76=0,\"\",Daten!B76)","v":""},null,null,null,{"$f":"IF(Daten!C76=0,\"\",Daten!C76)","v":""},{"$f":"IF(A92=1,\"von \"&Stammdaten!$N$4,IF(A92=2,\"von \"&Stammdaten!$N$5,IF(A92=3,\"von \"&Stammdaten!$N$6,IF(A92=4,\"von \"&Stammdaten!$N$7,IF(A92=5,\"von \"&Stammdaten!$N$8,\"\")))))","v":""},75]
[{"$f":"IF(Daten!D77=\"-\",\"\",Daten!D77)","v":""},"",{"$f":"IF(Daten!C77=0,\"\",Daten!B77)","v":""},null,null,null,{"$f":"IF(Daten!C77=0,\"\",Daten!C77)","v":""},{"$f":"IF(A93=1,\"von \"&Stammdaten!$N$4,IF(A93=2,\"von \"&Stammdaten!$N$5,IF(A93=3,\"von \"&Stammdaten!$N$6,IF(A93=4,\"von \"&Stammdaten!$N$7,IF(A93=5,\"von \"&Stammdaten!$N$8,\"\")))))","v":""},76]
[{"$f":"IF(Daten!D78=\"-\",\"\",Daten!D78)","v":""},"",{"$f":"IF(Daten!C78=0,\"\",Daten!B78)","v":""},null,null,null,{"$f":"IF(Daten!C78=0,\"\",Daten!C78)","v":""},{"$f":"IF(A94=1,\"von \"&Stammdaten!$N$4,IF(A94=2,\"von \"&Stammdaten!$N$5,IF(A94=3,\"von \"&Stammdaten!$N$6,IF(A94=4,\"von \"&Stammdaten!$N$7,IF(A94=5,\"von \"&Stammdaten!$N$8,\"\")))))","v":""},77]
[{"$f":"IF(Daten!D79=\"-\",\"\",Daten!D79)","v":""},"",{"$f":"IF(Daten!C79=0,\"\",Daten!B79)","v":""},null,null,null,{"$f":"IF(Daten!C79=0,\"\",Daten!C79)","v":""},{"$f":"IF(A95=1,\"von \"&Stammdaten!$N$4,IF(A95=2,\"von \"&Stammdaten!$N$5,IF(A95=3,\"von \"&Stammdaten!$N$6,IF(A95=4,\"von \"&Stammdaten!$N$7,IF(A95=5,\"von \"&Stammdaten!$N$8,\"\")))))","v":""},78]
[{"$f":"IF(Daten!D80=\"-\",\"\",Daten!D80)","v":""},"",{"$f":"IF(Daten!C80=0,\"\",Daten!B80)","v":""},null,null,null,{"$f":"IF(Daten!C80=0,\"\",Daten!C80)","v":""},{"$f":"IF(A96=1,\"von \"&Stammdaten!$N$4,IF(A96=2,\"von \"&Stammdaten!$N$5,IF(A96=3,\"von \"&Stammdaten!$N$6,IF(A96=4,\"von \"&Stammdaten!$N$7,IF(A96=5,\"von \"&Stammdaten!$N$8,\"\")))))","v":""},79]
[{"$f":"IF(Daten!D81=\"-\",\"\",Daten!D81)","v":""},"",{"$f":"IF(Daten!C81=0,\"\",Daten!B81)","v":""},null,null,null,{"$f":"IF(Daten!C81=0,\"\",Daten!C81)","v":""},{"$f":"IF(A97=1,\"von \"&Stammdaten!$N$4,IF(A97=2,\"von \"&Stammdaten!$N$5,IF(A97=3,\"von \"&Stammdaten!$N$6,IF(A97=4,\"von \"&Stammdaten!$N$7,IF(A97=5,\"von \"&Stammdaten!$N$8,\"\")))))","v":""},80]
[{"$f":"IF(Daten!D82=\"-\",\"\",Daten!D82)","v":""},"",{"$f":"IF(Daten!C82=0,\"\",Daten!B82)","v":""},null,null,null,{"$f":"IF(Daten!C82=0,\"\",Daten!C82)","v":""},{"$f":"IF(A98=1,\"von \"&Stammdaten!$N$4,IF(A98=2,\"von \"&Stammdaten!$N$5,IF(A98=3,\"von \"&Stammdaten!$N$6,IF(A98=4,\"von \"&Stammdaten!$N$7,IF(A98=5,\"von \"&Stammdaten!$N$8,\"\")))))","v":""},81]
[{"$f":"IF(Daten!D83=\"-\",\"\",Daten!D83)","v":""},"",{"$f":"IF(Daten!C83=0,\"\",Daten!B83)","v":""},null,null,null,{"$f":"IF(Daten!C83=0,\"\",Daten!C83)","v":""},{"$f":"IF(A99=1,\"von \"&Stammdaten!$N$4,IF(A99=2,\"von \"&Stammdaten!$N$5,IF(A99=3,\"von \"&Stammdaten!$N$6,IF(A99=4,\"von \"&Stammdaten!$N$7,IF(A99=5,\"von \"&Stammdaten!$N$8,\"\")))))","v":""},82]
[{"$f":"IF(Daten!D84=\"-\",\"\",Daten!D84)","v":""},"",{"$f":"IF(Daten!C84=0,\"\",Daten!B84)","v":""},null,null,null,{"$f":"IF(Daten!C84=0,\"\",Daten!C84)","v":""},{"$f":"IF(A100=1,\"von \"&Stammdaten!$N$4,IF(A100=2,\"von \"&Stammdaten!$N$5,IF(A100=3,\"von \"&Stammdaten!$N$6,IF(A100=4,\"von \"&Stammdaten!$N$7,IF(A100=5,\"von \"&Stammdaten!$N$8,\"\")))))","v":""},83]
[{"$f":"IF(Daten!D85=\"-\",\"\",Daten!D85)","v":""},"",{"$f":"IF(Daten!C85=0,\"\",Daten!B85)","v":""},null,null,null,{"$f":"IF(Daten!C85=0,\"\",Daten!C85)","v":""},{"$f":"IF(A101=1,\"von \"&Stammdaten!$N$4,IF(A101=2,\"von \"&Stammdaten!$N$5,IF(A101=3,\"von \"&Stammdaten!$N$6,IF(A101=4,\"von \"&Stammdaten!$N$7,IF(A101=5,\"von \"&Stammdaten!$N$8,\"\")))))","v":""},84]
[{"$f":"IF(Daten!D86=\"-\",\"\",Daten!D86)","v":""},"",{"$f":"IF(Daten!C86=0,\"\",Daten!B86)","v":""},null,null,null,{"$f":"IF(Daten!C86=0,\"\",Daten!C86)","v":""},{"$f":"IF(A102=1,\"von \"&Stammdaten!$N$4,IF(A102=2,\"von \"&Stammdaten!$N$5,IF(A102=3,\"von \"&Stammdaten!$N$6,IF(A102=4,\"von \"&Stammdaten!$N$7,IF(A102=5,\"von \"&Stammdaten!$N$8,\"\")))))","v":""},85]
[{"$f":"IF(Daten!D87=\"-\",\"\",Daten!D87)","v":""},"",{"$f":"IF(Daten!C87=0,\"\",Daten!B87)","v":""},null,null,null,{"$f":"IF(Daten!C87=0,\"\",Daten!C87)","v":""},{"$f":"IF(A103=1,\"von \"&Stammdaten!$N$4,IF(A103=2,\"von \"&Stammdaten!$N$5,IF(A103=3,\"von \"&Stammdaten!$N$6,IF(A103=4,\"von \"&Stammdaten!$N$7,IF(A103=5,\"von \"&Stammdaten!$N$8,\"\")))))","v":""},86]
[{"$f":"IF(Daten!D88=\"-\",\"\",Daten!D88)","v":""},"",{"$f":"IF(Daten!C88=0,\"\",Daten!B88)","v":""},null,null,null,{"$f":"IF(Daten!C88=0,\"\",Daten!C88)","v":""},{"$f":"IF(A104=1,\"von \"&Stammdaten!$N$4,IF(A104=2,\"von \"&Stammdaten!$N$5,IF(A104=3,\"von \"&Stammdaten!$N$6,IF(A104=4,\"von \"&Stammdaten!$N$7,IF(A104=5,\"von \"&Stammdaten!$N$8,\"\")))))","v":""},87]
[{"$f":"IF(Daten!D89=\"-\",\"\",Daten!D89)","v":""},"",{"$f":"IF(Daten!C89=0,\"\",Daten!B89)","v":""},null,null,null,{"$f":"IF(Daten!C89=0,\"\",Daten!C89)","v":""},{"$f":"IF(A105=1,\"von \"&Stammdaten!$N$4,IF(A105=2,\"von \"&Stammdaten!$N$5,IF(A105=3,\"von \"&Stammdaten!$N$6,IF(A105=4,\"von \"&Stammdaten!$N$7,IF(A105=5,\"von \"&Stammdaten!$N$8,\"\")))))","v":""},88]
[{"$f":"IF(Daten!D90=\"-\",\"\",Daten!D90)","v":""},"",{"$f":"IF(Daten!C90=0,\"\",Daten!B90)","v":""},null,null,null,{"$f":"IF(Daten!C90=0,\"\",Daten!C90)","v":""},{"$f":"IF(A106=1,\"von \"&Stammdaten!$N$4,IF(A106=2,\"von \"&Stammdaten!$N$5,IF(A106=3,\"von \"&Stammdaten!$N$6,IF(A106=4,\"von \"&Stammdaten!$N$7,IF(A106=5,\"von \"&Stammdaten!$N$8,\"\")))))","v":""},89]
[{"$f":"IF(Daten!D91=\"-\",\"\",Daten!D91)","v":""},"",{"$f":"IF(Daten!C91=0,\"\",Daten!B91)","v":""},null,null,null,{"$f":"IF(Daten!C91=0,\"\",Daten!C91)","v":""},{"$f":"IF(A107=1,\"von \"&Stammdaten!$N$4,IF(A107=2,\"von \"&Stammdaten!$N$5,IF(A107=3,\"von \"&Stammdaten!$N$6,IF(A107=4,\"von \"&Stammdaten!$N$7,IF(A107=5,\"von \"&Stammdaten!$N$8,\"\")))))","v":""},90]
[{"$f":"IF(Daten!D92=\"-\",\"\",Daten!D92)","v":""},"",{"$f":"IF(Daten!C92=0,\"\",Daten!B92)","v":""},null,null,null,{"$f":"IF(Daten!C92=0,\"\",Daten!C92)","v":""},{"$f":"IF(A108=1,\"von \"&Stammdaten!$N$4,IF(A108=2,\"von \"&Stammdaten!$N$5,IF(A108=3,\"von \"&Stammdaten!$N$6,IF(A108=4,\"von \"&Stammdaten!$N$7,IF(A108=5,\"von \"&Stammdaten!$N$8,\"\")))))","v":""},91]
[{"$f":"IF(Daten!D93=\"-\",\"\",Daten!D93)","v":""},"",{"$f":"IF(Daten!C93=0,\"\",Daten!B93)","v":""},null,null,null,{"$f":"IF(Daten!C93=0,\"\",Daten!C93)","v":""},{"$f":"IF(A109=1,\"von \"&Stammdaten!$N$4,IF(A109=2,\"von \"&Stammdaten!$N$5,IF(A109=3,\"von \"&Stammdaten!$N$6,IF(A109=4,\"von \"&Stammdaten!$N$7,IF(A109=5,\"von \"&Stammdaten!$N$8,\"\")))))","v":""},92]
[{"$f":"IF(Daten!D94=\"-\",\"\",Daten!D94)","v":""},"",{"$f":"IF(Daten!C94=0,\"\",Daten!B94)","v":""},null,null,null,{"$f":"IF(Daten!C94=0,\"\",Daten!C94)","v":""},{"$f":"IF(A110=1,\"von \"&Stammdaten!$N$4,IF(A110=2,\"von \"&Stammdaten!$N$5,IF(A110=3,\"von \"&Stammdaten!$N$6,IF(A110=4,\"von \"&Stammdaten!$N$7,IF(A110=5,\"von \"&Stammdaten!$N$8,\"\")))))","v":""},93]
[{"$f":"IF(Daten!D95=\"-\",\"\",Daten!D95)","v":""},"",{"$f":"IF(Daten!C95=0,\"\",Daten!B95)","v":""},null,null,null,{"$f":"IF(Daten!C95=0,\"\",Daten!C95)","v":""},{"$f":"IF(A111=1,\"von \"&Stammdaten!$N$4,IF(A111=2,\"von \"&Stammdaten!$N$5,IF(A111=3,\"von \"&Stammdaten!$N$6,IF(A111=4,\"von \"&Stammdaten!$N$7,IF(A111=5,\"von \"&Stammdaten!$N$8,\"\")))))","v":""},94]
[{"$f":"IF(Daten!D96=\"-\",\"\",Daten!D96)","v":""},"",{"$f":"IF(Daten!C96=0,\"\",Daten!B96)","v":""},null,null,null,{"$f":"IF(Daten!C96=0,\"\",Daten!C96)","v":""},{"$f":"IF(A112=1,\"von \"&Stammdaten!$N$4,IF(A112=2,\"von \"&Stammdaten!$N$5,IF(A112=3,\"von \"&Stammdaten!$N$6,IF(A112=4,\"von \"&Stammdaten!$N$7,IF(A112=5,\"von \"&Stammdaten!$N$8,\"\")))))","v":""},95]
[{"$f":"IF(Daten!D97=\"-\",\"\",Daten!D97)","v":""},"",{"$f":"IF(Daten!C97=0,\"\",Daten!B97)","v":""},null,null,null,{"$f":"IF(Daten!C97=0,\"\",Daten!C97)","v":""},{"$f":"IF(A113=1,\"von \"&Stammdaten!$N$4,IF(A113=2,\"von \"&Stammdaten!$N$5,IF(A113=3,\"von \"&Stammdaten!$N$6,IF(A113=4,\"von \"&Stammdaten!$N$7,IF(A113=5,\"von \"&Stammdaten!$N$8,\"\")))))","v":""},96]
[{"$f":"IF(Daten!D98=\"-\",\"\",Daten!D98)","v":""},"",{"$f":"IF(Daten!C98=0,\"\",Daten!B98)","v":""},null,null,null,{"$f":"IF(Daten!C98=0,\"\",Daten!C98)","v":""},{"$f":"IF(A114=1,\"von \"&Stammdaten!$N$4,IF(A114=2,\"von \"&Stammdaten!$N$5,IF(A114=3,\"von \"&Stammdaten!$N$6,IF(A114=4,\"von \"&Stammdaten!$N$7,IF(A114=5,\"von \"&Stammdaten!$N$8,\"\")))))","v":""},97]
[{"$f":"IF(Daten!D99=\"-\",\"\",Daten!D99)","v":""},"",{"$f":"IF(Daten!C99=0,\"\",Daten!B99)","v":""},null,null,null,{"$f":"IF(Daten!C99=0,\"\",Daten!C99)","v":""},{"$f":"IF(A115=1,\"von \"&Stammdaten!$N$4,IF(A115=2,\"von \"&Stammdaten!$N$5,IF(A115=3,\"von \"&Stammdaten!$N$6,IF(A115=4,\"von \"&Stammdaten!$N$7,IF(A115=5,\"von \"&Stammdaten!$N$8,\"\")))))","v":""},98]
[{"$f":"IF(Daten!D100=\"-\",\"\",Daten!D100)","v":""},"",{"$f":"IF(Daten!C100=0,\"\",Daten!B100)","v":""},null,null,null,{"$f":"IF(Daten!C100=0,\"\",Daten!C100)","v":""},{"$f":"IF(A116=1,\"von \"&Stammdaten!$N$4,IF(A116=2,\"von \"&Stammdaten!$N$5,IF(A116=3,\"von \"&Stammdaten!$N$6,IF(A116=4,\"von \"&Stammdaten!$N$7,IF(A116=5,\"von \"&Stammdaten!$N$8,\"\")))))","v":""},99]
[{"$f":"IF(Daten!D101=\"-\",\"\",Daten!D101)","v":""},"",{"$f":"IF(Daten!C101=0,\"\",Daten!B101)","v":""},null,null,null,{"$f":"IF(Daten!C101=0,\"\",Daten!C101)","v":""},{"$f":"IF(A117=1,\"von \"&Stammdaten!$N$4,IF(A117=2,\"von \"&Stammdaten!$N$5,IF(A117=3,\"von \"&Stammdaten!$N$6,IF(A117=4,\"von \"&Stammdaten!$N$7,IF(A117=5,\"von \"&Stammdaten!$N$8,\"\")))))","v":""},100]
[{"$f":"IF(Daten!D102=\"-\",\"\",Daten!D102)","v":""},"",{"$f":"IF(Daten!C102=0,\"\",Daten!B102)","v":""},null,null,null,{"$f":"IF(Daten!C102=0,\"\",Daten!C102)","v":""},{"$f":"IF(A118=1,\"von \"&Stammdaten!$N$4,IF(A118=2,\"von \"&Stammdaten!$N$5,IF(A118=3,\"von \"&Stammdaten!$N$6,IF(A118=4,\"von \"&Stammdaten!$N$7,IF(A118=5,\"von \"&Stammdaten!$N$8,\"\")))))","v":""},101]
[{"$f":"IF(Daten!D103=\"-\",\"\",Daten!D103)","v":""},"",{"$f":"IF(Daten!C103=0,\"\",Daten!B103)","v":""},null,null,null,{"$f":"IF(Daten!C103=0,\"\",Daten!C103)","v":""},{"$f":"IF(A119=1,\"von \"&Stammdaten!$N$4,IF(A119=2,\"von \"&Stammdaten!$N$5,IF(A119=3,\"von \"&Stammdaten!$N$6,IF(A119=4,\"von \"&Stammdaten!$N$7,IF(A119=5,\"von \"&Stammdaten!$N$8,\"\")))))","v":""},102]
[{"$f":"IF(Daten!D104=\"-\",\"\",Daten!D104)","v":""},"",{"$f":"IF(Daten!C104=0,\"\",Daten!B104)","v":""},null,null,null,{"$f":"IF(Daten!C104=0,\"\",Daten!C104)","v":""},{"$f":"IF(A120=1,\"von \"&Stammdaten!$N$4,IF(A120=2,\"von \"&Stammdaten!$N$5,IF(A120=3,\"von \"&Stammdaten!$N$6,IF(A120=4,\"von \"&Stammdaten!$N$7,IF(A120=5,\"von \"&Stammdaten!$N$8,\"\")))))","v":""},103]
[{"$f":"IF(Daten!D105=\"-\",\"\",Daten!D105)","v":""},"",{"$f":"IF(Daten!C105=0,\"\",Daten!B105)","v":""},null,null,null,{"$f":"IF(Daten!C105=0,\"\",Daten!C105)","v":""},{"$f":"IF(A121=1,\"von \"&Stammdaten!$N$4,IF(A121=2,\"von \"&Stammdaten!$N$5,IF(A121=3,\"von \"&Stammdaten!$N$6,IF(A121=4,\"von \"&Stammdaten!$N$7,IF(A121=5,\"von \"&Stammdaten!$N$8,\"\")))))","v":""},104]
[{"$f":"IF(Daten!D106=\"-\",\"\",Daten!D106)","v":""},"",{"$f":"IF(Daten!C106=0,\"\",Daten!B106)","v":""},null,null,null,{"$f":"IF(Daten!C106=0,\"\",Daten!C106)","v":""},{"$f":"IF(A122=1,\"von \"&Stammdaten!$N$4,IF(A122=2,\"von \"&Stammdaten!$N$5,IF(A122=3,\"von \"&Stammdaten!$N$6,IF(A122=4,\"von \"&Stammdaten!$N$7,IF(A122=5,\"von \"&Stammdaten!$N$8,\"\")))))","v":""},105]
[{"$f":"IF(Daten!D107=\"-\",\"\",Daten!D107)","v":""},"",{"$f":"IF(Daten!C107=0,\"\",Daten!B107)","v":""},null,null,null,{"$f":"IF(Daten!C107=0,\"\",Daten!C107)","v":""},{"$f":"IF(A123=1,\"von \"&Stammdaten!$N$4,IF(A123=2,\"von \"&Stammdaten!$N$5,IF(A123=3,\"von \"&Stammdaten!$N$6,IF(A123=4,\"von \"&Stammdaten!$N$7,IF(A123=5,\"von \"&Stammdaten!$N$8,\"\")))))","v":""},106]
[{"$f":"IF(Daten!D108=\"-\",\"\",Daten!D108)","v":""},"",{"$f":"IF(Daten!C108=0,\"\",Daten!B108)","v":""},null,null,null,{"$f":"IF(Daten!C108=0,\"\",Daten!C108)","v":""},{"$f":"IF(A124=1,\"von \"&Stammdaten!$N$4,IF(A124=2,\"von \"&Stammdaten!$N$5,IF(A124=3,\"von \"&Stammdaten!$N$6,IF(A124=4,\"von \"&Stammdaten!$N$7,IF(A124=5,\"von \"&Stammdaten!$N$8,\"\")))))","v":""},107]
[{"$f":"IF(Daten!D109=\"-\",\"\",Daten!D109)","v":""},"",{"$f":"IF(Daten!C109=0,\"\",Daten!B109)","v":""},null,null,null,{"$f":"IF(Daten!C109=0,\"\",Daten!C109)","v":""},{"$f":"IF(A125=1,\"von \"&Stammdaten!$N$4,IF(A125=2,\"von \"&Stammdaten!$N$5,IF(A125=3,\"von \"&Stammdaten!$N$6,IF(A125=4,\"von \"&Stammdaten!$N$7,IF(A125=5,\"von \"&Stammdaten!$N$8,\"\")))))","v":""},108]
[{"$f":"IF(Daten!D110=\"-\",\"\",Daten!D110)","v":""},"",{"$f":"IF(Daten!C110=0,\"\",Daten!B110)","v":""},null,null,null,{"$f":"IF(Daten!C110=0,\"\",Daten!C110)","v":""},{"$f":"IF(A126=1,\"von \"&Stammdaten!$N$4,IF(A126=2,\"von \"&Stammdaten!$N$5,IF(A126=3,\"von \"&Stammdaten!$N$6,IF(A126=4,\"von \"&Stammdaten!$N$7,IF(A126=5,\"von \"&Stammdaten!$N$8,\"\")))))","v":""},109]
[{"$f":"IF(Daten!D111=\"-\",\"\",Daten!D111)","v":""},"",{"$f":"IF(Daten!C111=0,\"\",Daten!B111)","v":""},null,null,null,{"$f":"IF(Daten!C111=0,\"\",Daten!C111)","v":""},{"$f":"IF(A127=1,\"von \"&Stammdaten!$N$4,IF(A127=2,\"von \"&Stammdaten!$N$5,IF(A127=3,\"von \"&Stammdaten!$N$6,IF(A127=4,\"von \"&Stammdaten!$N$7,IF(A127=5,\"von \"&Stammdaten!$N$8,\"\")))))","v":""},110]
[{"$f":"IF(Daten!D112=\"-\",\"\",Daten!D112)","v":""},"",{"$f":"IF(Daten!C112=0,\"\",Daten!B112)","v":""},null,null,null,{"$f":"IF(Daten!C112=0,\"\",Daten!C112)","v":""},{"$f":"IF(A128=1,\"von \"&Stammdaten!$N$4,IF(A128=2,\"von \"&Stammdaten!$N$5,IF(A128=3,\"von \"&Stammdaten!$N$6,IF(A128=4,\"von \"&Stammdaten!$N$7,IF(A128=5,\"von \"&Stammdaten!$N$8,\"\")))))","v":""},111]
[{"$f":"IF(Daten!D113=\"-\",\"\",Daten!D113)","v":""},"",{"$f":"IF(Daten!C113=0,\"\",Daten!B113)","v":""},null,null,null,{"$f":"IF(Daten!C113=0,\"\",Daten!C113)","v":""},{"$f":"IF(A129=1,\"von \"&Stammdaten!$N$4,IF(A129=2,\"von \"&Stammdaten!$N$5,IF(A129=3,\"von \"&Stammdaten!$N$6,IF(A129=4,\"von \"&Stammdaten!$N$7,IF(A129=5,\"von \"&Stammdaten!$N$8,\"\")))))","v":""},112]
[{"$f":"IF(Daten!D114=\"-\",\"\",Daten!D114)","v":""},"",{"$f":"IF(Daten!C114=0,\"\",Daten!B114)","v":""},null,null,null,{"$f":"IF(Daten!C114=0,\"\",Daten!C114)","v":""},{"$f":"IF(A130=1,\"von \"&Stammdaten!$N$4,IF(A130=2,\"von \"&Stammdaten!$N$5,IF(A130=3,\"von \"&Stammdaten!$N$6,IF(A130=4,\"von \"&Stammdaten!$N$7,IF(A130=5,\"von \"&Stammdaten!$N$8,\"\")))))","v":""},113]
[{"$f":"IF(Daten!D115=\"-\",\"\",Daten!D115)","v":""},"",{"$f":"IF(Daten!C115=0,\"\",Daten!B115)","v":""},null,null,null,{"$f":"IF(Daten!C115=0,\"\",Daten!C115)","v":""},{"$f":"IF(A131=1,\"von \"&Stammdaten!$N$4,IF(A131=2,\"von \"&Stammdaten!$N$5,IF(A131=3,\"von \"&Stammdaten!$N$6,IF(A131=4,\"von \"&Stammdaten!$N$7,IF(A131=5,\"von \"&Stammdaten!$N$8,\"\")))))","v":""},114]
[{"$f":"IF(Daten!D116=\"-\",\"\",Daten!D116)","v":""},"",{"$f":"IF(Daten!C116=0,\"\",Daten!B116)","v":""},null,null,null,{"$f":"IF(Daten!C116=0,\"\",Daten!C116)","v":""},{"$f":"IF(A132=1,\"von \"&Stammdaten!$N$4,IF(A132=2,\"von \"&Stammdaten!$N$5,IF(A132=3,\"von \"&Stammdaten!$N$6,IF(A132=4,\"von \"&Stammdaten!$N$7,IF(A132=5,\"von \"&Stammdaten!$N$8,\"\")))))","v":""},115]
[{"$f":"IF(Daten!D117=\"-\",\"\",Daten!D117)","v":""},"",{"$f":"IF(Daten!C117=0,\"\",Daten!B117)","v":""},null,null,null,{"$f":"IF(Daten!C117=0,\"\",Daten!C117)","v":""},{"$f":"IF(A133=1,\"von \"&Stammdaten!$N$4,IF(A133=2,\"von \"&Stammdaten!$N$5,IF(A133=3,\"von \"&Stammdaten!$N$6,IF(A133=4,\"von \"&Stammdaten!$N$7,IF(A133=5,\"von \"&Stammdaten!$N$8,\"\")))))","v":""},116]
[{"$f":"IF(Daten!D118=\"-\",\"\",Daten!D118)","v":""},"",{"$f":"IF(Daten!C118=0,\"\",Daten!B118)","v":""},null,null,null,{"$f":"IF(Daten!C118=0,\"\",Daten!C118)","v":""},{"$f":"IF(A134=1,\"von \"&Stammdaten!$N$4,IF(A134=2,\"von \"&Stammdaten!$N$5,IF(A134=3,\"von \"&Stammdaten!$N$6,IF(A134=4,\"von \"&Stammdaten!$N$7,IF(A134=5,\"von \"&Stammdaten!$N$8,\"\")))))","v":""},117]
[{"$f":"IF(Daten!D119=\"-\",\"\",Daten!D119)","v":""},"",{"$f":"IF(Daten!C119=0,\"\",Daten!B119)","v":""},null,null,null,{"$f":"IF(Daten!C119=0,\"\",Daten!C119)","v":""},{"$f":"IF(A135=1,\"von \"&Stammdaten!$N$4,IF(A135=2,\"von \"&Stammdaten!$N$5,IF(A135=3,\"von \"&Stammdaten!$N$6,IF(A135=4,\"von \"&Stammdaten!$N$7,IF(A135=5,\"von \"&Stammdaten!$N$8,\"\")))))","v":""},118]
[{"$f":"IF(Daten!D120=\"-\",\"\",Daten!D120)","v":""},"",{"$f":"IF(Daten!C120=0,\"\",Daten!B120)","v":""},null,null,null,{"$f":"IF(Daten!C120=0,\"\",Daten!C120)","v":""},{"$f":"IF(A136=1,\"von \"&Stammdaten!$N$4,IF(A136=2,\"von \"&Stammdaten!$N$5,IF(A136=3,\"von \"&Stammdaten!$N$6,IF(A136=4,\"von \"&Stammdaten!$N$7,IF(A136=5,\"von \"&Stammdaten!$N$8,\"\")))))","v":""},119]
[{"$f":"IF(Daten!D121=\"-\",\"\",Daten!D121)","v":""},"",{"$f":"IF(Daten!C121=0,\"\",Daten!B121)","v":""},null,null,null,{"$f":"IF(Daten!C121=0,\"\",Daten!C121)","v":""},{"$f":"IF(A137=1,\"von \"&Stammdaten!$N$4,IF(A137=2,\"von \"&Stammdaten!$N$5,IF(A137=3,\"von \"&Stammdaten!$N$6,IF(A137=4,\"von \"&Stammdaten!$N$7,IF(A137=5,\"von \"&Stammdaten!$N$8,\"\")))))","v":""},120]
[{"$f":"IF(Daten!D122=\"-\",\"\",Daten!D122)","v":""},"",{"$f":"IF(Daten!C122=0,\"\",Daten!B122)","v":""},null,null,null,{"$f":"IF(Daten!C122=0,\"\",Daten!C122)","v":""},{"$f":"IF(A138=1,\"von \"&Stammdaten!$N$4,IF(A138=2,\"von \"&Stammdaten!$N$5,IF(A138=3,\"von \"&Stammdaten!$N$6,IF(A138=4,\"von \"&Stammdaten!$N$7,IF(A138=5,\"von \"&Stammdaten!$N$8,\"\")))))","v":""},121]
[{"$f":"IF(Daten!D123=\"-\",\"\",Daten!D123)","v":""},"",{"$f":"IF(Daten!C123=0,\"\",Daten!B123)","v":""},null,null,null,{"$f":"IF(Daten!C123=0,\"\",Daten!C123)","v":""},{"$f":"IF(A139=1,\"von \"&Stammdaten!$N$4,IF(A139=2,\"von \"&Stammdaten!$N$5,IF(A139=3,\"von \"&Stammdaten!$N$6,IF(A139=4,\"von \"&Stammdaten!$N$7,IF(A139=5,\"von \"&Stammdaten!$N$8,\"\")))))","v":""},122]
[{"$f":"IF(Daten!D124=\"-\",\"\",Daten!D124)","v":""},"",{"$f":"IF(Daten!C124=0,\"\",Daten!B124)","v":""},null,null,null,{"$f":"IF(Daten!C124=0,\"\",Daten!C124)","v":""},{"$f":"IF(A140=1,\"von \"&Stammdaten!$N$4,IF(A140=2,\"von \"&Stammdaten!$N$5,IF(A140=3,\"von \"&Stammdaten!$N$6,IF(A140=4,\"von \"&Stammdaten!$N$7,IF(A140=5,\"von \"&Stammdaten!$N$8,\"\")))))","v":""},123]
[{"$f":"IF(Daten!D125=\"-\",\"\",Daten!D125)","v":""},"",{"$f":"IF(Daten!C125=0,\"\",Daten!B125)","v":""},null,null,null,{"$f":"IF(Daten!C125=0,\"\",Daten!C125)","v":""},{"$f":"IF(A141=1,\"von \"&Stammdaten!$N$4,IF(A141=2,\"von \"&Stammdaten!$N$5,IF(A141=3,\"von \"&Stammdaten!$N$6,IF(A141=4,\"von \"&Stammdaten!$N$7,IF(A141=5,\"von \"&Stammdaten!$N$8,\"\")))))","v":""},124]
[{"$f":"IF(Daten!D126=\"-\",\"\",Daten!D126)","v":""},"",{"$f":"IF(Daten!C126=0,\"\",Daten!B126)","v":""},null,null,null,{"$f":"IF(Daten!C126=0,\"\",Daten!C126)","v":""},{"$f":"IF(A142=1,\"von \"&Stammdaten!$N$4,IF(A142=2,\"von \"&Stammdaten!$N$5,IF(A142=3,\"von \"&Stammdaten!$N$6,IF(A142=4,\"von \"&Stammdaten!$N$7,IF(A142=5,\"von \"&Stammdaten!$N$8,\"\")))))","v":""},125]
[{"$f":"IF(Daten!D127=\"-\",\"\",Daten!D127)","v":""},"",{"$f":"IF(Daten!C127=0,\"\",Daten!B127)","v":""},null,null,null,{"$f":"IF(Daten!C127=0,\"\",Daten!C127)","v":""},{"$f":"IF(A143=1,\"von \"&Stammdaten!$N$4,IF(A143=2,\"von \"&Stammdaten!$N$5,IF(A143=3,\"von \"&Stammdaten!$N$6,IF(A143=4,\"von \"&Stammdaten!$N$7,IF(A143=5,\"von \"&Stammdaten!$N$8,\"\")))))","v":""},126]
[{"$f":"IF(Daten!D128=\"-\",\"\",Daten!D128)","v":""},"",{"$f":"IF(Daten!C128=0,\"\",Daten!B128)","v":""},null,null,null,{"$f":"IF(Daten!C128=0,\"\",Daten!C128)","v":""},{"$f":"IF(A144=1,\"von \"&Stammdaten!$N$4,IF(A144=2,\"von \"&Stammdaten!$N$5,IF(A144=3,\"von \"&Stammdaten!$N$6,IF(A144=4,\"von \"&Stammdaten!$N$7,IF(A144=5,\"von \"&Stammdaten!$N$8,\"\")))))","v":""},127]
[{"$f":"IF(Daten!D129=\"-\",\"\",Daten!D129)","v":""},"",{"$f":"IF(Daten!C129=0,\"\",Daten!B129)","v":""},null,null,null,{"$f":"IF(Daten!C129=0,\"\",Daten!C129)","v":""},{"$f":"IF(A145=1,\"von \"&Stammdaten!$N$4,IF(A145=2,\"von \"&Stammdaten!$N$5,IF(A145=3,\"von \"&Stammdaten!$N$6,IF(A145=4,\"von \"&Stammdaten!$N$7,IF(A145=5,\"von \"&Stammdaten!$N$8,\"\")))))","v":""},128]
[{"$f":"IF(Daten!D130=\"-\",\"\",Daten!D130)","v":""},"",{"$f":"IF(Daten!C130=0,\"\",Daten!B130)","v":""},null,null,null,{"$f":"IF(Daten!C130=0,\"\",Daten!C130)","v":""},{"$f":"IF(A146=1,\"von \"&Stammdaten!$N$4,IF(A146=2,\"von \"&Stammdaten!$N$5,IF(A146=3,\"von \"&Stammdaten!$N$6,IF(A146=4,\"von \"&Stammdaten!$N$7,IF(A146=5,\"von \"&Stammdaten!$N$8,\"\")))))","v":""},129]
[{"$f":"IF(Daten!D131=\"-\",\"\",Daten!D131)","v":""},"",{"$f":"IF(Daten!C131=0,\"\",Daten!B131)","v":""},null,null,null,{"$f":"IF(Daten!C131=0,\"\",Daten!C131)","v":""},{"$f":"IF(A147=1,\"von \"&Stammdaten!$N$4,IF(A147=2,\"von \"&Stammdaten!$N$5,IF(A147=3,\"von \"&Stammdaten!$N$6,IF(A147=4,\"von \"&Stammdaten!$N$7,IF(A147=5,\"von \"&Stammdaten!$N$8,\"\")))))","v":""},130]
[{"$f":"IF(Daten!D132=\"-\",\"\",Daten!D132)","v":""},{"$f":"IF(A148=\"\",\"\",IF(A148<>A147,1,B147+1))","v":""},{"$f":"IF(Daten!C132=0,\"\",Daten!B132)","v":""},null,null,null,{"$f":"IF(Daten!C132=0,\"\",Daten!C132)","v":""},{"$f":"IF(A148=1,\"von \"&Stammdaten!$N$4,IF(A148=2,\"von \"&Stammdaten!$N$5,IF(A148=3,\"von \"&Stammdaten!$N$6,IF(A148=4,\"von \"&Stammdaten!$N$7,IF(A148=5,\"von \"&Stammdaten!$N$8,\"\")))))","v":""},131]
[{"$f":"IF(Daten!D133=\"-\",\"\",Daten!D133)","v":""},"",{"$f":"IF(Daten!C133=0,\"\",Daten!B133)","v":""},null,null,null,{"$f":"IF(Daten!C133=0,\"\",Daten!C133)","v":""},{"$f":"IF(A149=1,\"von \"&Stammdaten!$N$4,IF(A149=2,\"von \"&Stammdaten!$N$5,IF(A149=3,\"von \"&Stammdaten!$N$6,IF(A149=4,\"von \"&Stammdaten!$N$7,IF(A149=5,\"von \"&Stammdaten!$N$8,\"\")))))","v":""},132]
[{"$f":"IF(Daten!D134=\"-\",\"\",Daten!D134)","v":""},"",{"$f":"IF(Daten!C134=0,\"\",Daten!B134)","v":""},null,null,null,{"$f":"IF(Daten!C134=0,\"\",Daten!C134)","v":""},{"$f":"IF(A150=1,\"von \"&Stammdaten!$N$4,IF(A150=2,\"von \"&Stammdaten!$N$5,IF(A150=3,\"von \"&Stammdaten!$N$6,IF(A150=4,\"von \"&Stammdaten!$N$7,IF(A150=5,\"von \"&Stammdaten!$N$8,\"\")))))","v":""},133]
[{"$f":"IF(Daten!D135=\"-\",\"\",Daten!D135)","v":""},"",{"$f":"IF(Daten!C135=0,\"\",Daten!B135)","v":""},null,null,null,{"$f":"IF(Daten!C135=0,\"\",Daten!C135)","v":""},{"$f":"IF(A151=1,\"von \"&Stammdaten!$N$4,IF(A151=2,\"von \"&Stammdaten!$N$5,IF(A151=3,\"von \"&Stammdaten!$N$6,IF(A151=4,\"von \"&Stammdaten!$N$7,IF(A151=5,\"von \"&Stammdaten!$N$8,\"\")))))","v":""},134]
[{"$f":"IF(Daten!D136=\"-\",\"\",Daten!D136)","v":""},"",{"$f":"IF(Daten!C136=0,\"\",Daten!B136)","v":""},null,null,null,{"$f":"IF(Daten!C136=0,\"\",Daten!C136)","v":""},{"$f":"IF(A152=1,\"von \"&Stammdaten!$N$4,IF(A152=2,\"von \"&Stammdaten!$N$5,IF(A152=3,\"von \"&Stammdaten!$N$6,IF(A152=4,\"von \"&Stammdaten!$N$7,IF(A152=5,\"von \"&Stammdaten!$N$8,\"\")))))","v":""},135]
[{"$f":"IF(Daten!D137=\"-\",\"\",Daten!D137)","v":""},"",{"$f":"IF(Daten!C137=0,\"\",Daten!B137)","v":""},null,null,null,{"$f":"IF(Daten!C137=0,\"\",Daten!C137)","v":""},{"$f":"IF(A153=1,\"von \"&Stammdaten!$N$4,IF(A153=2,\"von \"&Stammdaten!$N$5,IF(A153=3,\"von \"&Stammdaten!$N$6,IF(A153=4,\"von \"&Stammdaten!$N$7,IF(A153=5,\"von \"&Stammdaten!$N$8,\"\")))))","v":""},136]
[{"$f":"IF(Daten!D138=\"-\",\"\",Daten!D138)","v":""},"",{"$f":"IF(Daten!C138=0,\"\",Daten!B138)","v":""},null,null,null,{"$f":"IF(Daten!C138=0,\"\",Daten!C138)","v":""},{"$f":"IF(A154=1,\"von \"&Stammdaten!$N$4,IF(A154=2,\"von \"&Stammdaten!$N$5,IF(A154=3,\"von \"&Stammdaten!$N$6,IF(A154=4,\"von \"&Stammdaten!$N$7,IF(A154=5,\"von \"&Stammdaten!$N$8,\"\")))))","v":""},137]
[{"$f":"IF(Daten!D139=\"-\",\"\",Daten!D139)","v":""},"",{"$f":"IF(Daten!C139=0,\"\",Daten!B139)","v":""},null,null,null,{"$f":"IF(Daten!C139=0,\"\",Daten!C139)","v":""},{"$f":"IF(A155=1,\"von \"&Stammdaten!$N$4,IF(A155=2,\"von \"&Stammdaten!$N$5,IF(A155=3,\"von \"&Stammdaten!$N$6,IF(A155=4,\"von \"&Stammdaten!$N$7,IF(A155=5,\"von \"&Stammdaten!$N$8,\"\")))))","v":""},138]
[{"$f":"IF(Daten!D140=\"-\",\"\",Daten!D140)","v":""},"",{"$f":"IF(Daten!C140=0,\"\",Daten!B140)","v":""},null,null,null,{"$f":"IF(Daten!C140=0,\"\",Daten!C140)","v":""},{"$f":"IF(A156=1,\"von \"&Stammdaten!$N$4,IF(A156=2,\"von \"&Stammdaten!$N$5,IF(A156=3,\"von \"&Stammdaten!$N$6,IF(A156=4,\"von \"&Stammdaten!$N$7,IF(A156=5,\"von \"&Stammdaten!$N$8,\"\")))))","v":""},139]
[{"$f":"IF(Daten!D141=\"-\",\"\",Daten!D141)","v":""},"",{"$f":"IF(Daten!C141=0,\"\",Daten!B141)","v":""},null,null,null,{"$f":"IF(Daten!C141=0,\"\",Daten!C141)","v":""},{"$f":"IF(A157=1,\"von \"&Stammdaten!$N$4,IF(A157=2,\"von \"&Stammdaten!$N$5,IF(A157=3,\"von \"&Stammdaten!$N$6,IF(A157=4,\"von \"&Stammdaten!$N$7,IF(A157=5,\"von \"&Stammdaten!$N$8,\"\")))))","v":""},140]
[{"$f":"IF(Daten!D142=\"-\",\"\",Daten!D142)","v":""},"",{"$f":"IF(Daten!C142=0,\"\",Daten!B142)","v":""},null,null,null,{"$f":"IF(Daten!C142=0,\"\",Daten!C142)","v":""},{"$f":"IF(A158=1,\"von \"&Stammdaten!$N$4,IF(A158=2,\"von \"&Stammdaten!$N$5,IF(A158=3,\"von \"&Stammdaten!$N$6,IF(A158=4,\"von \"&Stammdaten!$N$7,IF(A158=5,\"von \"&Stammdaten!$N$8,\"\")))))","v":""},141]
[{"$f":"IF(Daten!D143=\"-\",\"\",Daten!D143)","v":""},"",{"$f":"IF(Daten!C143=0,\"\",Daten!B143)","v":""},null,null,null,{"$f":"IF(Daten!C143=0,\"\",Daten!C143)","v":""},{"$f":"IF(A159=1,\"von \"&Stammdaten!$N$4,IF(A159=2,\"von \"&Stammdaten!$N$5,IF(A159=3,\"von \"&Stammdaten!$N$6,IF(A159=4,\"von \"&Stammdaten!$N$7,IF(A159=5,\"von \"&Stammdaten!$N$8,\"\")))))","v":""},142]
[{"$f":"IF(Daten!D144=\"-\",\"\",Daten!D144)","v":""},"",{"$f":"IF(Daten!C144=0,\"\",Daten!B144)","v":""},null,null,null,{"$f":"IF(Daten!C144=0,\"\",Daten!C144)","v":""},{"$f":"IF(A160=1,\"von \"&Stammdaten!$N$4,IF(A160=2,\"von \"&Stammdaten!$N$5,IF(A160=3,\"von \"&Stammdaten!$N$6,IF(A160=4,\"von \"&Stammdaten!$N$7,IF(A160=5,\"von \"&Stammdaten!$N$8,\"\")))))","v":""},143]
[{"$f":"IF(Daten!D145=\"-\",\"\",Daten!D145)","v":""},"",{"$f":"IF(Daten!C145=0,\"\",Daten!B145)","v":""},null,null,null,{"$f":"IF(Daten!C145=0,\"\",Daten!C145)","v":""},{"$f":"IF(A161=1,\"von \"&Stammdaten!$N$4,IF(A161=2,\"von \"&Stammdaten!$N$5,IF(A161=3,\"von \"&Stammdaten!$N$6,IF(A161=4,\"von \"&Stammdaten!$N$7,IF(A161=5,\"von \"&Stammdaten!$N$8,\"\")))))","v":""},144]
[{"$f":"IF(Daten!D146=\"-\",\"\",Daten!D146)","v":""},"",{"$f":"IF(Daten!C146=0,\"\",Daten!B146)","v":""},null,null,null,{"$f":"IF(Daten!C146=0,\"\",Daten!C146)","v":""},{"$f":"IF(A162=1,\"von \"&Stammdaten!$N$4,IF(A162=2,\"von \"&Stammdaten!$N$5,IF(A162=3,\"von \"&Stammdaten!$N$6,IF(A162=4,\"von \"&Stammdaten!$N$7,IF(A162=5,\"von \"&Stammdaten!$N$8,\"\")))))","v":""},145]
[{"$f":"IF(Daten!D147=\"-\",\"\",Daten!D147)","v":""},"",{"$f":"IF(Daten!C147=0,\"\",Daten!B147)","v":""},null,null,null,{"$f":"IF(Daten!C147=0,\"\",Daten!C147)","v":""},{"$f":"IF(A163=1,\"von \"&Stammdaten!$N$4,IF(A163=2,\"von \"&Stammdaten!$N$5,IF(A163=3,\"von \"&Stammdaten!$N$6,IF(A163=4,\"von \"&Stammdaten!$N$7,IF(A163=5,\"von \"&Stammdaten!$N$8,\"\")))))","v":""},146]
[{"$f":"IF(Daten!D148=\"-\",\"\",Daten!D148)","v":""},"",{"$f":"IF(Daten!C148=0,\"\",Daten!B148)","v":""},null,null,null,{"$f":"IF(Daten!C148=0,\"\",Daten!C148)","v":""},{"$f":"IF(A164=1,\"von \"&Stammdaten!$N$4,IF(A164=2,\"von \"&Stammdaten!$N$5,IF(A164=3,\"von \"&Stammdaten!$N$6,IF(A164=4,\"von \"&Stammdaten!$N$7,IF(A164=5,\"von \"&Stammdaten!$N$8,\"\")))))","v":""},147]
[{"$f":"IF(Daten!D149=\"-\",\"\",Daten!D149)","v":""},"",{"$f":"IF(Daten!C149=0,\"\",Daten!B149)","v":""},null,null,null,{"$f":"IF(Daten!C149=0,\"\",Daten!C149)","v":""},{"$f":"IF(A165=1,\"von \"&Stammdaten!$N$4,IF(A165=2,\"von \"&Stammdaten!$N$5,IF(A165=3,\"von \"&Stammdaten!$N$6,IF(A165=4,\"von \"&Stammdaten!$N$7,IF(A165=5,\"von \"&Stammdaten!$N$8,\"\")))))","v":""},148]
[{"$f":"IF(Daten!D150=\"-\",\"\",Daten!D150)","v":""},"",{"$f":"IF(Daten!C150=0,\"\",Daten!B150)","v":""},null,null,null,{"$f":"IF(Daten!C150=0,\"\",Daten!C150)","v":""},{"$f":"IF(A166=1,\"von \"&Stammdaten!$N$4,IF(A166=2,\"von \"&Stammdaten!$N$5,IF(A166=3,\"von \"&Stammdaten!$N$6,IF(A166=4,\"von \"&Stammdaten!$N$7,IF(A166=5,\"von \"&Stammdaten!$N$8,\"\")))))","v":""},149]
[{"$f":"IF(Daten!D151=\"-\",\"\",Daten!D151)","v":""},"",{"$f":"IF(Daten!C151=0,\"\",Daten!B151)","v":""},null,null,null,{"$f":"IF(Daten!C151=0,\"\",Daten!C151)","v":""},{"$f":"IF(A167=1,\"von \"&Stammdaten!$N$4,IF(A167=2,\"von \"&Stammdaten!$N$5,IF(A167=3,\"von \"&Stammdaten!$N$6,IF(A167=4,\"von \"&Stammdaten!$N$7,IF(A167=5,\"von \"&Stammdaten!$N$8,\"\")))))","v":""},150]

{"sheet":"Ergebnis Klasse 1","index":7,"n_rows":167,"n_cols":8,"rows_kept":167,"cut":false,"hidden":false,"merged":[[165,1,165,4],[166,1,166,4],[14,0,14,6],[15,0,15,6],[159,1,159,4],[160,1,160,4],[161,1,161,4],[162,1,162,4],[163,1,163,4],[164,1,164,4],[153,1,153,4],[154,1,154,4],[155,1,155,4],[156,1,156,4],[157,1,157,4],[158,1,158,4],[147,1,147,4],[148,1,148,4],[149,1,149,4],[150,1,150,4],[151,1,151,4],[152,1,152,4],[141,1,141,4],[142,1,142,4],[143,1,143,4],[144,1,144,4],[145,1,145,4],[146,1,146,4],[135,1,135,4],[136,1,136,4],[137,1,137,4],[138,1,138,4],[139,1,139,4],[140,1,140,4],[129,1,129,4],[130,1,130,4],[131,1,131,4],[132,1,132,4],[133,1,133,4],[134,1,134,4],[123,1,123,4],[124,1,124,4],[125,1,125,4],[126,1,126,4],[127,1,127,4],[128,1,128,4],[117,1,117,4],[118,1,118,4],[119,1,119,4],[120,1,120,4],[121,1,121,4],[122,1,122,4],[111,1,111,4],[112,1,112,4],[113,1,113,4],[114,1,114,4],[115,1,115,4],[116,1,116,4],[105,1,105,4],[106,1,106,4],[107,1,107,4],[108,1,108,4],[109,1,109,4],[110,1,110,4],[99,1,99,4],[100,1,100,4],[101,1,101,4],[102,1,102,4],[103,1,103,4],[104,1,104,4],[93,1,93,4],[94,1,94,4],[95,1,95,4],[96,1,96,4],[97,1,97,4],[98,1,98,4],[87,1,87,4],[88,1,88,4],[89,1,89,4],[90,1,90,4],[91,1,91,4],[92,1,92,4],[81,1,81,4],[82,1,82,4],[83,1,83,4],[84,1,84,4],[85,1,85,4],[86,1,86,4],[75,1,75,4],[76,1,76,4],[77,1,77,4],[78,1,78,4],[79,1,79,4],[80,1,80,4],[69,1,69,4],[70,1,70,4],[71,1,71,4],[72,1,72,4],[73,1,73,4],[74,1,74,4],[63,1,63,4],[64,1,64,4],[65,1,65,4],[66,1,66,4],[67,1,67,4],[68,1,68,4],[57,1,57,4],[58,1,58,4],[59,1,59,4],[60,1,60,4],[61,1,61,4],[62,1,62,4],[51,1,51,4],[52,1,52,4],[53,1,53,4],[54,1,54,4],[55,1,55,4],[56,1,56,4],[45,1,45,4],[46,1,46,4],[47,1,47,4],[48,1,48,4],[49,1,49,4],[50,1,50,4],[39,1,39,4],[40,1,40,4],[41,1,41,4],[42,1,42,4],[43,1,43,4],[44,1,44,4],[33,1,33,4],[34,1,34,4],[35,1,35,4],[36,1,36,4],[37,1,37,4],[38,1,38,4],[27,1,27,4],[28,1,28,4],[29,1,29,4],[30,1,30,4],[31,1,31,4],[32,1,32,4],[21,1,21,4],[22,1,22,4],[23,1,23,4],[24,1,24,4],[25,1,25,4],[26,1,26,4],[16,1,16,4],[17,1,17,4],[18,1,18,4],[19,1,19,4],[20,1,20,4]]}
[]
[]
[]
[]
[]
[]
[]
[]
[]
[]
[]
[]
[]
[]
[{"$f":"IF(Stammdaten!$C$4=\"\",\"\",CONCATENATE(TEXT(Stammdaten!$C$4,\"TT.MM.JJJJ\"),\" \",\"in \",Stammdaten!$C$5,\" \"\"\",Stammdaten!C8,\"\"\"\"))","v":""}]
[{"$f":"IF(Stammdaten!J4=\"\",\"\",Stammdaten!J4)","v":"Klasse \"mit Prellschlag\""}]
["Platz:","Name:",null,null,null,"Treffer:"]
[{"$f":"IF(Daten!H2=\"\",\"\",1)","v":""},{"$f":"IF(Daten!G2=\"\",\"\",Daten!G2)","v":""},null,null,null,{"$f":"IF(Daten!H2=\"\",\"\",Daten!H2)","v":""},{"$f":"IF(A18=\"\",\"\",\"von \"&Stammdaten!$N$4)","v":""},1]
[{"$f":"IF(F19=\"\",\"\",A18+1)","v":""},{"$f":"IF(Daten!G3=\"\",\"\",Daten!G3)","v":""},null,null,null,{"$f":"IF(Daten!H3=\"\",\"\",Daten!H3)","v":""},{"$f":"IF(A19=\"\",\"\",\"von \"&Stammdaten!$N$4)","v":""},2]
[{"$f":"IF(F20=\"\",\"\",A19+1)","v":""},{"$f":"IF(Daten!G4=\"\",\"\",Daten!G4)","v":""},null,null,null,{"$f":"IF(Daten!H4=\"\",\"\",Daten!H4)","v":""},{"$f":"IF(A20=\"\",\"\",\"von \"&Stammdaten!$N$4)","v":""},3]
["",{"$f":"IF(Daten!G5=\"\",\"\",Daten!G5)","v":""},null,null,null,{"$f":"IF(Daten!H5=\"\",\"\",Daten!H5)","v":""},{"$f":"IF(A21=\"\",\"\",\"von \"&Stammdaten!$N$4)","v":""},4]
["",{"$f":"IF(Daten!G6=\"\",\"\",Daten!G6)","v":""},null,null,null,{"$f":"IF(Daten!H6=\"\",\"\",Daten!H6)","v":""},{"$f":"IF(A22=\"\",\"\",\"von \"&Stammdaten!$N$4)","v":""},5]
["",{"$f":"IF(Daten!G7=\"\",\"\",Daten!G7)","v":""},null,null,null,{"$f":"IF(Daten!H7=\"\",\"\",Daten!H7)","v":""},{"$f":"IF(A23=\"\",\"\",\"von \"&Stammdaten!$N$4)","v":""},6]
["",{"$f":"IF(Daten!G8=\"\",\"\",Daten!G8)","v":""},null,null,null,{"$f":"IF(Daten!H8=\"\",\"\",Daten!H8)","v":""},{"$f":"IF(A24=\"\",\"\",\"von \"&Stammdaten!$N$4)","v":""},7]
["",{"$f":"IF(Daten!G9=\"\",\"\",Daten!G9)","v":""},null,null,null,{"$f":"IF(Daten!H9=\"\",\"\",Daten!H9)","v":""},{"$f":"IF(A25=\"\",\"\",\"von \"&Stammdaten!$N$4)","v":""},8]
["",{"$f":"IF(Daten!G10=\"\",\"\",Daten!G10)","v":""},null,null,null,{"$f":"IF(Daten!H10=\"\",\"\",Daten!H10)","v":""},{"$f":"IF(A26=\"\",\"\",\"von \"&Stammdaten!$N$4)","v":""},9]
["",{"$f":"IF(Daten!G11=\"\",\"\",Daten!G11)","v":""},null,null,null,{"$f":"IF(Daten!H11=\"\",\"\",Daten!H11)","v":""},{"$f":"IF(A27=\"\",\"\",\"von \"&Stammdaten!$N$4)","v":""},10]
["",{"$f":"IF(Daten!G12=\"\",\"\",Daten!G12)","v":""},null,null,null,{"$f":"IF(Daten!H12=\"\",\"\",Daten!H12)","v":""},{"$f":"IF(A28=\"\",\"\",\"von \"&Stammdaten!$N$4)","v":""},11]
["",{"$f":"IF(Daten!G13=\"\",\"\",Daten!G13)","v":""},null,null,null,{"$f":"IF(Daten!H13=\"\",\"\",Daten!H13)","v":""},{"$f":"IF(A29=\"\",\"\",\"von \"&Stammdaten!$N$4)","v":""},12]
["",{"$f":"IF(Daten!G14=\"\",\"\",Daten!G14)","v":""},null,null,null,{"$f":"IF(Daten!H14=\"\",\"\",Daten!H14)","v":""},{"$f":"IF(A30=\"\",\"\",\"von \"&Stammdaten!$N$4)","v":""},13]
["",{"$f":"IF(Daten!G15=\"\",\"\",Daten!G15)","v":""},null,null,null,{"$f":"IF(Daten!H15=\"\",\"\",Daten!H15)","v":""},{"$f":"IF(A31=\"\",\"\",\"von \"&Stammdaten!$N$4)","v":""},14]
["",{"$f":"IF(Daten!G16=\"\",\"\",Daten!G16)","v":""},null,null,null,{"$f":"IF(Daten!H16=\"\",\"\",Daten!H16)","v":""},{"$f":"IF(A32=\"\",\"\",\"von \"&Stammdaten!$N$4)","v":""},15]
["",{"$f":"IF(Daten!G17=\"\",\"\",Daten!G17)","v":""},null,null,null,{"$f":"IF(Daten!H17=\"\",\"\",Daten!H17)","v":""},{"$f":"IF(A33=\"\",\"\",\"von \"&Stammdaten!$N$4)","v":""},16]
["",{"$f":"IF(Daten!G18=\"\",\"\",Daten!G18)","v":""},null,null,null,{"$f":"IF(Daten!H18=\"\",\"\",Daten!H18)","v":""},{"$f":"IF(A34=\"\",\"\",\"von \"&Stammdaten!$N$4)","v":""},17]
["",{"$f":"IF(Daten!G19=\"\",\"\",Daten!G19)","v":""},null,null,null,{"$f":"IF(Daten!H19=\"\",\"\",Daten!H19)","v":""},{"$f":"IF(A35=\"\",\"\",\"von \"&Stammdaten!$N$4)","v":""},18]
["",{"$f":"IF(Daten!G20=\"\",\"\",Daten!G20)","v":""},null,null,null,{"$f":"IF(Daten!H20=\"\",\"\",Daten!H20)","v":""},{"$f":"IF(A36=\"\",\"\",\"von \"&Stammdaten!$N$4)","v":""},19]
["",{"$f":"IF(Daten!G21=\"\",\"\",Daten!G21)","v":""},null,null,null,{"$f":"IF(Daten!H21=\"\",\"\",Daten!H21)","v":""},{"$f":"IF(A37=\"\",\"\",\"von \"&Stammdaten!$N$4)","v":""},20]
["",{"$f":"IF(Daten!G22=\"\",\"\",Daten!G22)","v":""},null,null,null,{"$f":"IF(Daten!H22=\"\",\"\",Daten!H22)","v":""},{"$f":"IF(A38=\"\",\"\",\"von \"&Stammdaten!$N$4)","v":""},21]
["",{"$f":"IF(Daten!G23=\"\",\"\",Daten!G23)","v":""},null,null,null,{"$f":"IF(Daten!H23=\"\",\"\",Daten!H23)","v":""},{"$f":"IF(A39=\"\",\"\",\"von \"&Stammdaten!$N$4)","v":""},22]
["",{"$f":"IF(Daten!G24=\"\",\"\",Daten!G24)","v":""},null,null,null,{"$f":"IF(Daten!H24=\"\",\"\",Daten!H24)","v":""},{"$f":"IF(A40=\"\",\"\",\"von \"&Stammdaten!$N$4)","v":""},23]
["",{"$f":"IF(Daten!G25=\"\",\"\",Daten!G25)","v":""},null,null,null,{"$f":"IF(Daten!H25=\"\",\"\",Daten!H25)","v":""},{"$f":"IF(A41=\"\",\"\",\"von \"&Stammdaten!$N$4)","v":""},24]
["",{"$f":"IF(Daten!G26=\"\",\"\",Daten!G26)","v":""},null,null,null,{"$f":"IF(Daten!H26=\"\",\"\",Daten!H26)","v":""},{"$f":"IF(A42=\"\",\"\",\"von \"&Stammdaten!$N$4)","v":""},25]
["",{"$f":"IF(Daten!G27=\"\",\"\",Daten!G27)","v":""},null,null,null,{"$f":"IF(Daten!H27=\"\",\"\",Daten!H27)","v":""},{"$f":"IF(A43=\"\",\"\",\"von \"&Stammdaten!$N$4)","v":""},26]
["",{"$f":"IF(Daten!G28=\"\",\"\",Daten!G28)","v":""},null,null,null,{"$f":"IF(Daten!H28=\"\",\"\",Daten!H28)","v":""},{"$f":"IF(A44=\"\",\"\",\"von \"&Stammdaten!$N$4)","v":""},27]
["",{"$f":"IF(Daten!G29=\"\",\"\",Daten!G29)","v":""},null,null,null,{"$f":"IF(Daten!H29=\"\",\"\",Daten!H29)","v":""},{"$f":"IF(A45=\"\",\"\",\"von \"&Stammdaten!$N$4)","v":""},28]
["",{"$f":"IF(Daten!G30=\"\",\"\",Daten!G30)","v":""},null,null,null,{"$f":"IF(Daten!H30=\"\",\"\",Daten!H30)","v":""},{"$f":"IF(A46=\"\",\"\",\"von \"&Stammdaten!$N$4)","v":""},29]
["",{"$f":"IF(Daten!G31=\"\",\"\",Daten!G31)","v":""},null,null,null,{"$f":"IF(Daten!H31=\"\",\"\",Daten!H31)","v":""},{"$f":"IF(A47=\"\",\"\",\"von \"&Stammdaten!$N$4)","v":""},30]
["",{"$f":"IF(Daten!G32=\"\",\"\",Daten!G32)","v":""},null,null,null,{"$f":"IF(Daten!H32=\"\",\"\",Daten!H32)","v":""},{"$f":"IF(A48=\"\",\"\",\"von \"&Stammdaten!$N$4)","v":""},31]
["",{"$f":"IF(Daten!G33=\"\",\"\",Daten!G33)","v":""},null,null,null,{"$f":"IF(Daten!H33=\"\",\"\",Daten!H33)","v":""},{"$f":"IF(A49=\"\",\"\",\"von \"&Stammdaten!$N$4)","v":""},32]
["",{"$f":"IF(Daten!G34=\"\",\"\",Daten!G34)","v":""},null,null,null,{"$f":"IF(Daten!H34=\"\",\"\",Daten!H34)","v":""},{"$f":"IF(A50=\"\",\"\",\"von \"&Stammdaten!$N$4)","v":""},33]
["",{"$f":"IF(Daten!G35=\"\",\"\",Daten!G35)","v":""},null,null,null,{"$f":"IF(Daten!H35=\"\",\"\",Daten!H35)","v":""},{"$f":"IF(A51=\"\",\"\",\"von \"&Stammdaten!$N$4)","v":""},34]
["",{"$f":"IF(Daten!G36=\"\",\"\",Daten!G36)","v":""},null,null,null,{"$f":"IF(Daten!H36=\"\",\"\",Daten!H36)","v":""},{"$f":"IF(A52=\"\",\"\",\"von \"&Stammdaten!$N$4)","v":""},35]
["",{"$f":"IF(Daten!G37=\"\",\"\",Daten!G37)","v":""},null,null,null,{"$f":"IF(Daten!H37=\"\",\"\",Daten!H37)","v":""},{"$f":"IF(A53=\"\",\"\",\"von \"&Stammdaten!$N$4)","v":""},36]
["",{"$f":"IF(Daten!G38=\"\",\"\",Daten!G38)","v":""},null,null,null,{"$f":"IF(Daten!H38=\"\",\"\",Daten!H38)","v":""},{"$f":"IF(A54=\"\",\"\",\"von \"&Stammdaten!$N$4)","v":""},37]
["",{"$f":"IF(Daten!G39=\"\",\"\",Daten!G39)","v":""},null,null,null,{"$f":"IF(Daten!H39=\"\",\"\",Daten!H39)","v":""},{"$f":"IF(A55=\"\",\"\",\"von \"&Stammdaten!$N$4)","v":""},38]
["",{"$f":"IF(Daten!G40=\"\",\"\",Daten!G40)","v":""},null,null,null,{"$f":"IF(Daten!H40=\"\",\"\",Daten!H40)","v":""},{"$f":"IF(A56=\"\",\"\",\"von \"&Stammdaten!$N$4)","v":""},39]
["",{"$f":"IF(Daten!G41=\"\",\"\",Daten!G41)","v":""},null,null,null,{"$f":"IF(Daten!H41=\"\",\"\",Daten!H41)","v":""},{"$f":"IF(A57=\"\",\"\",\"von \"&Stammdaten!$N$4)","v":""},40]
["",{"$f":"IF(Daten!G42=\"\",\"\",Daten!G42)","v":""},null,null,null,{"$f":"IF(Daten!H42=\"\",\"\",Daten!H42)","v":""},{"$f":"IF(A58=\"\",\"\",\"von \"&Stammdaten!$N$4)","v":""},41]
["",{"$f":"IF(Daten!G43=\"\",\"\",Daten!G43)","v":""},null,null,null,{"$f":"IF(Daten!H43=\"\",\"\",Daten!H43)","v":""},{"$f":"IF(A59=\"\",\"\",\"von \"&Stammdaten!$N$4)","v":""},42]
["",{"$f":"IF(Daten!G44=\"\",\"\",Daten!G44)","v":""},null,null,null,{"$f":"IF(Daten!H44=\"\",\"\",Daten!H44)","v":""},{"$f":"IF(A60=\"\",\"\",\"von \"&Stammdaten!$N$4)","v":""},43]
["",{"$f":"IF(Daten!G45=\"\",\"\",Daten!G45)","v":""},null,null,null,{"$f":"IF(Daten!H45=\"\",\"\",Daten!H45)","v":""},{"$f":"IF(A61=\"\",\"\",\"von \"&Stammdaten!$N$4)","v":""},44]
["",{"$f":"IF(Daten!G46=\"\",\"\",Daten!G46)","v":""},null,null,null,{"$f":"IF(Daten!H46=\"\",\"\",Daten!H46)","v":""},{"$f":"IF(A62=\"\",\"\",\"von \"&Stammdaten!$N$4)","v":""},45]
["",{"$f":"IF(Daten!G47=\"\",\"\",Daten!G47)","v":""},null,null,null,{"$f":"IF(Daten!H47=\"\",\"\",Daten!H47)","v":""},{"$f":"IF(A63=\"\",\"\",\"von \"&Stammdaten!$N$4)","v":""},46]
["",{"$f":"IF(Daten!G48=\"\",\"\",Daten!G48)","v":""},null,null,null,{"$f":"IF(Daten!H48=\"\",\"\",Daten!H48)","v":""},{"$f":"IF(A64=\"\",\"\",\"von \"&Stammdaten!$N$4)","v":""},47]
["",{"$f":"IF(Daten!G49=\"\",\"\",Daten!G49)","v":""},null,null,null,{"$f":"IF(Daten!H49=\"\",\"\",Daten!H49)","v":""},{"$f":"IF(A65=\"\",\"\",\"von \"&Stammdaten!$N$4)","v":""},48]
["",{"$f":"IF(Daten!G50=\"\",\"\",Daten!G50)","v":""},null,null,null,{"$f":"IF(Daten!H50=\"\",\"\",Daten!H50)","v":""},{"$f":"IF(A66=\"\",\"\",\"von \"&Stammdaten!$N$4)","v":""},49]
["",{"$f":"IF(Daten!G51=\"\",\"\",Daten!G51)","v":""},null,null,null,{"$f":"IF(Daten!H51=\"\",\"\",Daten!H51)","v":""},{"$f":"IF(A67=\"\",\"\",\"von \"&Stammdaten!$N$4)","v":""},50]
["",{"$f":"IF(Daten!G52=\"\",\"\",Daten!G52)","v":""},null,null,null,{"$f":"IF(Daten!H52=\"\",\"\",Daten!H52)","v":""},{"$f":"IF(A68=\"\",\"\",\"von \"&Stammdaten!$N$4)","v":""},51]
["",{"$f":"IF(Daten!G53=\"\",\"\",Daten!G53)","v":""},null,null,null,{"$f":"IF(Daten!H53=\"\",\"\",Daten!H53)","v":""},{"$f":"IF(A69=\"\",\"\",\"von \"&Stammdaten!$N$4)","v":""},52]
["",{"$f":"IF(Daten!G54=\"\",\"\",Daten!G54)","v":""},null,null,null,{"$f":"IF(Daten!H54=\"\",\"\",Daten!H54)","v":""},{"$f":"IF(A70=\"\",\"\",\"von \"&Stammdaten!$N$4)","v":""},53]
["",{"$f":"IF(Daten!G55=\"\",\"\",Daten!G55)","v":""},null,null,null,{"$f":"IF(Daten!H55=\"\",\"\",Daten!H55)","v":""},{"$f":"IF(A71=\"\",\"\",\"von \"&Stammdaten!$N$4)","v":""},54]
["",{"$f":"IF(Daten!G56=\"\",\"\",Daten!G56)","v":""},null,null,null,{"$f":"IF(Daten!H56=\"\",\"\",Daten!H56)","v":""},{"$f":"IF(A72=\"\",\"\",\"von \"&Stammdaten!$N$4)","v":""},55]
["",{"$f":"IF(Daten!G57=\"\",\"\",Daten!G57)","v":""},null,null,null,{"$f":"IF(Daten!H57=\"\",\"\",Daten!H57)","v":""},{"$f":"IF(A73=\"\",\"\",\"von \"&Stammdaten!$N$4)","v":""},56]
["",{"$f":"IF(Daten!G58=\"\",\"\",Daten!G58)","v":""},null,null,null,{"$f":"IF(Daten!H58=\"\",\"\",Daten!H58)","v":""},{"$f":"IF(A74=\"\",\"\",\"von \"&Stammdaten!$N$4)","v":""},57]
["",{"$f":"IF(Daten!G59=\"\",\"\",Daten!G59)","v":""},null,null,null,{"$f":"IF(Daten!H59=\"\",\"\",Daten!H59)","v":""},{"$f":"IF(A75=\"\",\"\",\"von \"&Stammdaten!$N$4)","v":""},58]
["",{"$f":"IF(Daten!G60=\"\",\"\",Daten!G60)","v":""},null,null,null,{"$f":"IF(Daten!H60=\"\",\"\",Daten!H60)","v":""},{"$f":"IF(A76=\"\",\"\",\"von \"&Stammdaten!$N$4)","v":""},59]
["",{"$f":"IF(Daten!G61=\"\",\"\",Daten!G61)","v":""},null,null,null,{"$f":"IF(Daten!H61=\"\",\"\",Daten!H61)","v":""},{"$f":"IF(A77=\"\",\"\",\"von \"&Stammdaten!$N$4)","v":""},60]
["",{"$f":"IF(Daten!G62=\"\",\"\",Daten!G62)","v":""},null,null,null,{"$f":"IF(Daten!H62=\"\",\"\",Daten!H62)","v":""},{"$f":"IF(A78=\"\",\"\",\"von \"&Stammdaten!$N$4)","v":""},61]
["",{"$f":"IF(Daten!G63=\"\",\"\",Daten!G63)","v":""},null,null,null,{"$f":"IF(Daten!H63=\"\",\"\",Daten!H63)","v":""},{"$f":"IF(A79=\"\",\"\",\"von \"&Stammdaten!$N$4)","v":""},62]
["",{"$f":"IF(Daten!G64=\"\",\"\",Daten!G64)","v":""},null,null,null,{"$f":"IF(Daten!H64=\"\",\"\",Daten!H64)","v":""},{"$f":"IF(A80=\"\",\"\",\"von \"&Stammdaten!$N$4)","v":""},63]
["",{"$f":"IF(Daten!G65=\"\",\"\",Daten!G65)","v":""},null,null,null,{"$f":"IF(Daten!H65=\"\",\"\",Daten!H65)","v":""},{"$f":"IF(A81=\"\",\"\",\"von \"&Stammdaten!$N$4)","v":""},64]
["",{"$f":"IF(Daten!G66=\"\",\"\",Daten!G66)","v":""},null,null,null,{"$f":"IF(Daten!H66=\"\",\"\",Daten!H66)","v":""},{"$f":"IF(A82=\"\",\"\",\"von \"&Stammdaten!$N$4)","v":""},65]
["",{"$f":"IF(Daten!G67=\"\",\"\",Daten!G67)","v":""},null,null,null,{"$f":"IF(Daten!H67=\"\",\"\",Daten!H67)","v":""},{"$f":"IF(A83=\"\",\"\",\"von \"&Stammdaten!$N$4)","v":""},66]
[{"$f":"IF(F84=\"\",\"\",A83+1)","v":""},{"$f":"IF(Daten!G68=\"\",\"\",Daten!G68)","v":""},null,null,null,{"$f":"IF(Daten!H68=\"\",\"\",Daten!H68)","v":""},{"$f":"IF(A84=\"\",\"\",\"von \"&Stammdaten!$N$4)","v":""},67]
["",{"$f":"IF(Daten!G69=\"\",\"\",Daten!G69)","v":""},null,null,null,{"$f":"IF(Daten!H69=\"\",\"\",Daten!H69)","v":""},{"$f":"IF(A85=\"\",\"\",\"von \"&Stammdaten!$N$4)","v":""},68]
["",{"$f":"IF(Daten!G70=\"\",\"\",Daten!G70)","v":""},null,null,null,{"$f":"IF(Daten!H70=\"\",\"\",Daten!H70)","v":""},{"$f":"IF(A86=\"\",\"\",\"von \"&Stammdaten!$N$4)","v":""},69]
["",{"$f":"IF(Daten!G71=\"\",\"\",Daten!G71)","v":""},null,null,null,{"$f":"IF(Daten!H71=\"\",\"\",Daten!H71)","v":""},{"$f":"IF(A87=\"\",\"\",\"von \"&Stammdaten!$N$4)","v":""},70]
["",{"$f":"IF(Daten!G72=\"\",\"\",Daten!G72)","v":""},null,null,null,{"$f":"IF(Daten!H72=\"\",\"\",Daten!H72)","v":""},{"$f":"IF(A88=\"\",\"\",\"von \"&Stammdaten!$N$4)","v":""},71]
["",{"$f":"IF(Daten!G73=\"\",\"\",Daten!G73)","v":""},null,null,null,{"$f":"IF(Daten!H73=\"\",\"\",Daten!H73)","v":""},{"$f":"IF(A89=\"\",\"\",\"von \"&Stammdaten!$N$4)","v":""},72]
["",{"$f":"IF(Daten!G74=\"\",\"\",Daten!G74)","v":""},null,null,null,{"$f":"IF(Daten!H74=\"\",\"\",Daten!H74)","v":""},{"$f":"IF(A90=\"\",\"\",\"von \"&Stammdaten!$N$4)","v":""},73]
["",{"$f":"IF(Daten!G75=\"\",\"\",Daten!G75)","v":""},null,null,null,{"$f":"IF(Daten!H75=\"\",\"\",Daten!H75)","v":""},{"$f":"IF(A91=\"\",\"\",\"von \"&Stammdaten!$N$4)","v":""},74]
["",{"$f":"IF(Daten!G76=\"\",\"\",Daten!G76)","v":""},null,null,null,{"$f":"IF(Daten!H76=\"\",\"\",Daten!H76)","v":""},{"$f":"IF(A92=\"\",\"\",\"von \"&Stammdaten!$N$4)","v":""},75]
["",{"$f":"IF(Daten!G77=\"\",\"\",Daten!G77)","v":""},null,null,null,{"$f":"IF(Daten!H77=\"\",\"\",Daten!H77)","v":""},{"$f":"IF(A93=\"\",\"\",\"von \"&Stammdaten!$N$4)","v":""},76]
["",{"$f":"IF(Daten!G78=\"\",\"\",Daten!G78)","v":""},null,null,null,{"$f":"IF(Daten!H78=\"\",\"\",Daten!H78)","v":""},{"$f":"IF(A94=\"\",\"\",\"von \"&Stammdaten!$N$4)","v":""},77]
["",{"$f":"IF(Daten!G79=\"\",\"\",Daten!G79)","v":""},null,null,null,{"$f":"IF(Daten!H79=\"\",\"\",Daten!H79)","v":""},{"$f":"IF(A95=\"\",\"\",\"von \"&Stammdaten!$N$4)","v":""},78]
["",{"$f":"IF(Daten!G80=\"\",\"\",Daten!G80)","v":""},null,null,null,{"$f":"IF(Daten!H80=\"\",\"\",Daten!H80)","v":""},{"$f":"IF(A96=\"\",\"\",\"von \"&Stammdaten!$N$4)","v":""},79]
["",{"$f":"IF(Daten!G81=\"\",\"\",Daten!G81)","v":""},null,null,null,{"$f":"IF(Daten!H81=\"\",\"\",Daten!H81)","v":""},{"$f":"IF(A97=\"\",\"\",\"von \"&Stammdaten!$N$4)","v":""},80]
["",{"$f":"IF(Daten!G82=\"\",\"\",Daten!G82)","v":""},null,null,null,{"$f":"IF(Daten!H82=\"\",\"\",Daten!H82)","v":""},{"$f":"IF(A98=\"\",\"\",\"von \"&Stammdaten!$N$4)","v":""},81]
["",{"$f":"IF(Daten!G83=\"\",\"\",Daten!G83)","v":""},null,null,null,{"$f":"IF(Daten!H83=\"\",\"\",Daten!H83)","v":""},{"$f":"IF(A99=\"\",\"\",\"von \"&Stammdaten!$N$4)","v":""},82]
["",{"$f":"IF(Daten!G84=\"\",\"\",Daten!G84)","v":""},null,null,null,{"$f":"IF(Daten!H84=\"\",\"\",Daten!H84)","v":""},{"$f":"IF(A100=\"\",\"\",\"von \"&Stammdaten!$N$4)","v":""},83]
["",{"$f":"IF(Daten!G85=\"\",\"\",Daten!G85)","v":""},null,null,null,{"$f":"IF(Daten!H85=\"\",\"\",Daten!H85)","v":""},{"$f":"IF(A101=\"\",\"\",\"von \"&Stammdaten!$N$4)","v":""},84]
["",{"$f":"IF(Daten!G86=\"\",\"\",Daten!G86)","v":""},null,null,null,{"$f":"IF(Daten!H86=\"\",\"\",Daten!H86)","v":""},{"$f":"IF(A102=\"\",\"\",\"von \"&Stammdaten!$N$4)","v":""},85]
["",{"$f":"IF(Daten!G87=\"\",\"\",Daten!G87)","v":""},null,null,null,{"$f":"IF(Daten!H87=\"\",\"\",Daten!H87)","v":""},{"$f":"IF(A103=\"\",\"\",\"von \"&Stammdaten!$N$4)","v":""},86]
["",{"$f":"IF(Daten!G88=\"\",\"\",Daten!G88)","v":""},null,null,null,{"$f":"IF(Daten!H88=\"\",\"\",Daten!H88)","v":""},{"$f":"IF(A104=\"\",\"\",\"von \"&Stammdaten!$N$4)","v":""},87]
["",{"$f":"IF(Daten!G89=\"\",\"\",Daten!G89)","v":""},null,null,null,{"$f":"IF(Daten!H89=\"\",\"\",Daten!H89)","v":""},{"$f":"IF(A105=\"\",\"\",\"von \"&Stammdaten!$N$4)","v":""},88]
["",{"$f":"IF(Daten!G90=\"\",\"\",Daten!G90)","v":""},null,null,null,{"$f":"IF(Daten!H90=\"\",\"\",Daten!H90)","v":""},{"$f":"IF(A106=\"\",\"\",\"von \"&Stammdaten!$N$4)","v":""},89]
["",{"$f":"IF(Daten!G91=\"\",\"\",Daten!G91)","v":""},null,null,null,{"$f":"IF(Daten!H91=\"\",\"\",Daten!H91)","v":""},{"$f":"IF(A107=\"\",\"\",\"von \"&Stammdaten!$N$4)","v":""},90]
["",{"$f":"IF(Daten!G92=\"\",\"\",Daten!G92)","v":""},null,null,null,{"$f":"IF(Daten!H92=\"\",\"\",Daten!H92)","v":""},{"$f":"IF(A108=\"\",\"\",\"von \"&Stammdaten!$N$4)","v":""},91]
["",{"$f":"IF(Daten!G93=\"\",\"\",Daten!G93)","v":""},null,null,null,{"$f":"IF(Daten!H93=\"\",\"\",Daten!H93)","v":""},{"$f":"IF(A109=\"\",\"\",\"von \"&Stammdaten!$N$4)","v":""},92]
["",{"$f":"IF(Daten!G94=\"\",\"\",Daten!G94)","v":""},null,null,null,{"$f":"IF(Daten!H94=\"\",\"\",Daten!H94)","v":""},{"$f":"IF(A110=\"\",\"\",\"von \"&Stammdaten!$N$4)","v":""},93]
["",{"$f":"IF(Daten!G95=\"\",\"\",Daten!G95)","v":""},null,null,null,{"$f":"IF(Daten!H95=\"\",\"\",Daten!H95)","v":""},{"$f":"IF(A111=\"\",\"\",\"von \"&Stammdaten!$N$4)","v":""},94]
["",{"$f":"IF(Daten!G96=\"\",\"\",Daten!G96)","v":""},null,null,null,{"$f":"IF(Daten!H96=\"\",\"\",Daten!H96)","v":""},{"$f":"IF(A112=\"\",\"\",\"von \"&Stammdaten!$N$4)","v":""},95]
["",{"$f":"IF(Daten!G97=\"\",\"\",Daten!G97)","v":""},null,null,null,{"$f":"IF(Daten!H97=\"\",\"\",Daten!H97)","v":""},{"$f":"IF(A113=\"\",\"\",\"von \"&Stammdaten!$N$4)","v":""},96]
["",{"$f":"IF(Daten!G98=\"\",\"\",Daten!G98)","v":""},null,null,null,{"$f":"IF(Daten!H98=\"\",\"\",Daten!H98)","v":""},{"$f":"IF(A114=\"\",\"\",\"von \"&Stammdaten!$N$4)","v":""},97]
["",{"$f":"IF(Daten!G99=\"\",\"\",Daten!G99)","v":""},null,null,null,{"$f":"IF(Daten!H99=\"\",\"\",Daten!H99)","v":""},{"$f":"IF(A115=\"\",\"\",\"von \"&Stammdaten!$N$4)","v":""},98]
["",{"$f":"IF(Daten!G100=\"\",\"\",Daten!G100)","v":""},null,null,null,{"$f":"IF(Daten!H100=\"\",\"\",Daten!H100)","v":""},{"$f":"IF(A116=\"\",\"\",\"von \"&Stammdaten!$N$4)","v":""},99]
["",{"$f":"IF(Daten!G101=\"\",\"\",Daten!G101)","v":""},null,null,null,{"$f":"IF(Daten!H101=\"\",\"\",Daten!H101)","v":""},{"$f":"IF(A117=\"\",\"\",\"von \"&Stammdaten!$N$4)","v":""},100]
["",{"$f":"IF(Daten!G102=\"\",\"\",Daten!G102)","v":""},null,null,null,{"$f":"IF(Daten!H102=\"\",\"\",Daten!H102)","v":""},{"$f":"IF(A118=\"\",\"\",\"von \"&Stammdaten!$N$4)","v":""},101]
["",{"$f":"IF(Daten!G103=\"\",\"\",Daten!G103)","v":""},null,null,null,{"$f":"IF(Daten!H103=\"\",\"\",Daten!H103)","v":""},{"$f":"IF(A119=\"\",\"\",\"von \"&Stammdaten!$N$4)","v":""},102]
["",{"$f":"IF(Daten!G104=\"\",\"\",Daten!G104)","v":""},null,null,null,{"$f":"IF(Daten!H104=\"\",\"\",Daten!H104)","v":""},{"$f":"IF(A120=\"\",\"\",\"von \"&Stammdaten!$N$4)","v":""},103]
["",{"$f":"IF(Daten!G105=\"\",\"\",Daten!G105)","v":""},null,null,null,{"$f":"IF(Daten!H105=\"\",\"\",Daten!H105)","v":""},{"$f":"IF(A121=\"\",\"\",\"von \"&Stammdaten!$N$4)","v":""},104]
["",{"$f":"IF(Daten!G106=\"\",\"\",Daten!G106)","v":""},null,null,null,{"$f":"IF(Daten!H106=\"\",\"\",Daten!H106)","v":""},{"$f":"IF(A122=\"\",\"\",\"von \"&Stammdaten!$N$4)","v":""},105]
["",{"$f":"IF(Daten!G107=\"\",\"\",Daten!G107)","v":""},null,null,null,{"$f":"IF(Daten!H107=\"\",\"\",Daten!H107)","v":""},{"$f":"IF(A123=\"\",\"\",\"von \"&Stammdaten!$N$4)","v":""},106]
["",{"$f":"IF(Daten!G108=\"\",\"\",Daten!G108)","v":""},null,null,null,{"$f":"IF(Daten!H108=\"\",\"\",Daten!H108)","v":""},{"$f":"IF(A124=\"\",\"\",\"von \"&Stammdaten!$N$4)","v":""},107]
["",{"$f":"IF(Daten!G109=\"\",\"\",Daten!G109)","v":""},null,null,null,{"$f":"IF(Daten!H109=\"\",\"\",Daten!H109)","v":""},{"$f":"IF(A125=\"\",\"\",\"von \"&Stammdaten!$N$4)","v":""},108]
["",{"$f":"IF(Daten!G110=\"\",\"\",Daten!G110)","v":""},null,null,null,{"$f":"IF(Daten!H110=\"\",\"\",Daten!H110)","v":""},{"$f":"IF(A126=\"\",\"\",\"von \"&Stammdaten!$N$4)","v":""},109]
["",{"$f":"IF(Daten!G111=\"\",\"\",Daten!G111)","v":""},null,null,null,{"$f":"IF(Daten!H111=\"\",\"\",Daten!H111)","v":""},{"$f":"IF(A127=\"\",\"\",\"von \"&Stammdaten!$N$4)","v":""},110]
["",{"$f":"IF(Daten!G112=\"\",\"\",Daten!G112)","v":""},null,null,null,{"$f":"IF(Daten!H112=\"\",\"\",Daten!H112)","v":""},{"$f":"IF(A128=\"\",\"\",\"von \"&Stammdaten!$N$4)","v":""},111]
["",{"$f":"IF(Daten!G113=\"\",\"\",Daten!G113)","v":""},null,null,null,{"$f":"IF(Daten!H113=\"\",\"\",Daten!H113)","v":""},{"$f":"IF(A129=\"\",\"\",\"von \"&Stammdaten!$N$4)","v":""},112]
["",{"$f":"IF(Daten!G114=\"\",\"\",Daten!G114)","v":""},null,null,null,{"$f":"IF(Daten!H114=\"\",\"\",Daten!H114)","v":""},{"$f":"IF(A130=\"\",\"\",\"von \"&Stammdaten!$N$4)","v":""},113]
["",{"$f":"IF(Daten!G115=\"\",\"\",Daten!G115)","v":""},null,null,null,{"$f":"IF(Daten!H115=\"\",\"\",Daten!H115)","v":""},{"$f":"IF(A131=\"\",\"\",\"von \"&Stammdaten!$N$4)","v":""},114]
["",{"$f":"IF(Daten!G116=\"\",\"\",Daten!G116)","v":""},null,null,null,{"$f":"IF(Daten!H116=\"\",\"\",Daten!H116)","v":""},{"$f":"IF(A132=\"\",\"\",\"von \"&Stammdaten!$N$4)","v":""},115]
["",{"$f":"IF(Daten!G117=\"\",\"\",Daten!G117)","v":""},null,null,null,{"$f":"IF(Daten!H117=\"\",\"\",Daten!H117)","v":""},{"$f":"IF(A133=\"\",\"\",\"von \"&Stammdaten!$N$4)","v":""},116]
["",{"$f":"IF(Daten!G118=\"\",\"\",Daten!G118)","v":""},null,null,null,{"$f":"IF(Daten!H118=\"\",\"\",Daten!H118)","v":""},{"$f":"IF(A134=\"\",\"\",\"von \"&Stammdaten!$N$4)","v":""},117]
["",{"$f":"IF(Daten!G119=\"\",\"\",Daten!G119)","v":""},null,null,null,{"$f":"IF(Daten!H119=\"\",\"\",Daten!H119)","v":""},{"$f":"IF(A135=\"\",\"\",\"von \"&Stammdaten!$N$4)","v":""},118]
["",{"$f":"IF(Daten!G120=\"\",\"\",Daten!G120)","v":""},null,null,null,{"$f":"IF(Daten!H120=\"\",\"\",Daten!H120)","v":""},{"$f":"IF(A136=\"\",\"\",\"von \"&Stammdaten!$N$4)","v":""},119]
["",{"$f":"IF(Daten!G121=\"\",\"\",Daten!G121)","v":""},null,null,null,{"$f":"IF(Daten!H121=\"\",\"\",Daten!H121)","v":""},{"$f":"IF(A137=\"\",\"\",\"von \"&Stammdaten!$N$4)","v":""},120]
["",{"$f":"IF(Daten!G122=\"\",\"\",Daten!G122)","v":""},null,null,null,{"$f":"IF(Daten!H122=\"\",\"\",Daten!H122)","v":""},{"$f":"IF(A138=\"\",\"\",\"von \"&Stammdaten!$N$4)","v":""},121]
["",{"$f":"IF(Daten!G123=\"\",\"\",Daten!G123)","v":""},null,null,null,{"$f":"IF(Daten!H123=\"\",\"\",Daten!H123)","v":""},{"$f":"IF(A139=\"\",\"\",\"von \"&Stammdaten!$N$4)","v":""},122]
["",{"$f":"IF(Daten!G124=\"\",\"\",Daten!G124)","v":""},null,null,null,{"$f":"IF(Daten!H124=\"\",\"\",Daten!H124)","v":""},{"$f":"IF(A140=\"\",\"\",\"von \"&Stammdaten!$N$4)","v":""},123]
["",{"$f":"IF(Daten!G125=\"\",\"\",Daten!G125)","v":""},null,null,null,{"$f":"IF(Daten!H125=\"\",\"\",Daten!H125)","v":""},{"$f":"IF(A141=\"\",\"\",\"von \"&Stammdaten!$N$4)","v":""},124]
["",{"$f":"IF(Daten!G126=\"\",\"\",Daten!G126)","v":""},null,null,null,{"$f":"IF(Daten!H126=\"\",\"\",Daten!H126)","v":""},{"$f":"IF(A142=\"\",\"\",\"von \"&Stammdaten!$N$4)","v":""},125]
["",{"$f":"IF(Daten!G127=\"\",\"\",Daten!G127)","v":""},null,null,null,{"$f":"IF(Daten!H127=\"\",\"\",Daten!H127)","v":""},{"$f":"IF(A143=\"\",\"\",\"von \"&Stammdaten!$N$4)","v":""},126]
["",{"$f":"IF(Daten!G128=\"\",\"\",Daten!G128)","v":""},null,null,null,{"$f":"IF(Daten!H128=\"\",\"\",Daten!H128)","v":""},{"$f":"IF(A144=\"\",\"\",\"von \"&Stammdaten!$N$4)","v":""},127]
["",{"$f":"IF(Daten!G129=\"\",\"\",Daten!G129)","v":""},null,null,null,{"$f":"IF(Daten!H129=\"\",\"\",Daten!H129)","v":""},{"$f":"IF(A145=\"\",\"\",\"von \"&Stammdaten!$N$4)","v":""},128]
["",{"$f":"IF(Daten!G130=\"\",\"\",Daten!G130)","v":""},null,null,null,{"$f":"IF(Daten!H130=\"\",\"\",Daten!H130)","v":""},{"$f":"IF(A146=\"\",\"\",\"von \"&Stammdaten!$N$4)","v":""},129]
["",{"$f":"IF(Daten!G131=\"\",\"\",Daten!G131)","v":""},null,null,null,{"$f":"IF(Daten!H131=\"\",\"\",Daten!H131)","v":""},{"$f":"IF(A147=\"\",\"\",\"von \"&Stammdaten!$N$4)","v":""},130]
[{"$f":"IF(F148=\"\",\"\",A147+1)","v":""},{"$f":"IF(Daten!G132=\"\",\"\",Daten!G132)","v":""},null,null,null,{"$f":"IF(Daten!H132=\"\",\"\",Daten!H132)","v":""},{"$f":"IF(A148=\"\",\"\",\"von \"&Stammdaten!$N$4)","v":""},131]
["",{"$f":"IF(Daten!G133=\"\",\"\",Daten!G133)","v":""},null,null,null,{"$f":"IF(Daten!H133=\"\",\"\",Daten!H133)","v":""},{"$f":"IF(A149=\"\",\"\",\"von \"&Stammdaten!$N$4)","v":""},132]
["",{"$f":"IF(Daten!G134=\"\",\"\",Daten!G134)","v":""},null,null,null,{"$f":"IF(Daten!H134=\"\",\"\",Daten!H134)","v":""},{"$f":"IF(A150=\"\",\"\",\"von \"&Stammdaten!$N$4)","v":""},133]
["",{"$f":"IF(Daten!G135=\"\",\"\",Daten!G135)","v":""},null,null,null,{"$f":"IF(Daten!H135=\"\",\"\",Daten!H135)","v":""},{"$f":"IF(A151=\"\",\"\",\"von \"&Stammdaten!$N$4)","v":""},134]
["",{"$f":"IF(Daten!G136=\"\",\"\",Daten!G136)","v":""},null,null,null,{"$f":"IF(Daten!H136=\"\",\"\",Daten!H136)","v":""},{"$f":"IF(A152=\"\",\"\",\"von \"&Stammdaten!$N$4)","v":""},135]
["",{"$f":"IF(Daten!G137=\"\",\"\",Daten!G137)","v":""},null,null,null,{"$f":"IF(Daten!H137=\"\",\"\",Daten!H137)","v":""},{"$f":"IF(A153=\"\",\"\",\"von \"&Stammdaten!$N$4)","v":""},136]
["",{"$f":"IF(Daten!G138=\"\",\"\",Daten!G138)","v":""},null,null,null,{"$f":"IF(Daten!H138=\"\",\"\",Daten!H138)","v":""},{"$f":"IF(A154=\"\",\"\",\"von \"&Stammdaten!$N$4)","v":""},137]
["",{"$f":"IF(Daten!G139=\"\",\"\",Daten!G139)","v":""},null,null,null,{"$f":"IF(Daten!H139=\"\",\"\",Daten!H139)","v":""},{"$f":"IF(A155=\"\",\"\",\"von \"&Stammdaten!$N$4)","v":""},138]
["",{"$f":"IF(Daten!G140=\"\",\"\",Daten!G140)","v":""},null,null,null,{"$f":"IF(Daten!H140=\"\",\"\",Daten!H140)","v":""},{"$f":"IF(A156=\"\",\"\",\"von \"&Stammdaten!$N$4)","v":""},139]
["",{"$f":"IF(Daten!G141=\"\",\"\",Daten!G141)","v":""},null,null,null,{"$f":"IF(Daten!H141=\"\",\"\",Daten!H141)","v":""},{"$f":"IF(A157=\"\",\"\",\"von \"&Stammdaten!$N$4)","v":""},140]
["",{"$f":"IF(Daten!G142=\"\",\"\",Daten!G142)","v":""},null,null,null,{"$f":"IF(Daten!H142=\"\",\"\",Daten!H142)","v":""},{"$f":"IF(A158=\"\",\"\",\"von \"&Stammdaten!$N$4)","v":""},141]
["",{"$f":"IF(Daten!G143=\"\",\"\",Daten!G143)","v":""},null,null,null,{"$f":"IF(Daten!H143=\"\",\"\",Daten!H143)","v":""},{"$f":"IF(A159=\"\",\"\",\"von \"&Stammdaten!$N$4)","v":""},142]
["",{"$f":"IF(Daten!G144=\"\",\"\",Daten!G144)","v":""},null,null,null,{"$f":"IF(Daten!H144=\"\",\"\",Daten!H144)","v":""},{"$f":"IF(A160=\"\",\"\",\"von \"&Stammdaten!$N$4)","v":""},143]
["",{"$f":"IF(Daten!G145=\"\",\"\",Daten!G145)","v":""},null,null,null,{"$f":"IF(Daten!H145=\"\",\"\",Daten!H145)","v":""},{"$f":"IF(A161=\"\",\"\",\"von \"&Stammdaten!$N$4)","v":""},144]
["",{"$f":"IF(Daten!G146=\"\",\"\",Daten!G146)","v":""},null,null,null,{"$f":"IF(Daten!H146=\"\",\"\",Daten!H146)","v":""},{"$f":"IF(A162=\"\",\"\",\"von \"&Stammdaten!$N$4)","v":""},145]
["",{"$f":"IF(Daten!G147=\"\",\"\",Daten!G147)","v":""},null,null,null,{"$f":"IF(Daten!H147=\"\",\"\",Daten!H147)","v":""},{"$f":"IF(A163=\"\",\"\",\"von \"&Stammdaten!$N$4)","v":""},146]
["",{"$f":"IF(Daten!G148=\"\",\"\",Daten!G148)","v":""},null,null,null,{"$f":"IF(Daten!H148=\"\",\"\",Daten!H148)","v":""},{"$f":"IF(A164=\"\",\"\",\"von \"&Stammdaten!$N$4)","v":""},147]
["",{"$f":"IF(Daten!G149=\"\",\"\",Daten!G149)","v":""},null,null,null,{"$f":"IF(Daten!H149=\"\",\"\",Daten!H149)","v":""},{"$f":"IF(A165=\"\",\"\",\"von \"&Stammdaten!$N$4)","v":""},148]
["",{"$f":"IF(Daten!G150=\"\",\"\",Daten!G150)","v":""},null,null,null,{"$f":"IF(Daten!H150=\"\",\"\",Daten!H150)","v":""},{"$f":"IF(A166=\"\",\"\",\"von \"&Stammdaten!$N$4)","v":""},149]
["",{"$f":"IF(Daten!G151=\"\",\"\",Daten!G151)","v":""},null,null,null,{"$f":"IF(Daten!H151=\"\",\"\",Daten!H151)","v":""},{"$f":"IF(A167=\"\",\"\",\"von \"&Stammdaten!$N$4)","v":""},150]

{"sheet":"K1 Urkunde-Platz 1","index":8,"n_rows":39,"n_cols":12,"rows_kept":39,"cut":false,"hidden":false,"merged":[[13,2,16,15],[38,11,40,16],[31,8,31,16],[25,2,25,14],[26,2,26,15],[27,2,27,15],[28,2,28,15],[29,2,29,15],[30,2,30,15],[32,2,32,15],[33,2,33,15],[34,2,34,15],[37,9,37,16]]}
[]
[]
[]
[]
[]
[]
[]
[]
[]
[]
[]
[]
[]
[null,null,{"$f":"IF(Stammdaten!$C$8=\"\",\"\",Stammdaten!$C$8)","v":"Dat Groote Püüster Scheeten"}]
[]
[]
[]
[]
[]
[]
[]
[]
[]
[]
[]
[]
[]
[]
[]
[null,null,{"$f":"Stammdaten!$J$10","v":"Hiermit verleiht der SV-Soderstorf"}]
[null,null,{"$f":"IF(Daten!$G$2=\"\",\"\",Daten!$G$2)","v":""}]
[null,null,"den 1. Platz in der",null,null,null,null,null,{"$f":"Stammdaten!$J$4","v":"Klasse \"mit Prellschlag\""}]
[null,null,"mit einer Trefferleistung von"]
[null,null,{"$f":"IF(Daten!$H$2=\"\",\"\",Daten!$H$2)","v":""}]
[null,null,"diese Urkunde"]
[]
[]
[null,null,null,null,null,null,null,null,null,{"$f":"IF(Stammdaten!$C$4=\"\",\"\",CONCATENATE(Stammdaten!$C$5,\", den\",\" \",TEXT(Stammdaten!$C$4,\"TT.MM.JJJJ\")))","v":""}]
[null,null,null,null,null,null,null,null,null,null,null,{"$f":"CONCATENATE(Stammdaten!$C$7)","v":"Rolf Marquardt"}]

{"sheet":"K1 Urkunde-Platz 2","index":9,"n_rows":39,"n_cols":12,"rows_kept":39,"cut":false,"hidden":false,"merged":[[13,2,16,15],[25,2,25,14],[26,2,26,15],[27,2,27,15],[28,2,28,15],[29,2,29,15],[38,11,40,16],[30,2,30,15],[32,2,32,15],[33,2,33,15],[34,2,34,15],[37,9,37,16],[31,8,31,16]]}
[]
[]
[]
[]
[]
[]
[]
[]
[]
[]
[]
[]
[]
[null,null,{"$f":"IF(Stammdaten!$C$8=\"\",\"\",Stammdaten!$C$8)","v":"Dat Groote Püüster Scheeten"}]
[]
[]
[]
[]
[]
[]
[]
[]
[]
[]
[]
[]
[]
[]
[]
[null,null,{"$f":"Stammdaten!$J$10","v":"Hiermit verleiht der SV-Soderstorf"}]
[null,null,{"$f":"IF(Daten!$G$3=\"\",\"\",Daten!$G$3)","v":""}]
[null,null,"den 2. Platz in der",null,null,null,null,null,{"$f":"Stammdaten!$J$4","v":"Klasse \"mit Prellschlag\""}]
[null,null,"mit einer Trefferleistung von"]
[null,null,{"$f":"IF(Daten!$H$3=\"\",\"\",Daten!$H$3)","v":""}]
[null,null,"diese Urkunde"]
[]
[]
[null,null,null,null,null,null,null,null,null,{"$f":"IF(Stammdaten!$C$4=\"\",\"\",CONCATENATE(Stammdaten!$C$5,\", den\",\" \",TEXT(Stammdaten!$C$4,\"TT.MM.JJJJ\")))","v":""}]
[null,null,null,null,null,null,null,null,null,null,null,{"$f":"CONCATENATE(Stammdaten!$C$7)","v":"Rolf Marquardt"}]

{"sheet":"K1 Urkunde-Platz 3","index":10,"n_rows":39,"n_cols":12,"rows_kept":39,"cut":false,"hidden":false,"merged":[[13,2,16,15],[25,2,25,14],[26,2,26,15],[27,2,27,15],[28,2,28,15],[29,2,29,15],[38,11,40,16],[30,2,30,15],[32,2,32,15],[33,2,33,15],[34,2,34,15],[37,9,37,16],[31,8,31,16]]}
[]
[]
[]
[]
[]
[]
[]
[]
[]
[]
[]
[]
[]
[null,null,{"$f":"IF(Stammdaten!$C$8=\"\",\"\",Stammdaten!$C$8)","v":"Dat Groote Püüster Scheeten"}]
[]
[]
[]
[]
[]
[]
[]
[]
[]
[]
[]
[]
[]
[]
[]
[null,null,{"$f":"Stammdaten!$J$10","v":"Hiermit verleiht der SV-Soderstorf"}]
[null,null,{"$f":"IF(Daten!$G$4=\"\",\"\",Daten!$G$4)","v":""}]
[null,null,"den 3. Platz in der",null,null,null,null,null,{"$f":"Stammdaten!$J$4","v":"Klasse \"mit Prellschlag\""}]
[null,null,"mit einer Trefferleistung von"]
[null,null,{"$f":"IF(Daten!$H$4=\"\",\"\",Daten!$H$4)","v":""}]
[null,null,"diese Urkunde"]
[]
[]
[null,null,null,null,null,null,null,null,null,{"$f":"IF(Stammdaten!$C$4=\"\",\"\",CONCATENATE(Stammdaten!$C$5,\", den\",\" \",TEXT(Stammdaten!$C$4,\"TT.MM.JJJJ\")))","v":""}]
[null,null,null,null,null,null,null,null,null,null,null,{"$f":"CONCATENATE(Stammdaten!$C$7)","v":"Rolf Marquardt"}]

{"sheet":"Ergebnis Klasse 2","index":11,"n_rows":167,"n_cols":8,"rows_kept":167,"cut":false,"hidden":false,"merged":[[164,1,164,4],[165,1,165,4],[166,1,166,4],[158,1,158,4],[159,1,159,4],[160,1,160,4],[161,1,161,4],[162,1,162,4],[163,1,163,4],[152,1,152,4],[153,1,153,4],[154,1,154,4],[155,1,155,4],[156,1,156,4],[157,1,157,4],[146,1,146,4],[147,1,147,4],[148,1,148,4],[149,1,149,4],[150,1,150,4],[151,1,151,4],[140,1,140,4],[141,1,141,4],[142,1,142,4],[143,1,143,4],[144,1,144,4],[145,1,145,4],[134,1,134,4],[135,1,135,4],[136,1,136,4],[137,1,137,4],[138,1,138,4],[139,1,139,4],[128,1,128,4],[129,1,129,4],[130,1,130,4],[131,1,131,4],[132,1,132,4],[133,1,133,4],[122,1,122,4],[123,1,123,4],[124,1,124,4],[125,1,125,4],[126,1,126,4],[127,1,127,4],[116,1,116,4],[117,1,117,4],[118,1,118,4],[119,1,119,4],[120,1,120,4],[121,1,121,4],[110,1,110,4],[111,1,111,4],[112,1,112,4],[113,1,113,4],[114,1,114,4],[115,1,115,4],[104,1,104,4],[105,1,105,4],[106,1,106,4],[107,1,107,4],[108,1,108,4],[109,1,109,4],[98,1,98,4],[99,1,99,4],[100,1,100,4],[101,1,101,4],[102,1,102,4],[103,1,103,4],[92,1,92,4],[93,1,93,4],[94,1,94,4],[95,1,95,4],[96,1,96,4],[97,1,97,4],[86,1,86,4],[87,1,87,4],[88,1,88,4],[89,1,89,4],[90,1,90,4],[91,1,91,4],[80,1,80,4],[81,1,81,4],[82,1,82,4],[83,1,83,4],[84,1,84,4],[85,1,85,4],[74,1,74,4],[75,1,75,4],[76,1,76,4],[77,1,77,4],[78,1,78,4],[79,1,79,4],[68,1,68,4],[69,1,69,4],[70,1,70,4],[71,1,71,4],[72,1,72,4],[73,1,73,4],[62,1,62,4],[63,1,63,4],[64,1,64,4],[65,1,65,4],[66,1,66,4],[67,1,67,4],[56,1,56,4],[57,1,57,4],[58,1,58,4],[59,1,59,4],[60,1,60,4],[61,1,61,4],[50,1,50,4],[51,1,51,4],[52,1,52,4],[53,1,53,4],[54,1,54,4],[55,1,55,4],[44,1,44,4],[45,1,45,4],[46,1,46,4],[47,1,47,4],[48,1,48,4],[49,1,49,4],[38,1,38,4],[39,1,39,4],[40,1,40,4],[41,1,41,4],[42,1,42,4],[43,1,43,4],[32,1,32,4],[33,1,33,4],[34,1,34,4],[35,1,35,4],[36,1,36,4],[37,1,37,4],[26,1,26,4],[27,1,27,4],[28,1,28,4],[29,1,29,4],[30,1,30,4],[31,1,31,4],[20,1,20,4],[21,1,21,4],[22,1,22,4],[23,1,23,4],[24,1,24,4],[25,1,25,4],[14,0,14,6],[15,0,15,6],[16,1,16,4],[17,1,17,4],[18,1,18,4],[19,1,19,4]]}
[]
[]
[]
[]
[]
[]
[]
[]
[]
[]
[]
[]
[]
[]
[{"$f":"IF(Stammdaten!$C$4=\"\",\"\",CONCATENATE(TEXT(Stammdaten!$C$4,\"TT.MM.JJJJ\"),\" \",\"in \",Stammdaten!$C$5,\" \"\"\",Stammdaten!C8,\"\"\"\"))","v":""}]
[{"$f":"IF(Stammdaten!J5=\"\",\"\",Stammdaten!J5)","v":"Klasse \"ohne Prellschlag\""}]
["Platz:","Name:",null,null,null,"Treffer:"]
[{"$f":"IF(Daten!K2=\"\",\"\",1)","v":""},{"$f":"IF(Daten!J2=\"\",\"\",Daten!J2)","v":""},null,null,null,{"$f":"IF(Daten!K2=\"\",\"\",Daten!K2)","v":""},{"$f":"IF(A18=\"\",\"\",\"von \"&Stammdaten!$N$5)","v":""},1]
[{"$f":"IF(F19=\"\",\"\",A18+1)","v":""},{"$f":"IF(Daten!J3=\"\",\"\",Daten!J3)","v":""},null,null,null,{"$f":"IF(Daten!K3=\"\",\"\",Daten!K3)","v":""},{"$f":"IF(A19=\"\",\"\",\"von \"&Stammdaten!$N$5)","v":""},2]
[{"$f":"IF(F20=\"\",\"\",A19+1)","v":""},{"$f":"IF(Daten!J4=\"\",\"\",Daten!J4)","v":""},null,null,null,{"$f":"IF(Daten!K4=\"\",\"\",Daten!K4)","v":""},{"$f":"IF(A20=\"\",\"\",\"von \"&Stammdaten!$N$5)","v":""},3]
[{"$f":"IF(F21=\"\",\"\",A20+1)","v":""},{"$f":"IF(Daten!J5=\"\",\"\",Daten!J5)","v":""},null,null,null,{"$f":"IF(Daten!K5=\"\",\"\",Daten!K5)","v":""},{"$f":"IF(A21=\"\",\"\",\"von \"&Stammdaten!$N$5)","v":""},4]
["",{"$f":"IF(Daten!J6=\"\",\"\",Daten!J6)","v":""},null,null,null,{"$f":"IF(Daten!K6=\"\",\"\",Daten!K6)","v":""},{"$f":"IF(A22=\"\",\"\",\"von \"&Stammdaten!$N$5)","v":""},5]
["",{"$f":"IF(Daten!J7=\"\",\"\",Daten!J7)","v":""},null,null,null,{"$f":"IF(Daten!K7=\"\",\"\",Daten!K7)","v":""},{"$f":"IF(A23=\"\",\"\",\"von \"&Stammdaten!$N$5)","v":""},6]
["",{"$f":"IF(Daten!J8=\"\",\"\",Daten!J8)","v":""},null,null,null,{"$f":"IF(Daten!K8=\"\",\"\",Daten!K8)","v":""},{"$f":"IF(A24=\"\",\"\",\"von \"&Stammdaten!$N$5)","v":""},7]
["",{"$f":"IF(Daten!J9=\"\",\"\",Daten!J9)","v":""},null,null,null,{"$f":"IF(Daten!K9=\"\",\"\",Daten!K9)","v":""},{"$f":"IF(A25=\"\",\"\",\"von \"&Stammdaten!$N$5)","v":""},8]
["",{"$f":"IF(Daten!J10=\"\",\"\",Daten!J10)","v":""},null,null,null,{"$f":"IF(Daten!K10=\"\",\"\",Daten!K10)","v":""},{"$f":"IF(A26=\"\",\"\",\"von \"&Stammdaten!$N$5)","v":""},9]
["",{"$f":"IF(Daten!J11=\"\",\"\",Daten!J11)","v":""},null,null,null,{"$f":"IF(Daten!K11=\"\",\"\",Daten!K11)","v":""},{"$f":"IF(A27=\"\",\"\",\"von \"&Stammdaten!$N$5)","v":""},10]
["",{"$f":"IF(Daten!J12=\"\",\"\",Daten!J12)","v":""},null,null,null,{"$f":"IF(Daten!K12=\"\",\"\",Daten!K12)","v":""},{"$f":"IF(A28=\"\",\"\",\"von \"&Stammdaten!$N$5)","v":""},11]
["",{"$f":"IF(Daten!J13=\"\",\"\",Daten!J13)","v":""},null,null,null,{"$f":"IF(Daten!K13=\"\",\"\",Daten!K13)","v":""},{"$f":"IF(A29=\"\",\"\",\"von \"&Stammdaten!$N$5)","v":""},12]
["",{"$f":"IF(Daten!J14=\"\",\"\",Daten!J14)","v":""},null,null,null,{"$f":"IF(Daten!K14=\"\",\"\",Daten!K14)","v":""},{"$f":"IF(A30=\"\",\"\",\"von \"&Stammdaten!$N$5)","v":""},13]
["",{"$f":"IF(Daten!J15=\"\",\"\",Daten!J15)","v":""},null,null,null,{"$f":"IF(Daten!K15=\"\",\"\",Daten!K15)","v":""},{"$f":"IF(A31=\"\",\"\",\"von \"&Stammdaten!$N$5)","v":""},14]
["",{"$f":"IF(Daten!J16=\"\",\"\",Daten!J16)","v":""},null,null,null,{"$f":"IF(Daten!K16=\"\",\"\",Daten!K16)","v":""},{"$f":"IF(A32=\"\",\"\",\"von \"&Stammdaten!$N$5)","v":""},15]
["",{"$f":"IF(Daten!J17=\"\",\"\",Daten!J17)","v":""},null,null,null,{"$f":"IF(Daten!K17=\"\",\"\",Daten!K17)","v":""},{"$f":"IF(A33=\"\",\"\",\"von \"&Stammdaten!$N$5)","v":""},16]
["",{"$f":"IF(Daten!J18=\"\",\"\",Daten!J18)","v":""},null,null,null,{"$f":"IF(Daten!K18=\"\",\"\",Daten!K18)","v":""},{"$f":"IF(A34=\"\",\"\",\"von \"&Stammdaten!$N$5)","v":""},17]
["",{"$f":"IF(Daten!J19=\"\",\"\",Daten!J19)","v":""},null,null,null,{"$f":"IF(Daten!K19=\"\",\"\",Daten!K19)","v":""},{"$f":"IF(A35=\"\",\"\",\"von \"&Stammdaten!$N$5)","v":""},18]
["",{"$f":"IF(Daten!J20=\"\",\"\",Daten!J20)","v":""},null,null,null,{"$f":"IF(Daten!K20=\"\",\"\",Daten!K20)","v":""},{"$f":"IF(A36=\"\",\"\",\"von \"&Stammdaten!$N$5)","v":""},19]
["",{"$f":"IF(Daten!J21=\"\",\"\",Daten!J21)","v":""},null,null,null,{"$f":"IF(Daten!K21=\"\",\"\",Daten!K21)","v":""},{"$f":"IF(A37=\"\",\"\",\"von \"&Stammdaten!$N$5)","v":""},20]
["",{"$f":"IF(Daten!J22=\"\",\"\",Daten!J22)","v":""},null,null,null,{"$f":"IF(Daten!K22=\"\",\"\",Daten!K22)","v":""},{"$f":"IF(A38=\"\",\"\",\"von \"&Stammdaten!$N$5)","v":""},21]
["",{"$f":"IF(Daten!J23=\"\",\"\",Daten!J23)","v":""},null,null,null,{"$f":"IF(Daten!K23=\"\",\"\",Daten!K23)","v":""},{"$f":"IF(A39=\"\",\"\",\"von \"&Stammdaten!$N$5)","v":""},22]
["",{"$f":"IF(Daten!J24=\"\",\"\",Daten!J24)","v":""},null,null,null,{"$f":"IF(Daten!K24=\"\",\"\",Daten!K24)","v":""},{"$f":"IF(A40=\"\",\"\",\"von \"&Stammdaten!$N$5)","v":""},23]
["",{"$f":"IF(Daten!J25=\"\",\"\",Daten!J25)","v":""},null,null,null,{"$f":"IF(Daten!K25=\"\",\"\",Daten!K25)","v":""},{"$f":"IF(A41=\"\",\"\",\"von \"&Stammdaten!$N$5)","v":""},24]
["",{"$f":"IF(Daten!J26=\"\",\"\",Daten!J26)","v":""},null,null,null,{"$f":"IF(Daten!K26=\"\",\"\",Daten!K26)","v":""},{"$f":"IF(A42=\"\",\"\",\"von \"&Stammdaten!$N$5)","v":""},25]
["",{"$f":"IF(Daten!J27=\"\",\"\",Daten!J27)","v":""},null,null,null,{"$f":"IF(Daten!K27=\"\",\"\",Daten!K27)","v":""},{"$f":"IF(A43=\"\",\"\",\"von \"&Stammdaten!$N$5)","v":""},26]
["",{"$f":"IF(Daten!J28=\"\",\"\",Daten!J28)","v":""},null,null,null,{"$f":"IF(Daten!K28=\"\",\"\",Daten!K28)","v":""},{"$f":"IF(A44=\"\",\"\",\"von \"&Stammdaten!$N$5)","v":""},27]
["",{"$f":"IF(Daten!J29=\"\",\"\",Daten!J29)","v":""},null,null,null,{"$f":"IF(Daten!K29=\"\",\"\",Daten!K29)","v":""},{"$f":"IF(A45=\"\",\"\",\"von \"&Stammdaten!$N$5)","v":""},28]
["",{"$f":"IF(Daten!J30=\"\",\"\",Daten!J30)","v":""},null,null,null,{"$f":"IF(Daten!K30=\"\",\"\",Daten!K30)","v":""},{"$f":"IF(A46=\"\",\"\",\"von \"&Stammdaten!$N$5)","v":""},29]
["",{"$f":"IF(Daten!J31=\"\",\"\",Daten!J31)","v":""},null,null,null,{"$f":"IF(Daten!K31=\"\",\"\",Daten!K31)","v":""},{"$f":"IF(A47=\"\",\"\",\"von \"&Stammdaten!$N$5)","v":""},30]
["",{"$f":"IF(Daten!J32=\"\",\"\",Daten!J32)","v":""},null,null,null,{"$f":"IF(Daten!K32=\"\",\"\",Daten!K32)","v":""},{"$f":"IF(A48=\"\",\"\",\"von \"&Stammdaten!$N$5)","v":""},31]
["",{"$f":"IF(Daten!J33=\"\",\"\",Daten!J33)","v":""},null,null,null,{"$f":"IF(Daten!K33=\"\",\"\",Daten!K33)","v":""},{"$f":"IF(A49=\"\",\"\",\"von \"&Stammdaten!$N$5)","v":""},32]
["",{"$f":"IF(Daten!J34=\"\",\"\",Daten!J34)","v":""},null,null,null,{"$f":"IF(Daten!K34=\"\",\"\",Daten!K34)","v":""},{"$f":"IF(A50=\"\",\"\",\"von \"&Stammdaten!$N$5)","v":""},33]
["",{"$f":"IF(Daten!J35=\"\",\"\",Daten!J35)","v":""},null,null,null,{"$f":"IF(Daten!K35=\"\",\"\",Daten!K35)","v":""},{"$f":"IF(A51=\"\",\"\",\"von \"&Stammdaten!$N$5)","v":""},34]
["",{"$f":"IF(Daten!J36=\"\",\"\",Daten!J36)","v":""},null,null,null,{"$f":"IF(Daten!K36=\"\",\"\",Daten!K36)","v":""},{"$f":"IF(A52=\"\",\"\",\"von \"&Stammdaten!$N$5)","v":""},35]
["",{"$f":"IF(Daten!J37=\"\",\"\",Daten!J37)","v":""},null,null,null,{"$f":"IF(Daten!K37=\"\",\"\",Daten!K37)","v":""},{"$f":"IF(A53=\"\",\"\",\"von \"&Stammdaten!$N$5)","v":""},36]
["",{"$f":"IF(Daten!J38=\"\",\"\",Daten!J38)","v":""},null,null,null,{"$f":"IF(Daten!K38=\"\",\"\",Daten!K38)","v":""},{"$f":"IF(A54=\"\",\"\",\"von \"&Stammdaten!$N$5)","v":""},37]
["",{"$f":"IF(Daten!J39=\"\",\"\",Daten!J39)","v":""},null,null,null,{"$f":"IF(Daten!K39=\"\",\"\",Daten!K39)","v":""},{"$f":"IF(A55=\"\",\"\",\"von \"&Stammdaten!$N$5)","v":""},38]
["",{"$f":"IF(Daten!J40=\"\",\"\",Daten!J40)","v":""},null,null,null,{"$f":"IF(Daten!K40=\"\",\"\",Daten!K40)","v":""},{"$f":"IF(A56=\"\",\"\",\"von \"&Stammdaten!$N$5)","v":""},39]
["",{"$f":"IF(Daten!J41=\"\",\"\",Daten!J41)","v":""},null,null,null,{"$f":"IF(Daten!K41=\"\",\"\",Daten!K41)","v":""},{"$f":"IF(A57=\"\",\"\",\"von \"&Stammdaten!$N$5)","v":""},40]
["",{"$f":"IF(Daten!J42=\"\",\"\",Daten!J42)","v":""},null,null,null,{"$f":"IF(Daten!K42=\"\",\"\",Daten!K42)","v":""},{"$f":"IF(A58=\"\",\"\",\"von \"&Stammdaten!$N$5)","v":""},41]
[{"$f":"IF(F59=\"\",\"\",A58+1)","v":""},{"$f":"IF(Daten!J43=\"\",\"\",Daten!J43)","v":""},null,null,null,{"$f":"IF(Daten!K43=\"\",\"\",Daten!K43)","v":""},{"$f":"IF(A59=\"\",\"\",\"von \"&Stammdaten!$N$5)","v":""},42]
["",{"$f":"IF(Daten!J44=\"\",\"\",Daten!J44)","v":""},null,null,null,{"$f":"IF(Daten!K44=\"\",\"\",Daten!K44)","v":""},{"$f":"IF(A60=\"\",\"\",\"von \"&Stammdaten!$N$5)","v":""},43]
["",{"$f":"IF(Daten!J45=\"\",\"\",Daten!J45)","v":""},null,null,null,{"$f":"IF(Daten!K45=\"\",\"\",Daten!K45)","v":""},{"$f":"IF(A61=\"\",\"\",\"von \"&Stammdaten!$N$5)","v":""},44]
["",{"$f":"IF(Daten!J46=\"\",\"\",Daten!J46)","v":""},null,null,null,{"$f":"IF(Daten!K46=\"\",\"\",Daten!K46)","v":""},{"$f":"IF(A62=\"\",\"\",\"von \"&Stammdaten!$N$5)","v":""},45]
["",{"$f":"IF(Daten!J47=\"\",\"\",Daten!J47)","v":""},null,null,null,{"$f":"IF(Daten!K47=\"\",\"\",Daten!K47)","v":""},{"$f":"IF(A63=\"\",\"\",\"von \"&Stammdaten!$N$5)","v":""},46]
["",{"$f":"IF(Daten!J48=\"\",\"\",Daten!J48)","v":""},null,null,null,{"$f":"IF(Daten!K48=\"\",\"\",Daten!K48)","v":""},{"$f":"IF(A64=\"\",\"\",\"von \"&Stammdaten!$N$5)","v":""},47]
["",{"$f":"IF(Daten!J49=\"\",\"\",Daten!J49)","v":""},null,null,null,{"$f":"IF(Daten!K49=\"\",\"\",Daten!K49)","v":""},{"$f":"IF(A65=\"\",\"\",\"von \"&Stammdaten!$N$5)","v":""},48]
["",{"$f":"IF(Daten!J50=\"\",\"\",Daten!J50)","v":""},null,null,null,{"$f":"IF(Daten!K50=\"\",\"\",Daten!K50)","v":""},{"$f":"IF(A66=\"\",\"\",\"von \"&Stammdaten!$N$5)","v":""},49]
["",{"$f":"IF(Daten!J51=\"\",\"\",Daten!J51)","v":""},null,null,null,{"$f":"IF(Daten!K51=\"\",\"\",Daten!K51)","v":""},{"$f":"IF(A67=\"\",\"\",\"von \"&Stammdaten!$N$5)","v":""},50]
["",{"$f":"IF(Daten!J52=\"\",\"\",Daten!J52)","v":""},null,null,null,{"$f":"IF(Daten!K52=\"\",\"\",Daten!K52)","v":""},{"$f":"IF(A68=\"\",\"\",\"von \"&Stammdaten!$N$5)","v":""},51]
["",{"$f":"IF(Daten!J53=\"\",\"\",Daten!J53)","v":""},null,null,null,{"$f":"IF(Daten!K53=\"\",\"\",Daten!K53)","v":""},{"$f":"IF(A69=\"\",\"\",\"von \"&Stammdaten!$N$5)","v":""},52]
["",{"$f":"IF(Daten!J54=\"\",\"\",Daten!J54)","v":""},null,null,null,{"$f":"IF(Daten!K54=\"\",\"\",Daten!K54)","v":""},{"$f":"IF(A70=\"\",\"\",\"von \"&Stammdaten!$N$5)","v":""},53]
["",{"$f":"IF(Daten!J55=\"\",\"\",Daten!J55)","v":""},null,null,null,{"$f":"IF(Daten!K55=\"\",\"\",Daten!K55)","v":""},{"$f":"IF(A71=\"\",\"\",\"von \"&Stammdaten!$N$5)","v":""},54]
["",{"$f":"IF(Daten!J56=\"\",\"\",Daten!J56)","v":""},null,null,null,{"$f":"IF(Daten!K56=\"\",\"\",Daten!K56)","v":""},{"$f":"IF(A72=\"\",\"\",\"von \"&Stammdaten!$N$5)","v":""},55]
["",{"$f":"IF(Daten!J57=\"\",\"\",Daten!J57)","v":""},null,null,null,{"$f":"IF(Daten!K57=\"\",\"\",Daten!K57)","v":""},{"$f":"IF(A73=\"\",\"\",\"von \"&Stammdaten!$N$5)","v":""},56]
["",{"$f":"IF(Daten!J58=\"\",\"\",Daten!J58)","v":""},null,null,null,{"$f":"IF(Daten!K58=\"\",\"\",Daten!K58)","v":""},{"$f":"IF(A74=\"\",\"\",\"von \"&Stammdaten!$N$5)","v":""},57]
["",{"$f":"IF(Daten!J59=\"\",\"\",Daten!J59)","v":""},null,null,null,{"$f":"IF(Daten!K59=\"\",\"\",Daten!K59)","v":""},{"$f":"IF(A75=\"\",\"\",\"von \"&Stammdaten!$N$5)","v":""},58]
["",{"$f":"IF(Daten!J60=\"\",\"\",Daten!J60)","v":""},null,null,null,{"$f":"IF(Daten!K60=\"\",\"\",Daten!K60)","v":""},{"$f":"IF(A76=\"\",\"\",\"von \"&Stammdaten!$N$5)","v":""},59]
["",{"$f":"IF(Daten!J61=\"\",\"\",Daten!J61)","v":""},null,null,null,{"$f":"IF(Daten!K61=\"\",\"\",Daten!K61)","v":""},{"$f":"IF(A77=\"\",\"\",\"von \"&Stammdaten!$N$5)","v":""},60]
["",{"$f":"IF(Daten!J62=\"\",\"\",Daten!J62)","v":""},null,null,null,{"$f":"IF(Daten!K62=\"\",\"\",Daten!K62)","v":""},{"$f":"IF(A78=\"\",\"\",\"von \"&Stammdaten!$N$5)","v":""},61]
["",{"$f":"IF(Daten!J63=\"\",\"\",Daten!J63)","v":""},null,null,null,{"$f":"IF(Daten!K63=\"\",\"\",Daten!K63)","v":""},{"$f":"IF(A79=\"\",\"\",\"von \"&Stammdaten!$N$5)","v":""},62]
["",{"$f":"IF(Daten!J64=\"\",\"\",Daten!J64)","v":""},null,null,null,{"$f":"IF(Daten!K64=\"\",\"\",Daten!K64)","v":""},{"$f":"IF(A80=\"\",\"\",\"von \"&Stammdaten!$N$5)","v":""},63]
["",{"$f":"IF(Daten!J65=\"\",\"\",Daten!J65)","v":""},null,null,null,{"$f":"IF(Daten!K65=\"\",\"\",Daten!K65)","v":""},{"$f":"IF(A81=\"\",\"\",\"von \"&Stammdaten!$N$5)","v":""},64]
["",{"$f":"IF(Daten!J66=\"\",\"\",Daten!J66)","v":""},null,null,null,{"$f":"IF(Daten!K66=\"\",\"\",Daten!K66)","v":""},{"$f":"IF(A82=\"\",\"\",\"von \"&Stammdaten!$N$5)","v":""},65]
["",{"$f":"IF(Daten!J67=\"\",\"\",Daten!J67)","v":""},null,null,null,{"$f":"IF(Daten!K67=\"\",\"\",Daten!K67)","v":""},{"$f":"IF(A83=\"\",\"\",\"von \"&Stammdaten!$N$5)","v":""},66]
[{"$f":"IF(F84=\"\",\"\",A83+1)","v":""},{"$f":"IF(Daten!J68=\"\",\"\",Daten!J68)","v":""},null,null,null,{"$f":"IF(Daten!K68=\"\",\"\",Daten!K68)","v":""},{"$f":"IF(A84=\"\",\"\",\"von \"&Stammdaten!$N$5)","v":""},67]
["",{"$f":"IF(Daten!J69=\"\",\"\",Daten!J69)","v":""},null,null,null,{"$f":"IF(Daten!K69=\"\",\"\",Daten!K69)","v":""},{"$f":"IF(A85=\"\",\"\",\"von \"&Stammdaten!$N$5)","v":""},68]
["",{"$f":"IF(Daten!J70=\"\",\"\",Daten!J70)","v":""},null,null,null,{"$f":"IF(Daten!K70=\"\",\"\",Daten!K70)","v":""},{"$f":"IF(A86=\"\",\"\",\"von \"&Stammdaten!$N$5)","v":""},69]
["",{"$f":"IF(Daten!J71=\"\",\"\",Daten!J71)","v":""},null,null,null,{"$f":"IF(Daten!K71=\"\",\"\",Daten!K71)","v":""},{"$f":"IF(A87=\"\",\"\",\"von \"&Stammdaten!$N$5)","v":""},70]
["",{"$f":"IF(Daten!J72=\"\",\"\",Daten!J72)","v":""},null,null,null,{"$f":"IF(Daten!K72=\"\",\"\",Daten!K72)","v":""},{"$f":"IF(A88=\"\",\"\",\"von \"&Stammdaten!$N$5)","v":""},71]
["",{"$f":"IF(Daten!J73=\"\",\"\",Daten!J73)","v":""},null,null,null,{"$f":"IF(Daten!K73=\"\",\"\",Daten!K73)","v":""},{"$f":"IF(A89=\"\",\"\",\"von \"&Stammdaten!$N$5)","v":""},72]
["",{"$f":"IF(Daten!J74=\"\",\"\",Daten!J74)","v":""},null,null,null,{"$f":"IF(Daten!K74=\"\",\"\",Daten!K74)","v":""},{"$f":"IF(A90=\"\",\"\",\"von \"&Stammdaten!$N$5)","v":""},73]
["",{"$f":"IF(Daten!J75=\"\",\"\",Daten!J75)","v":""},null,null,null,{"$f":"IF(Daten!K75=\"\",\"\",Daten!K75)","v":""},{"$f":"IF(A91=\"\",\"\",\"von \"&Stammdaten!$N$5)","v":""},74]
["",{"$f":"IF(Daten!J76=\"\",\"\",Daten!J76)","v":""},null,null,null,{"$f":"IF(Daten!K76=\"\",\"\",Daten!K76)","v":""},{"$f":"IF(A92=\"\",\"\",\"von \"&Stammdaten!$N$5)","v":""},75]
["",{"$f":"IF(Daten!J77=\"\",\"\",Daten!J77)","v":""},null,null,null,{"$f":"IF(Daten!K77=\"\",\"\",Daten!K77)","v":""},{"$f":"IF(A93=\"\",\"\",\"von \"&Stammdaten!$N$5)","v":""},76]
["",{"$f":"IF(Daten!J78=\"\",\"\",Daten!J78)","v":""},null,null,null,{"$f":"IF(Daten!K78=\"\",\"\",Daten!K78)","v":""},{"$f":"IF(A94=\"\",\"\",\"von \"&Stammdaten!$N$5)","v":""},77]
["",{"$f":"IF(Daten!J79=\"\",\"\",Daten!J79)","v":""},null,null,null,{"$f":"IF(Daten!K79=\"\",\"\",Daten!K79)","v":""},{"$f":"IF(A95=\"\",\"\",\"von \"&Stammdaten!$N$5)","v":""},78]
["",{"$f":"IF(Daten!J80=\"\",\"\",Daten!J80)","v":""},null,null,null,{"$f":"IF(Daten!K80=\"\",\"\",Daten!K80)","v":""},{"$f":"IF(A96=\"\",\"\",\"von \"&Stammdaten!$N$5)","v":""},79]
["",{"$f":"IF(Daten!J81=\"\",\"\",Daten!J81)","v":""},null,null,null,{"$f":"IF(Daten!K81=\"\",\"\",Daten!K81)","v":""},{"$f":"IF(A97=\"\",\"\",\"von \"&Stammdaten!$N$5)","v":""},80]
["",{"$f":"IF(Daten!J82=\"\",\"\",Daten!J82)","v":""},null,null,null,{"$f":"IF(Daten!K82=\"\",\"\",Daten!K82)","v":""},{"$f":"IF(A98=\"\",\"\",\"von \"&Stammdaten!$N$5)","v":""},81]
["",{"$f":"IF(Daten!J83=\"\",\"\",Daten!J83)","v":""},null,null,null,{"$f":"IF(Daten!K83=\"\",\"\",Daten!K83)","v":""},{"$f":"IF(A99=\"\",\"\",\"von \"&Stammdaten!$N$5)","v":""},82]
["",{"$f":"IF(Daten!J84=\"\",\"\",Daten!J84)","v":""},null,null,null,{"$f":"IF(Daten!K84=\"\",\"\",Daten!K84)","v":""},{"$f":"IF(A100=\"\",\"\",\"von \"&Stammdaten!$N$5)","v":""},83]
["",{"$f":"IF(Daten!J85=\"\",\"\",Daten!J85)","v":""},null,null,null,{"$f":"IF(Daten!K85=\"\",\"\",Daten!K85)","v":""},{"$f":"IF(A101=\"\",\"\",\"von \"&Stammdaten!$N$5)","v":""},84]
["",{"$f":"IF(Daten!J86=\"\",\"\",Daten!J86)","v":""},null,null,null,{"$f":"IF(Daten!K86=\"\",\"\",Daten!K86)","v":""},{"$f":"IF(A102=\"\",\"\",\"von \"&Stammdaten!$N$5)","v":""},85]
["",{"$f":"IF(Daten!J87=\"\",\"\",Daten!J87)","v":""},null,null,null,{"$f":"IF(Daten!K87=\"\",\"\",Daten!K87)","v":""},{"$f":"IF(A103=\"\",\"\",\"von \"&Stammdaten!$N$5)","v":""},86]
["",{"$f":"IF(Daten!J88=\"\",\"\",Daten!J88)","v":""},null,null,null,{"$f":"IF(Daten!K88=\"\",\"\",Daten!K88)","v":""},{"$f":"IF(A104=\"\",\"\",\"von \"&Stammdaten!$N$5)","v":""},87]
["",{"$f":"IF(Daten!J89=\"\",\"\",Daten!J89)","v":""},null,null,null,{"$f":"IF(Daten!K89=\"\",\"\",Daten!K89)","v":""},{"$f":"IF(A105=\"\",\"\",\"von \"&Stammdaten!$N$5)","v":""},88]
["",{"$f":"IF(Daten!J90=\"\",\"\",Daten!J90)","v":""},null,null,null,{"$f":"IF(Daten!K90=\"\",\"\",Daten!K90)","v":""},{"$f":"IF(A106=\"\",\"\",\"von \"&Stammdaten!$N$5)","v":""},89]
["",{"$f":"IF(Daten!J91=\"\",\"\",Daten!J91)","v":""},null,null,null,{"$f":"IF(Daten!K91=\"\",\"\",Daten!K91)","v":""},{"$f":"IF(A107=\"\",\"\",\"von \"&Stammdaten!$N$5)","v":""},90]
["",{"$f":"IF(Daten!J92=\"\",\"\",Daten!J92)","v":""},null,null,null,{"$f":"IF(Daten!K92=\"\",\"\",Daten!K92)","v":""},{"$f":"IF(A108=\"\",\"\",\"von \"&Stammdaten!$N$5)","v":""},91]
["",{"$f":"IF(Daten!J93=\"\",\"\",Daten!J93)","v":""},null,null,null,{"$f":"IF(Daten!K93=\"\",\"\",Daten!K93)","v":""},{"$f":"IF(A109=\"\",\"\",\"von \"&Stammdaten!$N$5)","v":""},92]
["",{"$f":"IF(Daten!J94=\"\",\"\",Daten!J94)","v":""},null,null,null,{"$f":"IF(Daten!K94=\"\",\"\",Daten!K94)","v":""},{"$f":"IF(A110=\"\",\"\",\"von \"&Stammdaten!$N$5)","v":""},93]
["",{"$f":"IF(Daten!J95=\"\",\"\",Daten!J95)","v":""},null,null,null,{"$f":"IF(Daten!K95=\"\",\"\",Daten!K95)","v":""},{"$f":"IF(A111=\"\",\"\",\"von \"&Stammdaten!$N$5)","v":""},94]
["",{"$f":"IF(Daten!J96=\"\",\"\",Daten!J96)","v":""},null,null,null,{"$f":"IF(Daten!K96=\"\",\"\",Daten!K96)","v":""},{"$f":"IF(A112=\"\",\"\",\"von \"&Stammdaten!$N$5)","v":""},95]
["",{"$f":"IF(Daten!J97=\"\",\"\",Daten!J97)","v":""},null,null,null,{"$f":"IF(Daten!K97=\"\",\"\",Daten!K97)","v":""},{"$f":"IF(A113=\"\",\"\",\"von \"&Stammdaten!$N$5)","v":""},96]
["",{"$f":"IF(Daten!J98=\"\",\"\",Daten!J98)","v":""},null,null,null,{"$f":"IF(Daten!K98=\"\",\"\",Daten!K98)","v":""},{"$f":"IF(A114=\"\",\"\",\"von \"&Stammdaten!$N$5)","v":""},97]
["",{"$f":"IF(Daten!J99=\"\",\"\",Daten!J99)","v":""},null,null,null,{"$f":"IF(Daten!K99=\"\",\"\",Daten!K99)","v":""},{"$f":"IF(A115=\"\",\"\",\"von \"&Stammdaten!$N$5)","v":""},98]
["",{"$f":"IF(Daten!J100=\"\",\"\",Daten!J100)","v":""},null,null,null,{"$f":"IF(Daten!K100=\"\",\"\",Daten!K100)","v":""},{"$f":"IF(A116=\"\",\"\",\"von \"&Stammdaten!$N$5)","v":""},99]
["",{"$f":"IF(Daten!J101=\"\",\"\",Daten!J101)","v":""},null,null,null,{"$f":"IF(Daten!K101=\"\",\"\",Daten!K101)","v":""},{"$f":"IF(A117=\"\",\"\",\"von \"&Stammdaten!$N$5)","v":""},100]
["",{"$f":"IF(Daten!J102=\"\",\"\",Daten!J102)","v":""},null,null,null,{"$f":"IF(Daten!K102=\"\",\"\",Daten!K102)","v":""},{"$f":"IF(A118=\"\",\"\",\"von \"&Stammdaten!$N$5)","v":""},101]
["",{"$f":"IF(Daten!J103=\"\",\"\",Daten!J103)","v":""},null,null,null,{"$f":"IF(Daten!K103=\"\",\"\",Daten!K103)","v":""},{"$f":"IF(A119=\"\",\"\",\"von \"&Stammdaten!$N$5)","v":""},102]
["",{"$f":"IF(Daten!J104=\"\",\"\",Daten!J104)","v":""},null,null,null,{"$f":"IF(Daten!K104=\"\",\"\",Daten!K104)","v":""},{"$f":"IF(A120=\"\",\"\",\"von \"&Stammdaten!$N$5)","v":""},103]
["",{"$f":"IF(Daten!J105=\"\",\"\",Daten!J105)","v":""},null,null,null,{"$f":"IF(Daten!K105=\"\",\"\",Daten!K105)","v":""},{"$f":"IF(A121=\"\",\"\",\"von \"&Stammdaten!$N$5)","v":""},104]
["",{"$f":"IF(Daten!J106=\"\",\"\",Daten!J106)","v":""},null,null,null,{"$f":"IF(Daten!K106=\"\",\"\",Daten!K106)","v":""},{"$f":"IF(A122=\"\",\"\",\"von \"&Stammdaten!$N$5)","v":""},105]
["",{"$f":"IF(Daten!J107=\"\",\"\",Daten!J107)","v":""},null,null,null,{"$f":"IF(Daten!K107=\"\",\"\",Daten!K107)","v":""},{"$f":"IF(A123=\"\",\"\",\"von \"&Stammdaten!$N$5)","v":""},106]
["",{"$f":"IF(Daten!J108=\"\",\"\",Daten!J108)","v":""},null,null,null,{"$f":"IF(Daten!K108=\"\",\"\",Daten!K108)","v":""},{"$f":"IF(A124=\"\",\"\",\"von \"&Stammdaten!$N$5)","v":""},107]
["",{"$f":"IF(Daten!J109=\"\",\"\",Daten!J109)","v":""},null,null,null,{"$f":"IF(Daten!K109=\"\",\"\",Daten!K109)","v":""},{"$f":"IF(A125=\"\",\"\",\"von \"&Stammdaten!$N$5)","v":""},108]
["",{"$f":"IF(Daten!J110=\"\",\"\",Daten!J110)","v":""},null,null,null,{"$f":"IF(Daten!K110=\"\",\"\",Daten!K110)","v":""},{"$f":"IF(A126=\"\",\"\",\"von \"&Stammdaten!$N$5)","v":""},109]
["",{"$f":"IF(Daten!J111=\"\",\"\",Daten!J111)","v":""},null,null,null,{"$f":"IF(Daten!K111=\"\",\"\",Daten!K111)","v":""},{"$f":"IF(A127=\"\",\"\",\"von \"&Stammdaten!$N$5)","v":""},110]
["",{"$f":"IF(Daten!J112=\"\",\"\",Daten!J112)","v":""},null,null,null,{"$f":"IF(Daten!K112=\"\",\"\",Daten!K112)","v":""},{"$f":"IF(A128=\"\",\"\",\"von \"&Stammdaten!$N$5)","v":""},111]
["",{"$f":"IF(Daten!J113=\"\",\"\",Daten!J113)","v":""},null,null,null,{"$f":"IF(Daten!K113=\"\",\"\",Daten!K113)","v":""},{"$f":"IF(A129=\"\",\"\",\"von \"&Stammdaten!$N$5)","v":""},112]
["",{"$f":"IF(Daten!J114=\"\",\"\",Daten!J114)","v":""},null,null,null,{"$f":"IF(Daten!K114=\"\",\"\",Daten!K114)","v":""},{"$f":"IF(A130=\"\",\"\",\"von \"&Stammdaten!$N$5)","v":""},113]
["",{"$f":"IF(Daten!J115=\"\",\"\",Daten!J115)","v":""},null,null,null,{"$f":"IF(Daten!K115=\"\",\"\",Daten!K115)","v":""},{"$f":"IF(A131=\"\",\"\",\"von \"&Stammdaten!$N$5)","v":""},114]
["",{"$f":"IF(Daten!J116=\"\",\"\",Daten!J116)","v":""},null,null,null,{"$f":"IF(Daten!K116=\"\",\"\",Daten!K116)","v":""},{"$f":"IF(A132=\"\",\"\",\"von \"&Stammdaten!$N$5)","v":""},115]
["",{"$f":"IF(Daten!J117=\"\",\"\",Daten!J117)","v":""},null,null,null,{"$f":"IF(Daten!K117=\"\",\"\",Daten!K117)","v":""},{"$f":"IF(A133=\"\",\"\",\"von \"&Stammdaten!$N$5)","v":""},116]
["",{"$f":"IF(Daten!J118=\"\",\"\",Daten!J118)","v":""},null,null,null,{"$f":"IF(Daten!K118=\"\",\"\",Daten!K118)","v":""},{"$f":"IF(A134=\"\",\"\",\"von \"&Stammdaten!$N$5)","v":""},117]
["",{"$f":"IF(Daten!J119=\"\",\"\",Daten!J119)","v":""},null,null,null,{"$f":"IF(Daten!K119=\"\",\"\",Daten!K119)","v":""},{"$f":"IF(A135=\"\",\"\",\"von \"&Stammdaten!$N$5)","v":""},118]
["",{"$f":"IF(Daten!J120=\"\",\"\",Daten!J120)","v":""},null,null,null,{"$f":"IF(Daten!K120=\"\",\"\",Daten!K120)","v":""},{"$f":"IF(A136=\"\",\"\",\"von \"&Stammdaten!$N$5)","v":""},119]
["",{"$f":"IF(Daten!J121=\"\",\"\",Daten!J121)","v":""},null,null,null,{"$f":"IF(Daten!K121=\"\",\"\",Daten!K121)","v":""},{"$f":"IF(A137=\"\",\"\",\"von \"&Stammdaten!$N$5)","v":""},120]
["",{"$f":"IF(Daten!J122=\"\",\"\",Daten!J122)","v":""},null,null,null,{"$f":"IF(Daten!K122=\"\",\"\",Daten!K122)","v":""},{"$f":"IF(A138=\"\",\"\",\"von \"&Stammdaten!$N$5)","v":""},121]
["",{"$f":"IF(Daten!J123=\"\",\"\",Daten!J123)","v":""},null,null,null,{"$f":"IF(Daten!K123=\"\",\"\",Daten!K123)","v":""},{"$f":"IF(A139=\"\",\"\",\"von \"&Stammdaten!$N$5)","v":""},122]
["",{"$f":"IF(Daten!J124=\"\",\"\",Daten!J124)","v":""},null,null,null,{"$f":"IF(Daten!K124=\"\",\"\",Daten!K124)","v":""},{"$f":"IF(A140=\"\",\"\",\"von \"&Stammdaten!$N$5)","v":""},123]
["",{"$f":"IF(Daten!J125=\"\",\"\",Daten!J125)","v":""},null,null,null,{"$f":"IF(Daten!K125=\"\",\"\",Daten!K125)","v":""},{"$f":"IF(A141=\"\",\"\",\"von \"&Stammdaten!$N$5)","v":""},124]
["",{"$f":"IF(Daten!J126=\"\",\"\",Daten!J126)","v":""},null,null,null,{"$f":"IF(Daten!K126=\"\",\"\",Daten!K126)","v":""},{"$f":"IF(A142=\"\",\"\",\"von \"&Stammdaten!$N$5)","v":""},125]
["",{"$f":"IF(Daten!J127=\"\",\"\",Daten!J127)","v":""},null,null,null,{"$f":"IF(Daten!K127=\"\",\"\",Daten!K127)","v":""},{"$f":"IF(A143=\"\",\"\",\"von \"&Stammdaten!$N$5)","v":""},126]
["",{"$f":"IF(Daten!J128=\"\",\"\",Daten!J128)","v":""},null,null,null,{"$f":"IF(Daten!K128=\"\",\"\",Daten!K128)","v":""},{"$f":"IF(A144=\"\",\"\",\"von \"&Stammdaten!$N$5)","v":""},127]
["",{"$f":"IF(Daten!J129=\"\",\"\",Daten!J129)","v":""},null,null,null,{"$f":"IF(Daten!K129=\"\",\"\",Daten!K129)","v":""},{"$f":"IF(A145=\"\",\"\",\"von \"&Stammdaten!$N$5)","v":""},128]
["",{"$f":"IF(Daten!J130=\"\",\"\",Daten!J130)","v":""},null,null,null,{"$f":"IF(Daten!K130=\"\",\"\",Daten!K130)","v":""},{"$f":"IF(A146=\"\",\"\",\"von \"&Stammdaten!$N$5)","v":""},129]
["",{"$f":"IF(Daten!J131=\"\",\"\",Daten!J131)","v":""},null,null,null,{"$f":"IF(Daten!K131=\"\",\"\",Daten!K131)","v":""},{"$f":"IF(A147=\"\",\"\",\"von \"&Stammdaten!$N$5)","v":""},130]
[{"$f":"IF(F148=\"\",\"\",A147+1)","v":""},{"$f":"IF(Daten!J132=\"\",\"\",Daten!J132)","v":""},null,null,null,{"$f":"IF(Daten!K132=\"\",\"\",Daten!K132)","v":""},{"$f":"IF(A148=\"\",\"\",\"von \"&Stammdaten!$N$5)","v":""},131]
["",{"$f":"IF(Daten!J133=\"\",\"\",Daten!J133)","v":""},null,null,null,{"$f":"IF(Daten!K133=\"\",\"\",Daten!K133)","v":""},{"$f":"IF(A149=\"\",\"\",\"von \"&Stammdaten!$N$5)","v":""},132]
["",{"$f":"IF(Daten!J134=\"\",\"\",Daten!J134)","v":""},null,null,null,{"$f":"IF(Daten!K134=\"\",\"\",Daten!K134)","v":""},{"$f":"IF(A150=\"\",\"\",\"von \"&Stammdaten!$N$5)","v":""},133]
["",{"$f":"IF(Daten!J135=\"\",\"\",Daten!J135)","v":""},null,null,null,{"$f":"IF(Daten!K135=\"\",\"\",Daten!K135)","v":""},{"$f":"IF(A151=\"\",\"\",\"von \"&Stammdaten!$N$5)","v":""},134]
["",{"$f":"IF(Daten!J136=\"\",\"\",Daten!J136)","v":""},null,null,null,{"$f":"IF(Daten!K136=\"\",\"\",Daten!K136)","v":""},{"$f":"IF(A152=\"\",\"\",\"von \"&Stammdaten!$N$5)","v":""},135]
["",{"$f":"IF(Daten!J137=\"\",\"\",Daten!J137)","v":""},null,null,null,{"$f":"IF(Daten!K137=\"\",\"\",Daten!K137)","v":""},{"$f":"IF(A153=\"\",\"\",\"von \"&Stammdaten!$N$5)","v":""},136]
["",{"$f":"IF(Daten!J138=\"\",\"\",Daten!J138)","v":""},null,null,null,{"$f":"IF(Daten!K138=\"\",\"\",Daten!K138)","v":""},{"$f":"IF(A154=\"\",\"\",\"von \"&Stammdaten!$N$5)","v":""},137]
["",{"$f":"IF(Daten!J139=\"\",\"\",Daten!J139)","v":""},null,null,null,{"$f":"IF(Daten!K139=\"\",\"\",Daten!K139)","v":""},{"$f":"IF(A155=\"\",\"\",\"von \"&Stammdaten!$N$5)","v":""},138]
["",{"$f":"IF(Daten!J140=\"\",\"\",Daten!J140)","v":""},null,null,null,{"$f":"IF(Daten!K140=\"\",\"\",Daten!K140)","v":""},{"$f":"IF(A156=\"\",\"\",\"von \"&Stammdaten!$N$5)","v":""},139]
["",{"$f":"IF(Daten!J141=\"\",\"\",Daten!J141)","v":""},null,null,null,{"$f":"IF(Daten!K141=\"\",\"\",Daten!K141)","v":""},{"$f":"IF(A157=\"\",\"\",\"von \"&Stammdaten!$N$5)","v":""},140]
["",{"$f":"IF(Daten!J142=\"\",\"\",Daten!J142)","v":""},null,null,null,{"$f":"IF(Daten!K142=\"\",\"\",Daten!K142)","v":""},{"$f":"IF(A158=\"\",\"\",\"von \"&Stammdaten!$N$5)","v":""},141]
["",{"$f":"IF(Daten!J143=\"\",\"\",Daten!J143)","v":""},null,null,null,{"$f":"IF(Daten!K143=\"\",\"\",Daten!K143)","v":""},{"$f":"IF(A159=\"\",\"\",\"von \"&Stammdaten!$N$5)","v":""},142]
["",{"$f":"IF(Daten!J144=\"\",\"\",Daten!J144)","v":""},null,null,null,{"$f":"IF(Daten!K144=\"\",\"\",Daten!K144)","v":""},{"$f":"IF(A160=\"\",\"\",\"von \"&Stammdaten!$N$5)","v":""},143]
["",{"$f":"IF(Daten!J145=\"\",\"\",Daten!J145)","v":""},null,null,null,{"$f":"IF(Daten!K145=\"\",\"\",Daten!K145)","v":""},{"$f":"IF(A161=\"\",\"\",\"von \"&Stammdaten!$N$5)","v":""},144]
["",{"$f":"IF(Daten!J146=\"\",\"\",Daten!J146)","v":""},null,null,null,{"$f":"IF(Daten!K146=\"\",\"\",Daten!K146)","v":""},{"$f":"IF(A162=\"\",\"\",\"von \"&Stammdaten!$N$5)","v":""},145]
["",{"$f":"IF(Daten!J147=\"\",\"\",Daten!J147)","v":""},null,null,null,{"$f":"IF(Daten!K147=\"\",\"\",Daten!K147)","v":""},{"$f":"IF(A163=\"\",\"\",\"von \"&Stammdaten!$N$5)","v":""},146]
["",{"$f":"IF(Daten!J148=\"\",\"\",Daten!J148)","v":""},null,null,null,{"$f":"IF(Daten!K148=\"\",\"\",Daten!K148)","v":""},{"$f":"IF(A164=\"\",\"\",\"von \"&Stammdaten!$N$5)","v":""},147]
["",{"$f":"IF(Daten!J149=\"\",\"\",Daten!J149)","v":""},null,null,null,{"$f":"IF(Daten!K149=\"\",\"\",Daten!K149)","v":""},{"$f":"IF(A165=\"\",\"\",\"von \"&Stammdaten!$N$5)","v":""},148]
["",{"$f":"IF(Daten!J150=\"\",\"\",Daten!J150)","v":""},null,null,null,{"$f":"IF(Daten!K150=\"\",\"\",Daten!K150)","v":""},{"$f":"IF(A166=\"\",\"\",\"von \"&Stammdaten!$N$5)","v":""},149]
[{"$f":"IF(F167=\"\",\"\",A166+1)","v":""},{"$f":"IF(Daten!J151=\"\",\"\",Daten!J151)","v":""},null,null,null,{"$f":"IF(Daten!K151=\"\",\"\",Daten!K151)","v":""},{"$f":"IF(A167=\"\",\"\",\"von \"&Stammdaten!$N$5)","v":""},150]

{"sheet":"K2 Urkunde-Platz 1","index":12,"n_rows":39,"n_cols":12,"rows_kept":39,"cut":false,"hidden":false,"merged":[[13,2,16,15],[25,2,25,14],[26,2,26,15],[27,2,27,15],[28,2,28,15],[29,2,29,15],[38,11,40,16],[30,2,30,15],[32,2,32,15],[33,2,33,15],[34,2,34,15],[37,9,37,16],[31,8,31,16]]}
[]
[]
[]
[]
[]
[]
[]
[]
[]
[]
[]
[]
[]
[null,null,{"$f":"IF(Stammdaten!$C$8=\"\",\"\",Stammdaten!$C$8)","v":"Dat Groote Püüster Scheeten"}]
[]
[]
[]
[]
[]
[]
[]
[]
[]
[]
[]
[]
[]
[]
[]
[null,null,{"$f":"Stammdaten!$J$10","v":"Hiermit verleiht der SV-Soderstorf"}]
[null,null,{"$f":"IF(Daten!$J$2=\"\",\"\",Daten!$J$2)","v":""}]
[null,null,"den 1. Platz in der",null,null,null,null,null,{"$f":"Stammdaten!$J$5","v":"Klasse \"ohne Prellschlag\""}]
[null,null,"mit einer Trefferleistung von"]
[null,null,{"$f":"IF(Daten!$K$2=\"\",\"\",Daten!$K$2)","v":""}]
[null,null,"diese Urkunde"]
[]
[]
[null,null,null,null,null,null,null,null,null,{"$f":"IF(Stammdaten!$C$4=\"\",\"\",CONCATENATE(Stammdaten!$C$5,\", den\",\" \",TEXT(Stammdaten!$C$4,\"TT.MM.JJJJ\")))","v":""}]
[null,null,null,null,null,null,null,null,null,null,null,{"$f":"CONCATENATE(Stammdaten!$C$7)","v":"Rolf Marquardt"}]

{"sheet":"K2 Urkunde-Platz 2","index":13,"n_rows":39,"n_cols":12,"rows_kept":39,"cut":false,"hidden":false,"merged":[[13,2,16,15],[25,2,25,14],[26,2,26,15],[27,2,27,15],[28,2,28,15],[29,2,29,15],[38,11,40,16],[30,2,30,15],[32,2,32,15],[33,2,33,15],[34,2,34,15],[37,9,37,16],[31,8,31,16]]}
[]
[]
[]
[]
[]
[]
[]
[]
[]
[]
[]
[]
[]
[null,null,{"$f":"IF(Stammdaten!$C$8=\"\",\"\",Stammdaten!$C$8)","v":"Dat Groote Püüster Scheeten"}]
[]
[]
[]
[]
[]
[]
[]
[]
[]
[]
[]
[]
[]
[]
[]
[null,null,{"$f":"Stammdaten!$J$10","v":"Hiermit verleiht der SV-Soderstorf"}]
[null,null,{"$f":"IF(Daten!$J$3=\"\",\"\",Daten!$J$3)","v":""}]
[null,null,"den 2. Platz in der",null,null,null,null,null,{"$f":"Stammdaten!$J$5","v":"Klasse \"ohne Prellschlag\""}]
[null,null,"mit einer Trefferleistung von"]
[null,null,{"$f":"IF(Daten!$K$3=\"\",\"\",Daten!$K$3)","v":""}]
[null,null,"diese Urkunde"]
[]
[]
[null,null,null,null,null,null,null,null,null,{"$f":"IF(Stammdaten!$C$4=\"\",\"\",CONCATENATE(Stammdaten!$C$5,\", den\",\" \",TEXT(Stammdaten!$C$4,\"TT.MM.JJJJ\")))","v":""}]
[null,null,null,null,null,null,null,null,null,null,null,{"$f":"CONCATENATE(Stammdaten!$C$7)","v":"Rolf Marquardt"}]

{"sheet":"K2 Urkunde-Platz 3","index":14,"n_rows":39,"n_cols":12,"rows_kept":39,"cut":false,"hidden":false,"merged":[[13,2,16,15],[25,2,25,14],[26,2,26,15],[27,2,27,15],[28,2,28,15],[29,2,29,15],[38,11,40,16],[30,2,30,15],[32,2,32,15],[33,2,33,15],[34,2,34,15],[37,9,37,16],[31,8,31,16]]}
[]
[]
[]
[]
[]
[]
[]
[]
[]
[]
[]
[]
[]
[null,null,{"$f":"IF(Stammdaten!$C$8=\"\",\"\",Stammdaten!$C$8)","v":"Dat Groote Püüster Scheeten"}]
[]
[]
[]
[]
[]
[]
[]
[]
[]
[]
[]
[]
[]
[]
[]
[null,null,{"$f":"Stammdaten!$J$10","v":"Hiermit verleiht der SV-Soderstorf"}]
[null,null,{"$f":"IF(Daten!$J$4=\"\",\"\",Daten!$J$4)","v":""}]
[null,null,"den 3. Platz in der",null,null,null,null,null,{"$f":"Stammdaten!$J$5","v":"Klasse \"ohne Prellschlag\""}]
[null,null,"mit einer Trefferleistung von"]
[null,null,{"$f":"IF(Daten!$K$4=\"\",\"\",Daten!$K$4)","v":""}]
[null,null,"diese Urkunde"]
[]
[]
[null,null,null,null,null,null,null,null,null,{"$f":"IF(Stammdaten!$C$4=\"\",\"\",CONCATENATE(Stammdaten!$C$5,\", den\",\" \",TEXT(Stammdaten!$C$4,\"TT.MM.JJJJ\")))","v":""}]
[null,null,null,null,null,null,null,null,null,null,null,{"$f":"CONCATENATE(Stammdaten!$C$7)","v":"Rolf Marquardt"}]

{"sheet":"Ergebnis Klasse 3","index":15,"n_rows":167,"n_cols":8,"rows_kept":167,"cut":false,"hidden":false,"merged":[[164,1,164,4],[165,1,165,4],[166,1,166,4],[158,1,158,4],[159,1,159,4],[160,1,160,4],[161,1,161,4],[162,1,162,4],[163,1,163,4],[152,1,152,4],[153,1,153,4],[154,1,154,4],[155,1,155,4],[156,1,156,4],[157,1,157,4],[146,1,146,4],[147,1,147,4],[148,1,148,4],[149,1,149,4],[150,1,150,4],[151,1,151,4],[140,1,140,4],[141,1,141,4],[142,1,142,4],[143,1,143,4],[144,1,144,4],[145,1,145,4],[134,1,134,4],[135,1,135,4],[136,1,136,4],[137,1,137,4],[138,1,138,4],[139,1,139,4],[128,1,128,4],[129,1,129,4],[130,1,130,4],[131,1,131,4],[132,1,132,4],[133,1,133,4],[122,1,122,4],[123,1,123,4],[124,1,124,4],[125,1,125,4],[126,1,126,4],[127,1,127,4],[116,1,116,4],[117,1,117,4],[118,1,118,4],[119,1,119,4],[120,1,120,4],[121,1,121,4],[110,1,110,4],[111,1,111,4],[112,1,112,4],[113,1,113,4],[114,1,114,4],[115,1,115,4],[104,1,104,4],[105,1,105,4],[106,1,106,4],[107,1,107,4],[108,1,108,4],[109,1,109,4],[98,1,98,4],[99,1,99,4],[100,1,100,4],[101,1,101,4],[102,1,102,4],[103,1,103,4],[92,1,92,4],[93,1,93,4],[94,1,94,4],[95,1,95,4],[96,1,96,4],[97,1,97,4],[86,1,86,4],[87,1,87,4],[88,1,88,4],[89,1,89,4],[90,1,90,4],[91,1,91,4],[80,1,80,4],[81,1,81,4],[82,1,82,4],[83,1,83,4],[84,1,84,4],[85,1,85,4],[74,1,74,4],[75,1,75,4],[76,1,76,4],[77,1,77,4],[78,1,78,4],[79,1,79,4],[68,1,68,4],[69,1,69,4],[70,1,70,4],[71,1,71,4],[72,1,72,4],[73,1,73,4],[62,1,62,4],[63,1,63,4],[64,1,64,4],[65,1,65,4],[66,1,66,4],[67,1,67,4],[56,1,56,4],[57,1,57,4],[58,1,58,4],[59,1,59,4],[60,1,60,4],[61,1,61,4],[50,1,50,4],[51,1,51,4],[52,1,52,4],[53,1,53,4],[54,1,54,4],[55,1,55,4],[44,1,44,4],[45,1,45,4],[46,1,46,4],[47,1,47,4],[48,1,48,4],[49,1,49,4],[38,1,38,4],[39,1,39,4],[40,1,40,4],[41,1,41,4],[42,1,42,4],[43,1,43,4],[32,1,32,4],[33,1,33,4],[34,1,34,4],[35,1,35,4],[36,1,36,4],[37,1,37,4],[26,1,26,4],[27,1,27,4],[28,1,28,4],[29,1,29,4],[30,1,30,4],[31,1,31,4],[20,1,20,4],[21,1,21,4],[22,1,22,4],[23,1,23,4],[24,1,24,4],[25,1,25,4],[14,0,14,6],[15,0,15,6],[16,1,16,4],[17,1,17,4],[18,1,18,4],[19,1,19,4]]}
[]
[]
[]
[]
[]
[]
[]
[]
[]
[]
[]
[]
[]
[]
[{"$f":"IF(Stammdaten!$C$4=\"\",\"\",CONCATENATE(TEXT(Stammdaten!$C$4,\"TT.MM.JJJJ\"),\" \",\"in \",Stammdaten!$C$5,\" \"\"\",Stammdaten!C8,\"\"\"\"))","v":""}]
[{"$f":"IF(Stammdaten!J6=\"\",\"\",Stammdaten!J6)","v":""}]
["Platz:","Name:",null,null,null,"Treffer:"]
[{"$f":"IF(Daten!N2=\"\",\"\",1)","v":""},{"$f":"IF(Daten!M2=\"\",\"\",Daten!M2)","v":""},null,null,null,{"$f":"IF(Daten!N2=\"\",\"\",Daten!N2)","v":""},{"$f":"IF(A18=\"\",\"\",\"von \"&Stammdaten!$N$6)","v":""},1]
[{"$f":"IF(F19=\"\",\"\",A18+1)","v":""},{"$f":"IF(Daten!M3=\"\",\"\",Daten!M3)","v":""},null,null,null,{"$f":"IF(Daten!N3=\"\",\"\",Daten!N3)","v":""},{"$f":"IF(A19=\"\",\"\",\"von \"&Stammdaten!$N$6)","v":""},2]
[{"$f":"IF(F20=\"\",\"\",A19+1)","v":""},{"$f":"IF(Daten!M4=\"\",\"\",Daten!M4)","v":""},null,null,null,{"$f":"IF(Daten!N4=\"\",\"\",Daten!N4)","v":""},{"$f":"IF(A20=\"\",\"\",\"von \"&Stammdaten!$N$6)","v":""},3]
[{"$f":"IF(F21=\"\",\"\",A20+1)","v":""},{"$f":"IF(Daten!M5=\"\",\"\",Daten!M5)","v":""},null,null,null,{"$f":"IF(Daten!N5=\"\",\"\",Daten!N5)","v":""},{"$f":"IF(A21=\"\",\"\",\"von \"&Stammdaten!$N$6)","v":""},4]
["",{"$f":"IF(Daten!M6=\"\",\"\",Daten!M6)","v":""},null,null,null,{"$f":"IF(Daten!N6=\"\",\"\",Daten!N6)","v":""},{"$f":"IF(A22=\"\",\"\",\"von \"&Stammdaten!$N$6)","v":""},5]
["",{"$f":"IF(Daten!M7=\"\",\"\",Daten!M7)","v":""},null,null,null,{"$f":"IF(Daten!N7=\"\",\"\",Daten!N7)","v":""},{"$f":"IF(A23=\"\",\"\",\"von \"&Stammdaten!$N$6)","v":""},6]
["",{"$f":"IF(Daten!M8=\"\",\"\",Daten!M8)","v":""},null,null,null,{"$f":"IF(Daten!N8=\"\",\"\",Daten!N8)","v":""},{"$f":"IF(A24=\"\",\"\",\"von \"&Stammdaten!$N$6)","v":""},7]
["",{"$f":"IF(Daten!M9=\"\",\"\",Daten!M9)","v":""},null,null,null,{"$f":"IF(Daten!N9=\"\",\"\",Daten!N9)","v":""},{"$f":"IF(A25=\"\",\"\",\"von \"&Stammdaten!$N$6)","v":""},8]
["",{"$f":"IF(Daten!M10=\"\",\"\",Daten!M10)","v":""},null,null,null,{"$f":"IF(Daten!N10=\"\",\"\",Daten!N10)","v":""},{"$f":"IF(A26=\"\",\"\",\"von \"&Stammdaten!$N$6)","v":""},9]
["",{"$f":"IF(Daten!M11=\"\",\"\",Daten!M11)","v":""},null,null,null,{"$f":"IF(Daten!N11=\"\",\"\",Daten!N11)","v":""},{"$f":"IF(A27=\"\",\"\",\"von \"&Stammdaten!$N$6)","v":""},10]
["",{"$f":"IF(Daten!M12=\"\",\"\",Daten!M12)","v":""},null,null,null,{"$f":"IF(Daten!N12=\"\",\"\",Daten!N12)","v":""},{"$f":"IF(A28=\"\",\"\",\"von \"&Stammdaten!$N$6)","v":""},11]
["",{"$f":"IF(Daten!M13=\"\",\"\",Daten!M13)","v":""},null,null,null,{"$f":"IF(Daten!N13=\"\",\"\",Daten!N13)","v":""},{"$f":"IF(A29=\"\",\"\",\"von \"&Stammdaten!$N$6)","v":""},12]
["",{"$f":"IF(Daten!M14=\"\",\"\",Daten!M14)","v":""},null,null,null,{"$f":"IF(Daten!N14=\"\",\"\",Daten!N14)","v":""},{"$f":"IF(A30=\"\",\"\",\"von \"&Stammdaten!$N$6)","v":""},13]
["",{"$f":"IF(Daten!M15=\"\",\"\",Daten!M15)","v":""},null,null,null,{"$f":"IF(Daten!N15=\"\",\"\",Daten!N15)","v":""},{"$f":"IF(A31=\"\",\"\",\"von \"&Stammdaten!$N$6)","v":""},14]
["",{"$f":"IF(Daten!M16=\"\",\"\",Daten!M16)","v":""},null,null,null,{"$f":"IF(Daten!N16=\"\",\"\",Daten!N16)","v":""},{"$f":"IF(A32=\"\",\"\",\"von \"&Stammdaten!$N$6)","v":""},15]
["",{"$f":"IF(Daten!M17=\"\",\"\",Daten!M17)","v":""},null,null,null,{"$f":"IF(Daten!N17=\"\",\"\",Daten!N17)","v":""},{"$f":"IF(A33=\"\",\"\",\"von \"&Stammdaten!$N$6)","v":""},16]
["",{"$f":"IF(Daten!M18=\"\",\"\",Daten!M18)","v":""},null,null,null,{"$f":"IF(Daten!N18=\"\",\"\",Daten!N18)","v":""},{"$f":"IF(A34=\"\",\"\",\"von \"&Stammdaten!$N$6)","v":""},17]
["",{"$f":"IF(Daten!M19=\"\",\"\",Daten!M19)","v":""},null,null,null,{"$f":"IF(Daten!N19=\"\",\"\",Daten!N19)","v":""},{"$f":"IF(A35=\"\",\"\",\"von \"&Stammdaten!$N$6)","v":""},18]
["",{"$f":"IF(Daten!M20=\"\",\"\",Daten!M20)","v":""},null,null,null,{"$f":"IF(Daten!N20=\"\",\"\",Daten!N20)","v":""},{"$f":"IF(A36=\"\",\"\",\"von \"&Stammdaten!$N$6)","v":""},19]
["",{"$f":"IF(Daten!M21=\"\",\"\",Daten!M21)","v":""},null,null,null,{"$f":"IF(Daten!N21=\"\",\"\",Daten!N21)","v":""},{"$f":"IF(A37=\"\",\"\",\"von \"&Stammdaten!$N$6)","v":""},20]
["",{"$f":"IF(Daten!M22=\"\",\"\",Daten!M22)","v":""},null,null,null,{"$f":"IF(Daten!N22=\"\",\"\",Daten!N22)","v":""},{"$f":"IF(A38=\"\",\"\",\"von \"&Stammdaten!$N$6)","v":""},21]
["",{"$f":"IF(Daten!M23=\"\",\"\",Daten!M23)","v":""},null,null,null,{"$f":"IF(Daten!N23=\"\",\"\",Daten!N23)","v":""},{"$f":"IF(A39=\"\",\"\",\"von \"&Stammdaten!$N$6)","v":""},22]
["",{"$f":"IF(Daten!M24=\"\",\"\",Daten!M24)","v":""},null,null,null,{"$f":"IF(Daten!N24=\"\",\"\",Daten!N24)","v":""},{"$f":"IF(A40=\"\",\"\",\"von \"&Stammdaten!$N$6)","v":""},23]
["",{"$f":"IF(Daten!M25=\"\",\"\",Daten!M25)","v":""},null,null,null,{"$f":"IF(Daten!N25=\"\",\"\",Daten!N25)","v":""},{"$f":"IF(A41=\"\",\"\",\"von \"&Stammdaten!$N$6)","v":""},24]
["",{"$f":"IF(Daten!M26=\"\",\"\",Daten!M26)","v":""},null,null,null,{"$f":"IF(Daten!N26=\"\",\"\",Daten!N26)","v":""},{"$f":"IF(A42=\"\",\"\",\"von \"&Stammdaten!$N$6)","v":""},25]
["",{"$f":"IF(Daten!M27=\"\",\"\",Daten!M27)","v":""},null,null,null,{"$f":"IF(Daten!N27=\"\",\"\",Daten!N27)","v":""},{"$f":"IF(A43=\"\",\"\",\"von \"&Stammdaten!$N$6)","v":""},26]
["",{"$f":"IF(Daten!M28=\"\",\"\",Daten!M28)","v":""},null,null,null,{"$f":"IF(Daten!N28=\"\",\"\",Daten!N28)","v":""},{"$f":"IF(A44=\"\",\"\",\"von \"&Stammdaten!$N$6)","v":""},27]
["",{"$f":"IF(Daten!M29=\"\",\"\",Daten!M29)","v":""},null,null,null,{"$f":"IF(Daten!N29=\"\",\"\",Daten!N29)","v":""},{"$f":"IF(A45=\"\",\"\",\"von \"&Stammdaten!$N$6)","v":""},28]
["",{"$f":"IF(Daten!M30=\"\",\"\",Daten!M30)","v":""},null,null,null,{"$f":"IF(Daten!N30=\"\",\"\",Daten!N30)","v":""},{"$f":"IF(A46=\"\",\"\",\"von \"&Stammdaten!$N$6)","v":""},29]
["",{"$f":"IF(Daten!M31=\"\",\"\",Daten!M31)","v":""},null,null,null,{"$f":"IF(Daten!N31=\"\",\"\",Daten!N31)","v":""},{"$f":"IF(A47=\"\",\"\",\"von \"&Stammdaten!$N$6)","v":""},30]
["",{"$f":"IF(Daten!M32=\"\",\"\",Daten!M32)","v":""},null,null,null,{"$f":"IF(Daten!N32=\"\",\"\",Daten!N32)","v":""},{"$f":"IF(A48=\"\",\"\",\"von \"&Stammdaten!$N$6)","v":""},31]
["",{"$f":"IF(Daten!M33=\"\",\"\",Daten!M33)","v":""},null,null,null,{"$f":"IF(Daten!N33=\"\",\"\",Daten!N33)","v":""},{"$f":"IF(A49=\"\",\"\",\"von \"&Stammdaten!$N$6)","v":""},32]
["",{"$f":"IF(Daten!M34=\"\",\"\",Daten!M34)","v":""},null,null,null,{"$f":"IF(Daten!N34=\"\",\"\",Daten!N34)","v":""},{"$f":"IF(A50=\"\",\"\",\"von \"&Stammdaten!$N$6)","v":""},33]
["",{"$f":"IF(Daten!M35=\"\",\"\",Daten!M35)","v":""},null,null,null,{"$f":"IF(Daten!N35=\"\",\"\",Daten!N35)","v":""},{"$f":"IF(A51=\"\",\"\",\"von \"&Stammdaten!$N$6)","v":""},34]
["",{"$f":"IF(Daten!M36=\"\",\"\",Daten!M36)","v":""},null,null,null,{"$f":"IF(Daten!N36=\"\",\"\",Daten!N36)","v":""},{"$f":"IF(A52=\"\",\"\",\"von \"&Stammdaten!$N$6)","v":""},35]
["",{"$f":"IF(Daten!M37=\"\",\"\",Daten!M37)","v":""},null,null,null,{"$f":"IF(Daten!N37=\"\",\"\",Daten!N37)","v":""},{"$f":"IF(A53=\"\",\"\",\"von \"&Stammdaten!$N$6)","v":""},36]
["",{"$f":"IF(Daten!M38=\"\",\"\",Daten!M38)","v":""},null,null,null,{"$f":"IF(Daten!N38=\"\",\"\",Daten!N38)","v":""},{"$f":"IF(A54=\"\",\"\",\"von \"&Stammdaten!$N$6)","v":""},37]
["",{"$f":"IF(Daten!M39=\"\",\"\",Daten!M39)","v":""},null,null,null,{"$f":"IF(Daten!N39=\"\",\"\",Daten!N39)","v":""},{"$f":"IF(A55=\"\",\"\",\"von \"&Stammdaten!$N$6)","v":""},38]
["",{"$f":"IF(Daten!M40=\"\",\"\",Daten!M40)","v":""},null,null,null,{"$f":"IF(Daten!N40=\"\",\"\",Daten!N40)","v":""},{"$f":"IF(A56=\"\",\"\",\"von \"&Stammdaten!$N$6)","v":""},39]
["",{"$f":"IF(Daten!M41=\"\",\"\",Daten!M41)","v":""},null,null,null,{"$f":"IF(Daten!N41=\"\",\"\",Daten!N41)","v":""},{"$f":"IF(A57=\"\",\"\",\"von \"&Stammdaten!$N$6)","v":""},40]
["",{"$f":"IF(Daten!M42=\"\",\"\",Daten!M42)","v":""},null,null,null,{"$f":"IF(Daten!N42=\"\",\"\",Daten!N42)","v":""},{"$f":"IF(A58=\"\",\"\",\"von \"&Stammdaten!$N$6)","v":""},41]
[{"$f":"IF(F59=\"\",\"\",A58+1)","v":""},{"$f":"IF(Daten!M43=\"\",\"\",Daten!M43)","v":""},null,null,null,{"$f":"IF(Daten!N43=\"\",\"\",Daten!N43)","v":""},{"$f":"IF(A59=\"\",\"\",\"von \"&Stammdaten!$N$6)","v":""},42]
["",{"$f":"IF(Daten!M44=\"\",\"\",Daten!M44)","v":""},null,null,null,{"$f":"IF(Daten!N44=\"\",\"\",Daten!N44)","v":""},{"$f":"IF(A60=\"\",\"\",\"von \"&Stammdaten!$N$6)","v":""},43]
["",{"$f":"IF(Daten!M45=\"\",\"\",Daten!M45)","v":""},null,null,null,{"$f":"IF(Daten!N45=\"\",\"\",Daten!N45)","v":""},{"$f":"IF(A61=\"\",\"\",\"von \"&Stammdaten!$N$6)","v":""},44]
["",{"$f":"IF(Daten!M46=\"\",\"\",Daten!M46)","v":""},null,null,null,{"$f":"IF(Daten!N46=\"\",\"\",Daten!N46)","v":""},{"$f":"IF(A62=\"\",\"\",\"von \"&Stammdaten!$N$6)","v":""},45]
["",{"$f":"IF(Daten!M47=\"\",\"\",Daten!M47)","v":""},null,null,null,{"$f":"IF(Daten!N47=\"\",\"\",Daten!N47)","v":""},{"$f":"IF(A63=\"\",\"\",\"von \"&Stammdaten!$N$6)","v":""},46]
["",{"$f":"IF(Daten!M48=\"\",\"\",Daten!M48)","v":""},null,null,null,{"$f":"IF(Daten!N48=\"\",\"\",Daten!N48)","v":""},{"$f":"IF(A64=\"\",\"\",\"von \"&Stammdaten!$N$6)","v":""},47]
["",{"$f":"IF(Daten!M49=\"\",\"\",Daten!M49)","v":""},null,null,null,{"$f":"IF(Daten!N49=\"\",\"\",Daten!N49)","v":""},{"$f":"IF(A65=\"\",\"\",\"von \"&Stammdaten!$N$6)","v":""},48]
["",{"$f":"IF(Daten!M50=\"\",\"\",Daten!M50)","v":""},null,null,null,{"$f":"IF(Daten!N50=\"\",\"\",Daten!N50)","v":""},{"$f":"IF(A66=\"\",\"\",\"von \"&Stammdaten!$N$6)","v":""},49]
["",{"$f":"IF(Daten!M51=\"\",\"\",Daten!M51)","v":""},null,null,null,{"$f":"IF(Daten!N51=\"\",\"\",Daten!N51)","v":""},{"$f":"IF(A67=\"\",\"\",\"von \"&Stammdaten!$N$6)","v":""},50]
["",{"$f":"IF(Daten!M52=\"\",\"\",Daten!M52)","v":""},null,null,null,{"$f":"IF(Daten!N52=\"\",\"\",Daten!N52)","v":""},{"$f":"IF(A68=\"\",\"\",\"von \"&Stammdaten!$N$6)","v":""},51]
["",{"$f":"IF(Daten!M53=\"\",\"\",Daten!M53)","v":""},null,null,null,{"$f":"IF(Daten!N53=\"\",\"\",Daten!N53)","v":""},{"$f":"IF(A69=\"\",\"\",\"von \"&Stammdaten!$N$6)","v":""},52]
["",{"$f":"IF(Daten!M54=\"\",\"\",Daten!M54)","v":""},null,null,null,{"$f":"IF(Daten!N54=\"\",\"\",Daten!N54)","v":""},{"$f":"IF(A70=\"\",\"\",\"von \"&Stammdaten!$N$6)","v":""},53]
["",{"$f":"IF(Daten!M55=\"\",\"\",Daten!M55)","v":""},null,null,null,{"$f":"IF(Daten!N55=\"\",\"\",Daten!N55)","v":""},{"$f":"IF(A71=\"\",\"\",\"von \"&Stammdaten!$N$6)","v":""},54]
["",{"$f":"IF(Daten!M56=\"\",\"\",Daten!M56)","v":""},null,null,null,{"$f":"IF(Daten!N56=\"\",\"\",Daten!N56)","v":""},{"$f":"IF(A72=\"\",\"\",\"von \"&Stammdaten!$N$6)","v":""},55]
["",{"$f":"IF(Daten!M57=\"\",\"\",Daten!M57)","v":""},null,null,null,{"$f":"IF(Daten!N57=\"\",\"\",Daten!N57)","v":""},{"$f":"IF(A73=\"\",\"\",\"von \"&Stammdaten!$N$6)","v":""},56]
["",{"$f":"IF(Daten!M58=\"\",\"\",Daten!M58)","v":""},null,null,null,{"$f":"IF(Daten!N58=\"\",\"\",Daten!N58)","v":""},{"$f":"IF(A74=\"\",\"\",\"von \"&Stammdaten!$N$6)","v":""},57]
["",{"$f":"IF(Daten!M59=\"\",\"\",Daten!M59)","v":""},null,null,null,{"$f":"IF(Daten!N59=\"\",\"\",Daten!N59)","v":""},{"$f":"IF(A75=\"\",\"\",\"von \"&Stammdaten!$N$6)","v":""},58]
["",{"$f":"IF(Daten!M60=\"\",\"\",Daten!M60)","v":""},null,null,null,{"$f":"IF(Daten!N60=\"\",\"\",Daten!N60)","v":""},{"$f":"IF(A76=\"\",\"\",\"von \"&Stammdaten!$N$6)","v":""},59]
["",{"$f":"IF(Daten!M61=\"\",\"\",Daten!M61)","v":""},null,null,null,{"$f":"IF(Daten!N61=\"\",\"\",Daten!N61)","v":""},{"$f":"IF(A77=\"\",\"\",\"von \"&Stammdaten!$N$6)","v":""},60]
["",{"$f":"IF(Daten!M62=\"\",\"\",Daten!M62)","v":""},null,null,null,{"$f":"IF(Daten!N62=\"\",\"\",Daten!N62)","v":""},{"$f":"IF(A78=\"\",\"\",\"von \"&Stammdaten!$N$6)","v":""},61]
["",{"$f":"IF(Daten!M63=\"\",\"\",Daten!M63)","v":""},null,null,null,{"$f":"IF(Daten!N63=\"\",\"\",Daten!N63)","v":""},{"$f":"IF(A79=\"\",\"\",\"von \"&Stammdaten!$N$6)","v":""},62]
["",{"$f":"IF(Daten!M64=\"\",\"\",Daten!M64)","v":""},null,null,null,{"$f":"IF(Daten!N64=\"\",\"\",Daten!N64)","v":""},{"$f":"IF(A80=\"\",\"\",\"von \"&Stammdaten!$N$6)","v":""},63]
["",{"$f":"IF(Daten!M65=\"\",\"\",Daten!M65)","v":""},null,null,null,{"$f":"IF(Daten!N65=\"\",\"\",Daten!N65)","v":""},{"$f":"IF(A81=\"\",\"\",\"von \"&Stammdaten!$N$6)","v":""},64]
["",{"$f":"IF(Daten!M66=\"\",\"\",Daten!M66)","v":""},null,null,null,{"$f":"IF(Daten!N66=\"\",\"\",Daten!N66)","v":""},{"$f":"IF(A82=\"\",\"\",\"von \"&Stammdaten!$N$6)","v":""},65]
["",{"$f":"IF(Daten!M67=\"\",\"\",Daten!M67)","v":""},null,null,null,{"$f":"IF(Daten!N67=\"\",\"\",Daten!N67)","v":""},{"$f":"IF(A83=\"\",\"\",\"von \"&Stammdaten!$N$6)","v":""},66]
["",{"$f":"IF(Daten!M68=\"\",\"\",Daten!M68)","v":""},null,null,null,{"$f":"IF(Daten!N68=\"\",\"\",Daten!N68)","v":""},{"$f":"IF(A84=\"\",\"\",\"von \"&Stammdaten!$N$6)","v":""},67]
[{"$f":"IF(F85=\"\",\"\",A84+1)","v":""},{"$f":"IF(Daten!M69=\"\",\"\",Daten!M69)","v":""},null,null,null,{"$f":"IF(Daten!N69=\"\",\"\",Daten!N69)","v":""},{"$f":"IF(A85=\"\",\"\",\"von \"&Stammdaten!$N$6)","v":""},68]
["",{"$f":"IF(Daten!M70=\"\",\"\",Daten!M70)","v":""},null,null,null,{"$f":"IF(Daten!N70=\"\",\"\",Daten!N70)","v":""},{"$f":"IF(A86=\"\",\"\",\"von \"&Stammdaten!$N$6)","v":""},69]
["",{"$f":"IF(Daten!M71=\"\",\"\",Daten!M71)","v":""},null,null,null,{"$f":"IF(Daten!N71=\"\",\"\",Daten!N71)","v":""},{"$f":"IF(A87=\"\",\"\",\"von \"&Stammdaten!$N$6)","v":""},70]
["",{"$f":"IF(Daten!M72=\"\",\"\",Daten!M72)","v":""},null,null,null,{"$f":"IF(Daten!N72=\"\",\"\",Daten!N72)","v":""},{"$f":"IF(A88=\"\",\"\",\"von \"&Stammdaten!$N$6)","v":""},71]
["",{"$f":"IF(Daten!M73=\"\",\"\",Daten!M73)","v":""},null,null,null,{"$f":"IF(Daten!N73=\"\",\"\",Daten!N73)","v":""},{"$f":"IF(A89=\"\",\"\",\"von \"&Stammdaten!$N$6)","v":""},72]
["",{"$f":"IF(Daten!M74=\"\",\"\",Daten!M74)","v":""},null,null,null,{"$f":"IF(Daten!N74=\"\",\"\",Daten!N74)","v":""},{"$f":"IF(A90=\"\",\"\",\"von \"&Stammdaten!$N$6)","v":""},73]
["",{"$f":"IF(Daten!M75=\"\",\"\",Daten!M75)","v":""},null,null,null,{"$f":"IF(Daten!N75=\"\",\"\",Daten!N75)","v":""},{"$f":"IF(A91=\"\",\"\",\"von \"&Stammdaten!$N$6)","v":""},74]
["",{"$f":"IF(Daten!M76=\"\",\"\",Daten!M76)","v":""},null,null,null,{"$f":"IF(Daten!N76=\"\",\"\",Daten!N76)","v":""},{"$f":"IF(A92=\"\",\"\",\"von \"&Stammdaten!$N$6)","v":""},75]
["",{"$f":"IF(Daten!M77=\"\",\"\",Daten!M77)","v":""},null,null,null,{"$f":"IF(Daten!N77=\"\",\"\",Daten!N77)","v":""},{"$f":"IF(A93=\"\",\"\",\"von \"&Stammdaten!$N$6)","v":""},76]
["",{"$f":"IF(Daten!M78=\"\",\"\",Daten!M78)","v":""},null,null,null,{"$f":"IF(Daten!N78=\"\",\"\",Daten!N78)","v":""},{"$f":"IF(A94=\"\",\"\",\"von \"&Stammdaten!$N$6)","v":""},77]
["",{"$f":"IF(Daten!M79=\"\",\"\",Daten!M79)","v":""},null,null,null,{"$f":"IF(Daten!N79=\"\",\"\",Daten!N79)","v":""},{"$f":"IF(A95=\"\",\"\",\"von \"&Stammdaten!$N$6)","v":""},78]
["",{"$f":"IF(Daten!M80=\"\",\"\",Daten!M80)","v":""},null,null,null,{"$f":"IF(Daten!N80=\"\",\"\",Daten!N80)","v":""},{"$f":"IF(A96=\"\",\"\",\"von \"&Stammdaten!$N$6)","v":""},79]
["",{"$f":"IF(Daten!M81=\"\",\"\",Daten!M81)","v":""},null,null,null,{"$f":"IF(Daten!N81=\"\",\"\",Daten!N81)","v":""},{"$f":"IF(A97=\"\",\"\",\"von \"&Stammdaten!$N$6)","v":""},80]
["",{"$f":"IF(Daten!M82=\"\",\"\",Daten!M82)","v":""},null,null,null,{"$f":"IF(Daten!N82=\"\",\"\",Daten!N82)","v":""},{"$f":"IF(A98=\"\",\"\",\"von \"&Stammdaten!$N$6)","v":""},81]
["",{"$f":"IF(Daten!M83=\"\",\"\",Daten!M83)","v":""},null,null,null,{"$f":"IF(Daten!N83=\"\",\"\",Daten!N83)","v":""},{"$f":"IF(A99=\"\",\"\",\"von \"&Stammdaten!$N$6)","v":""},82]
["",{"$f":"IF(Daten!M84=\"\",\"\",Daten!M84)","v":""},null,null,null,{"$f":"IF(Daten!N84=\"\",\"\",Daten!N84)","v":""},{"$f":"IF(A100=\"\",\"\",\"von \"&Stammdaten!$N$6)","v":""},83]
["",{"$f":"IF(Daten!M85=\"\",\"\",Daten!M85)","v":""},null,null,null,{"$f":"IF(Daten!N85=\"\",\"\",Daten!N85)","v":""},{"$f":"IF(A101=\"\",\"\",\"von \"&Stammdaten!$N$6)","v":""},84]
["",{"$f":"IF(Daten!M86=\"\",\"\",Daten!M86)","v":""},null,null,null,{"$f":"IF(Daten!N86=\"\",\"\",Daten!N86)","v":""},{"$f":"IF(A102=\"\",\"\",\"von \"&Stammdaten!$N$6)","v":""},85]
["",{"$f":"IF(Daten!M87=\"\",\"\",Daten!M87)","v":""},null,null,null,{"$f":"IF(Daten!N87=\"\",\"\",Daten!N87)","v":""},{"$f":"IF(A103=\"\",\"\",\"von \"&Stammdaten!$N$6)","v":""},86]
["",{"$f":"IF(Daten!M88=\"\",\"\",Daten!M88)","v":""},null,null,null,{"$f":"IF(Daten!N88=\"\",\"\",Daten!N88)","v":""},{"$f":"IF(A104=\"\",\"\",\"von \"&Stammdaten!$N$6)","v":""},87]
["",{"$f":"IF(Daten!M89=\"\",\"\",Daten!M89)","v":""},null,null,null,{"$f":"IF(Daten!N89=\"\",\"\",Daten!N89)","v":""},{"$f":"IF(A105=\"\",\"\",\"von \"&Stammdaten!$N$6)","v":""},88]
["",{"$f":"IF(Daten!M90=\"\",\"\",Daten!M90)","v":""},null,null,null,{"$f":"IF(Daten!N90=\"\",\"\",Daten!N90)","v":""},{"$f":"IF(A106=\"\",\"\",\"von \"&Stammdaten!$N$6)","v":""},89]
["",{"$f":"IF(Daten!M91=\"\",\"\",Daten!M91)","v":""},null,null,null,{"$f":"IF(Daten!N91=\"\",\"\",Daten!N91)","v":""},{"$f":"IF(A107=\"\",\"\",\"von \"&Stammdaten!$N$6)","v":""},90]
["",{"$f":"IF(Daten!M92=\"\",\"\",Daten!M92)","v":""},null,null,null,{"$f":"IF(Daten!N92=\"\",\"\",Daten!N92)","v":""},{"$f":"IF(A108=\"\",\"\",\"von \"&Stammdaten!$N$6)","v":""},91]
["",{"$f":"IF(Daten!M93=\"\",\"\",Daten!M93)","v":""},null,null,null,{"$f":"IF(Daten!N93=\"\",\"\",Daten!N93)","v":""},{"$f":"IF(A109=\"\",\"\",\"von \"&Stammdaten!$N$6)","v":""},92]
["",{"$f":"IF(Daten!M94=\"\",\"\",Daten!M94)","v":""},null,null,null,{"$f":"IF(Daten!N94=\"\",\"\",Daten!N94)","v":""},{"$f":"IF(A110=\"\",\"\",\"von \"&Stammdaten!$N$6)","v":""},93]
["",{"$f":"IF(Daten!M95=\"\",\"\",Daten!M95)","v":""},null,null,null,{"$f":"IF(Daten!N95=\"\",\"\",Daten!N95)","v":""},{"$f":"IF(A111=\"\",\"\",\"von \"&Stammdaten!$N$6)","v":""},94]
["",{"$f":"IF(Daten!M96=\"\",\"\",Daten!M96)","v":""},null,null,null,{"$f":"IF(Daten!N96=\"\",\"\",Daten!N96)","v":""},{"$f":"IF(A112=\"\",\"\",\"von \"&Stammdaten!$N$6)","v":""},95]
["",{"$f":"IF(Daten!M97=\"\",\"\",Daten!M97)","v":""},null,null,null,{"$f":"IF(Daten!N97=\"\",\"\",Daten!N97)","v":""},{"$f":"IF(A113=\"\",\"\",\"von \"&Stammdaten!$N$6)","v":""},96]
["",{"$f":"IF(Daten!M98=\"\",\"\",Daten!M98)","v":""},null,null,null,{"$f":"IF(Daten!N98=\"\",\"\",Daten!N98)","v":""},{"$f":"IF(A114=\"\",\"\",\"von \"&Stammdaten!$N$6)","v":""},97]
["",{"$f":"IF(Daten!M99=\"\",\"\",Daten!M99)","v":""},null,null,null,{"$f":"IF(Daten!N99=\"\",\"\",Daten!N99)","v":""},{"$f":"IF(A115=\"\",\"\",\"von \"&Stammdaten!$N$6)","v":""},98]
["",{"$f":"IF(Daten!M100=\"\",\"\",Daten!M100)","v":""},null,null,null,{"$f":"IF(Daten!N100=\"\",\"\",Daten!N100)","v":""},{"$f":"IF(A116=\"\",\"\",\"von \"&Stammdaten!$N$6)","v":""},99]
["",{"$f":"IF(Daten!M101=\"\",\"\",Daten!M101)","v":""},null,null,null,{"$f":"IF(Daten!N101=\"\",\"\",Daten!N101)","v":""},{"$f":"IF(A117=\"\",\"\",\"von \"&Stammdaten!$N$6)","v":""},100]
["",{"$f":"IF(Daten!M102=\"\",\"\",Daten!M102)","v":""},null,null,null,{"$f":"IF(Daten!N102=\"\",\"\",Daten!N102)","v":""},{"$f":"IF(A118=\"\",\"\",\"von \"&Stammdaten!$N$6)","v":""},101]
["",{"$f":"IF(Daten!M103=\"\",\"\",Daten!M103)","v":""},null,null,null,{"$f":"IF(Daten!N103=\"\",\"\",Daten!N103)","v":""},{"$f":"IF(A119=\"\",\"\",\"von \"&Stammdaten!$N$6)","v":""},102]
["",{"$f":"IF(Daten!M104=\"\",\"\",Daten!M104)","v":""},null,null,null,{"$f":"IF(Daten!N104=\"\",\"\",Daten!N104)","v":""},{"$f":"IF(A120=\"\",\"\",\"von \"&Stammdaten!$N$6)","v":""},103]
["",{"$f":"IF(Daten!M105=\"\",\"\",Daten!M105)","v":""},null,null,null,{"$f":"IF(Daten!N105=\"\",\"\",Daten!N105)","v":""},{"$f":"IF(A121=\"\",\"\",\"von \"&Stammdaten!$N$6)","v":""},104]
["",{"$f":"IF(Daten!M106=\"\",\"\",Daten!M106)","v":""},null,null,null,{"$f":"IF(Daten!N106=\"\",\"\",Daten!N106)","v":""},{"$f":"IF(A122=\"\",\"\",\"von \"&Stammdaten!$N$6)","v":""},105]
["",{"$f":"IF(Daten!M107=\"\",\"\",Daten!M107)","v":""},null,null,null,{"$f":"IF(Daten!N107=\"\",\"\",Daten!N107)","v":""},{"$f":"IF(A123=\"\",\"\",\"von \"&Stammdaten!$N$6)","v":""},106]
["",{"$f":"IF(Daten!M108=\"\",\"\",Daten!M108)","v":""},null,null,null,{"$f":"IF(Daten!N108=\"\",\"\",Daten!N108)","v":""},{"$f":"IF(A124=\"\",\"\",\"von \"&Stammdaten!$N$6)","v":""},107]
["",{"$f":"IF(Daten!M109=\"\",\"\",Daten!M109)","v":""},null,null,null,{"$f":"IF(Daten!N109=\"\",\"\",Daten!N109)","v":""},{"$f":"IF(A125=\"\",\"\",\"von \"&Stammdaten!$N$6)","v":""},108]
["",{"$f":"IF(Daten!M110=\"\",\"\",Daten!M110)","v":""},null,null,null,{"$f":"IF(Daten!N110=\"\",\"\",Daten!N110)","v":""},{"$f":"IF(A126=\"\",\"\",\"von \"&Stammdaten!$N$6)","v":""},109]
["",{"$f":"IF(Daten!M111=\"\",\"\",Daten!M111)","v":""},null,null,null,{"$f":"IF(Daten!N111=\"\",\"\",Daten!N111)","v":""},{"$f":"IF(A127=\"\",\"\",\"von \"&Stammdaten!$N$6)","v":""},110]
["",{"$f":"IF(Daten!M112=\"\",\"\",Daten!M112)","v":""},null,null,null,{"$f":"IF(Daten!N112=\"\",\"\",Daten!N112)","v":""},{"$f":"IF(A128=\"\",\"\",\"von \"&Stammdaten!$N$6)","v":""},111]
["",{"$f":"IF(Daten!M113=\"\",\"\",Daten!M113)","v":""},null,null,null,{"$f":"IF(Daten!N113=\"\",\"\",Daten!N113)","v":""},{"$f":"IF(A129=\"\",\"\",\"von \"&Stammdaten!$N$6)","v":""},112]
["",{"$f":"IF(Daten!M114=\"\",\"\",Daten!M114)","v":""},null,null,null,{"$f":"IF(Daten!N114=\"\",\"\",Daten!N114)","v":""},{"$f":"IF(A130=\"\",\"\",\"von \"&Stammdaten!$N$6)","v":""},113]
["",{"$f":"IF(Daten!M115=\"\",\"\",Daten!M115)","v":""},null,null,null,{"$f":"IF(Daten!N115=\"\",\"\",Daten!N115)","v":""},{"$f":"IF(A131=\"\",\"\",\"von \"&Stammdaten!$N$6)","v":""},114]
["",{"$f":"IF(Daten!M116=\"\",\"\",Daten!M116)","v":""},null,null,null,{"$f":"IF(Daten!N116=\"\",\"\",Daten!N116)","v":""},{"$f":"IF(A132=\"\",\"\",\"von \"&Stammdaten!$N$6)","v":""},115]
["",{"$f":"IF(Daten!M117=\"\",\"\",Daten!M117)","v":""},null,null,null,{"$f":"IF(Daten!N117=\"\",\"\",Daten!N117)","v":""},{"$f":"IF(A133=\"\",\"\",\"von \"&Stammdaten!$N$6)","v":""},116]
["",{"$f":"IF(Daten!M118=\"\",\"\",Daten!M118)","v":""},null,null,null,{"$f":"IF(Daten!N118=\"\",\"\",Daten!N118)","v":""},{"$f":"IF(A134=\"\",\"\",\"von \"&Stammdaten!$N$6)","v":""},117]
["",{"$f":"IF(Daten!M119=\"\",\"\",Daten!M119)","v":""},null,null,null,{"$f":"IF(Daten!N119=\"\",\"\",Daten!N119)","v":""},{"$f":"IF(A135=\"\",\"\",\"von \"&Stammdaten!$N$6)","v":""},118]
["",{"$f":"IF(Daten!M120=\"\",\"\",Daten!M120)","v":""},null,null,null,{"$f":"IF(Daten!N120=\"\",\"\",Daten!N120)","v":""},{"$f":"IF(A136=\"\",\"\",\"von \"&Stammdaten!$N$6)","v":""},119]
["",{"$f":"IF(Daten!M121=\"\",\"\",Daten!M121)","v":""},null,null,null,{"$f":"IF(Daten!N121=\"\",\"\",Daten!N121)","v":""},{"$f":"IF(A137=\"\",\"\",\"von \"&Stammdaten!$N$6)","v":""},120]
["",{"$f":"IF(Daten!M122=\"\",\"\",Daten!M122)","v":""},null,null,null,{"$f":"IF(Daten!N122=\"\",\"\",Daten!N122)","v":""},{"$f":"IF(A138=\"\",\"\",\"von \"&Stammdaten!$N$6)","v":""},121]
["",{"$f":"IF(Daten!M123=\"\",\"\",Daten!M123)","v":""},null,null,null,{"$f":"IF(Daten!N123=\"\",\"\",Daten!N123)","v":""},{"$f":"IF(A139=\"\",\"\",\"von \"&Stammdaten!$N$6)","v":""},122]
["",{"$f":"IF(Daten!M124=\"\",\"\",Daten!M124)","v":""},null,null,null,{"$f":"IF(Daten!N124=\"\",\"\",Daten!N124)","v":""},{"$f":"IF(A140=\"\",\"\",\"von \"&Stammdaten!$N$6)","v":""},123]
["",{"$f":"IF(Daten!M125=\"\",\"\",Daten!M125)","v":""},null,null,null,{"$f":"IF(Daten!N125=\"\",\"\",Daten!N125)","v":""},{"$f":"IF(A141=\"\",\"\",\"von \"&Stammdaten!$N$6)","v":""},124]
["",{"$f":"IF(Daten!M126=\"\",\"\",Daten!M126)","v":""},null,null,null,{"$f":"IF(Daten!N126=\"\",\"\",Daten!N126)","v":""},{"$f":"IF(A142=\"\",\"\",\"von \"&Stammdaten!$N$6)","v":""},125]
["",{"$f":"IF(Daten!M127=\"\",\"\",Daten!M127)","v":""},null,null,null,{"$f":"IF(Daten!N127=\"\",\"\",Daten!N127)","v":""},{"$f":"IF(A143=\"\",\"\",\"von \"&Stammdaten!$N$6)","v":""},126]
["",{"$f":"IF(Daten!M128=\"\",\"\",Daten!M128)","v":""},null,null,null,{"$f":"IF(Daten!N128=\"\",\"\",Daten!N128)","v":""},{"$f":"IF(A144=\"\",\"\",\"von \"&Stammdaten!$N$6)","v":""},127]
["",{"$f":"IF(Daten!M129=\"\",\"\",Daten!M129)","v":""},null,null,null,{"$f":"IF(Daten!N129=\"\",\"\",Daten!N129)","v":""},{"$f":"IF(A145=\"\",\"\",\"von \"&Stammdaten!$N$6)","v":""},128]
["",{"$f":"IF(Daten!M130=\"\",\"\",Daten!M130)","v":""},null,null,null,{"$f":"IF(Daten!N130=\"\",\"\",Daten!N130)","v":""},{"$f":"IF(A146=\"\",\"\",\"von \"&Stammdaten!$N$6)","v":""},129]
["",{"$f":"IF(Daten!M131=\"\",\"\",Daten!M131)","v":""},null,null,null,{"$f":"IF(Daten!N131=\"\",\"\",Daten!N131)","v":""},{"$f":"IF(A147=\"\",\"\",\"von \"&Stammdaten!$N$6)","v":""},130]
["",{"$f":"IF(Daten!M132=\"\",\"\",Daten!M132)","v":""},null,null,null,{"$f":"IF(Daten!N132=\"\",\"\",Daten!N132)","v":""},{"$f":"IF(A148=\"\",\"\",\"von \"&Stammdaten!$N$6)","v":""},131]
[{"$f":"IF(F149=\"\",\"\",A148+1)","v":""},{"$f":"IF(Daten!M133=\"\",\"\",Daten!M133)","v":""},null,null,null,{"$f":"IF(Daten!N133=\"\",\"\",Daten!N133)","v":""},{"$f":"IF(A149=\"\",\"\",\"von \"&Stammdaten!$N$6)","v":""},132]
["",{"$f":"IF(Daten!M134=\"\",\"\",Daten!M134)","v":""},null,null,null,{"$f":"IF(Daten!N134=\"\",\"\",Daten!N134)","v":""},{"$f":"IF(A150=\"\",\"\",\"von \"&Stammdaten!$N$6)","v":""},133]
["",{"$f":"IF(Daten!M135=\"\",\"\",Daten!M135)","v":""},null,null,null,{"$f":"IF(Daten!N135=\"\",\"\",Daten!N135)","v":""},{"$f":"IF(A151=\"\",\"\",\"von \"&Stammdaten!$N$6)","v":""},134]
["",{"$f":"IF(Daten!M136=\"\",\"\",Daten!M136)","v":""},null,null,null,{"$f":"IF(Daten!N136=\"\",\"\",Daten!N136)","v":""},{"$f":"IF(A152=\"\",\"\",\"von \"&Stammdaten!$N$6)","v":""},135]
["",{"$f":"IF(Daten!M137=\"\",\"\",Daten!M137)","v":""},null,null,null,{"$f":"IF(Daten!N137=\"\",\"\",Daten!N137)","v":""},{"$f":"IF(A153=\"\",\"\",\"von \"&Stammdaten!$N$6)","v":""},136]
["",{"$f":"IF(Daten!M138=\"\",\"\",Daten!M138)","v":""},null,null,null,{"$f":"IF(Daten!N138=\"\",\"\",Daten!N138)","v":""},{"$f":"IF(A154=\"\",\"\",\"von \"&Stammdaten!$N$6)","v":""},137]
["",{"$f":"IF(Daten!M139=\"\",\"\",Daten!M139)","v":""},null,null,null,{"$f":"IF(Daten!N139=\"\",\"\",Daten!N139)","v":""},{"$f":"IF(A155=\"\",\"\",\"von \"&Stammdaten!$N$6)","v":""},138]
["",{"$f":"IF(Daten!M140=\"\",\"\",Daten!M140)","v":""},null,null,null,{"$f":"IF(Daten!N140=\"\",\"\",Daten!N140)","v":""},{"$f":"IF(A156=\"\",\"\",\"von \"&Stammdaten!$N$6)","v":""},139]
["",{"$f":"IF(Daten!M141=\"\",\"\",Daten!M141)","v":""},null,null,null,{"$f":"IF(Daten!N141=\"\",\"\",Daten!N141)","v":""},{"$f":"IF(A157=\"\",\"\",\"von \"&Stammdaten!$N$6)","v":""},140]
["",{"$f":"IF(Daten!M142=\"\",\"\",Daten!M142)","v":""},null,null,null,{"$f":"IF(Daten!N142=\"\",\"\",Daten!N142)","v":""},{"$f":"IF(A158=\"\",\"\",\"von \"&Stammdaten!$N$6)","v":""},141]
["",{"$f":"IF(Daten!M143=\"\",\"\",Daten!M143)","v":""},null,null,null,{"$f":"IF(Daten!N143=\"\",\"\",Daten!N143)","v":""},{"$f":"IF(A159=\"\",\"\",\"von \"&Stammdaten!$N$6)","v":""},142]
["",{"$f":"IF(Daten!M144=\"\",\"\",Daten!M144)","v":""},null,null,null,{"$f":"IF(Daten!N144=\"\",\"\",Daten!N144)","v":""},{"$f":"IF(A160=\"\",\"\",\"von \"&Stammdaten!$N$6)","v":""},143]
["",{"$f":"IF(Daten!M145=\"\",\"\",Daten!M145)","v":""},null,null,null,{"$f":"IF(Daten!N145=\"\",\"\",Daten!N145)","v":""},{"$f":"IF(A161=\"\",\"\",\"von \"&Stammdaten!$N$6)","v":""},144]
["",{"$f":"IF(Daten!M146=\"\",\"\",Daten!M146)","v":""},null,null,null,{"$f":"IF(Daten!N146=\"\",\"\",Daten!N146)","v":""},{"$f":"IF(A162=\"\",\"\",\"von \"&Stammdaten!$N$6)","v":""},145]
["",{"$f":"IF(Daten!M147=\"\",\"\",Daten!M147)","v":""},null,null,null,{"$f":"IF(Daten!N147=\"\",\"\",Daten!N147)","v":""},{"$f":"IF(A163=\"\",\"\",\"von \"&Stammdaten!$N$6)","v":""},146]
["",{"$f":"IF(Daten!M148=\"\",\"\",Daten!M148)","v":""},null,null,null,{"$f":"IF(Daten!N148=\"\",\"\",Daten!N148)","v":""},{"$f":"IF(A164=\"\",\"\",\"von \"&Stammdaten!$N$6)","v":""},147]
["",{"$f":"IF(Daten!M149=\"\",\"\",Daten!M149)","v":""},null,null,null,{"$f":"IF(Daten!N149=\"\",\"\",Daten!N149)","v":""},{"$f":"IF(A165=\"\",\"\",\"von \"&Stammdaten!$N$6)","v":""},148]
["",{"$f":"IF(Daten!M150=\"\",\"\",Daten!M150)","v":""},null,null,null,{"$f":"IF(Daten!N150=\"\",\"\",Daten!N150)","v":""},{"$f":"IF(A166=\"\",\"\",\"von \"&Stammdaten!$N$6)","v":""},149]
[{"$f":"IF(F167=\"\",\"\",A166+1)","v":""},{"$f":"IF(Daten!M151=\"\",\"\",Daten!M151)","v":""},null,null,null,{"$f":"IF(Daten!N151=\"\",\"\",Daten!N151)","v":""},{"$f":"IF(A167=\"\",\"\",\"von \"&Stammdaten!$N$6)","v":""},150]

{"sheet":"K3 Urkunde-Platz 1","index":16,"n_rows":39,"n_cols":12,"rows_kept":39,"cut":false,"hidden":false,"merged":[[13,2,16,15],[25,2,25,14],[26,2,26,15],[27,2,27,15],[28,2,28,15],[29,2,29,15],[38,11,40,16],[30,2,30,15],[32,2,32,15],[33,2,33,15],[34,2,34,15],[37,9,37,16],[31,8,31,16]]}
[]
[]
[]
[]
[]
[]
[]
[]
[]
[]
[]
[]
[]
[null,null,{"$f":"IF(Stammdaten!$C$8=\"\",\"\",Stammdaten!$C$8)","v":"Dat Groote Püüster Scheeten"}]
[]
[]
[]
[]
[]
[]
[]
[]
[]
[]
[]
[]
[]
[]
[]
[null,null,{"$f":"Stammdaten!$J$10","v":"Hiermit verleiht der SV-Soderstorf"}]
[null,null,{"$f":"IF(Daten!$M$2=\"\",\"\",Daten!$M$2)","v":""}]
[null,null,"den 1. Platz in der",null,null,null,null,null,{"$f":"Stammdaten!$J$6","v":0}]
[null,null,"mit einer Trefferleistung von"]
[null,null,{"$f":"IF(Daten!$N$2=\"\",\"\",Daten!$N$2)","v":""}]
[null,null,"diese Urkunde"]
[]
[]
[null,null,null,null,null,null,null,null,null,{"$f":"IF(Stammdaten!$C$4=\"\",\"\",CONCATENATE(Stammdaten!$C$5,\", den\",\" \",TEXT(Stammdaten!$C$4,\"TT.MM.JJJJ\")))","v":""}]
[null,null,null,null,null,null,null,null,null,null,null,{"$f":"CONCATENATE(Stammdaten!$C$7)","v":"Rolf Marquardt"}]

{"sheet":"K3 Urkunde-Platz 2","index":17,"n_rows":39,"n_cols":12,"rows_kept":39,"cut":false,"hidden":false,"merged":[[13,2,16,15],[25,2,25,14],[26,2,26,15],[27,2,27,15],[28,2,28,15],[29,2,29,15],[38,11,40,16],[30,2,30,15],[32,2,32,15],[33,2,33,15],[34,2,34,15],[37,9,37,16],[31,8,31,16]]}
[]
[]
[]
[]
[]
[]
[]
[]
[]
[]
[]
[]
[]
[null,null,{"$f":"IF(Stammdaten!$C$8=\"\",\"\",Stammdaten!$C$8)","v":"Dat Groote Püüster Scheeten"}]
[]
[]
[]
[]
[]
[]
[]
[]
[]
[]
[]
[]
[]
[]
[]
[null,null,{"$f":"Stammdaten!$J$10","v":"Hiermit verleiht der SV-Soderstorf"}]
[null,null,{"$f":"IF(Daten!$M$3=\"\",\"\",Daten!$M$3)","v":""}]
[null,null,"den 2. Platz in der",null,null,null,null,null,{"$f":"Stammdaten!$J$6","v":0}]
[null,null,"mit einer Trefferleistung von"]
[null,null,{"$f":"IF(Daten!$N$3=\"\",\"\",Daten!$N$3)","v":""}]
[null,null,"diese Urkunde"]
[]
[]
[null,null,null,null,null,null,null,null,null,{"$f":"IF(Stammdaten!$C$4=\"\",\"\",CONCATENATE(Stammdaten!$C$5,\", den\",\" \",TEXT(Stammdaten!$C$4,\"TT.MM.JJJJ\")))","v":""}]
[null,null,null,null,null,null,null,null,null,null,null,{"$f":"CONCATENATE(Stammdaten!$C$7)","v":"Rolf Marquardt"}]

{"sheet":"K3 Urkunde-Platz 3","index":18,"n_rows":39,"n_cols":12,"rows_kept":39,"cut":false,"hidden":false,"merged":[[13,2,16,15],[25,2,25,14],[26,2,26,15],[27,2,27,15],[28,2,28,15],[29,2,29,15],[38,11,40,16],[30,2,30,15],[32,2,32,15],[33,2,33,15],[34,2,34,15],[37,9,37,16],[31,8,31,16]]}
[]
[]
[]
[]
[]
[]
[]
[]
[]
[]
[]
[]
[]
[null,null,{"$f":"IF(Stammdaten!$C$8=\"\",\"\",Stammdaten!$C$8)","v":"Dat Groote Püüster Scheeten"}]
[]
[]
[]
[]
[]
[]
[]
[]
[]
[]
[]
[]
[]
[]
[]
[null,null,{"$f":"Stammdaten!$J$10","v":"Hiermit verleiht der SV-Soderstorf"}]
[null,null,{"$f":"IF(Daten!$M$4=\"\",\"\",Daten!$M$4)","v":""}]
[null,null,"den 3. Platz in der",null,null,null,null,null,{"$f":"Stammdaten!$J$6","v":0}]
[null,null,"mit einer Trefferleistung von"]
[null,null,{"$f":"IF(Daten!$N$4=\"\",\"\",Daten!$N$4)","v":""}]
[null,null,"diese Urkunde"]
[]
[]
[null,null,null,null,null,null,null,null,null,{"$f":"IF(Stammdaten!$C$4=\"\",\"\",CONCATENATE(Stammdaten!$C$5,\", den\",\" \",TEXT(Stammdaten!$C$4,\"TT.MM.JJJJ\")))","v":""}]
[null,null,null,null,null,null,null,null,null,null,null,{"$f":"CONCATENATE(Stammdaten!$C$7)","v":"Rolf Marquardt"}]

{"sheet":"Ergebnis Klasse 4","index":19,"n_rows":167,"n_cols":8,"rows_kept":167,"cut":false,"hidden":false,"merged":[[164,1,164,4],[165,1,165,4],[166,1,166,4],[158,1,158,4],[159,1,159,4],[160,1,160,4],[161,1,161,4],[162,1,162,4],[163,1,163,4],[152,1,152,4],[153,1,153,4],[154,1,154,4],[155,1,155,4],[156,1,156,4],[157,1,157,4],[146,1,146,4],[147,1,147,4],[148,1,148,4],[149,1,149,4],[150,1,150,4],[151,1,151,4],[140,1,140,4],[141,1,141,4],[142,1,142,4],[143,1,143,4],[144,1,144,4],[145,1,145,4],[134,1,134,4],[135,1,135,4],[136,1,136,4],[137,1,137,4],[138,1,138,4],[139,1,139,4],[128,1,128,4],[129,1,129,4],[130,1,130,4],[131,1,131,4],[132,1,132,4],[133,1,133,4],[122,1,122,4],[123,1,123,4],[124,1,124,4],[125,1,125,4],[126,1,126,4],[127,1,127,4],[116,1,116,4],[117,1,117,4],[118,1,118,4],[119,1,119,4],[120,1,120,4],[121,1,121,4],[110,1,110,4],[111,1,111,4],[112,1,112,4],[113,1,113,4],[114,1,114,4],[115,1,115,4],[104,1,104,4],[105,1,105,4],[106,1,106,4],[107,1,107,4],[108,1,108,4],[109,1,109,4],[98,1,98,4],[99,1,99,4],[100,1,100,4],[101,1,101,4],[102,1,102,4],[103,1,103,4],[92,1,92,4],[93,1,93,4],[94,1,94,4],[95,1,95,4],[96,1,96,4],[97,1,97,4],[86,1,86,4],[87,1,87,4],[88,1,88,4],[89,1,89,4],[90,1,90,4],[91,1,91,4],[80,1,80,4],[81,1,81,4],[82,1,82,4],[83,1,83,4],[84,1,84,4],[85,1,85,4],[74,1,74,4],[75,1,75,4],[76,1,76,4],[77,1,77,4],[78,1,78,4],[79,1,79,4],[68,1,68,4],[69,1,69,4],[70,1,70,4],[71,1,71,4],[72,1,72,4],[73,1,73,4],[62,1,62,4],[63,1,63,4],[64,1,64,4],[65,1,65,4],[66,1,66,4],[67,1,67,4],[56,1,56,4],[57,1,57,4],[58,1,58,4],[59,1,59,4],[60,1,60,4],[61,1,61,4],[50,1,50,4],[51,1,51,4],[52,1,52,4],[53,1,53,4],[54,1,54,4],[55,1,55,4],[44,1,44,4],[45,1,45,4],[46,1,46,4],[47,1,47,4],[48,1,48,4],[49,1,49,4],[38,1,38,4],[39,1,39,4],[40,1,40,4],[41,1,41,4],[42,1,42,4],[43,1,43,4],[32,1,32,4],[33,1,33,4],[34,1,34,4],[35,1,35,4],[36,1,36,4],[37,1,37,4],[26,1,26,4],[27,1,27,4],[28,1,28,4],[29,1,29,4],[30,1,30,4],[31,1,31,4],[20,1,20,4],[21,1,21,4],[22,1,22,4],[23,1,23,4],[24,1,24,4],[25,1,25,4],[14,0,14,6],[15,0,15,6],[16,1,16,4],[17,1,17,4],[18,1,18,4],[19,1,19,4]]}
[]
[]
[]
[]
[]
[]
[]
[]
[]
[]
[]
[]
[]
[]
[{"$f":"IF(Stammdaten!$C$4=\"\",\"\",CONCATENATE(TEXT(Stammdaten!$C$4,\"TT.MM.JJJJ\"),\" \",\"in \",Stammdaten!$C$5,\" \"\"\",Stammdaten!C8,\"\"\"\"))","v":""}]
[{"$f":"IF(Stammdaten!J7=\"\",\"\",Stammdaten!J7)","v":""}]
["Platz:","Name:",null,null,null,"Treffer:"]
[{"$f":"IF(Daten!Q2=\"\",\"\",1)","v":""},{"$f":"IF(Daten!P2=\"\",\"\",Daten!P2)","v":""},null,null,null,{"$f":"IF(Daten!Q2=\"\",\"\",Daten!Q2)","v":""},{"$f":"IF(A18=\"\",\"\",\"von \"&Stammdaten!$N$7)","v":""},1]
[{"$f":"IF(F19=\"\",\"\",A18+1)","v":""},{"$f":"IF(Daten!P3=\"\",\"\",Daten!P3)","v":""},null,null,null,{"$f":"IF(Daten!Q3=\"\",\"\",Daten!Q3)","v":""},{"$f":"IF(A19=\"\",\"\",\"von \"&Stammdaten!$N$7)","v":""},2]
[{"$f":"IF(F20=\"\",\"\",A19+1)","v":""},{"$f":"IF(Daten!P4=\"\",\"\",Daten!P4)","v":""},null,null,null,{"$f":"IF(Daten!Q4=\"\",\"\",Daten!Q4)","v":""},{"$f":"IF(A20=\"\",\"\",\"von \"&Stammdaten!$N$7)","v":""},3]
[{"$f":"IF(F21=\"\",\"\",A20+1)","v":""},{"$f":"IF(Daten!P5=\"\",\"\",Daten!P5)","v":""},null,null,null,{"$f":"IF(Daten!Q5=\"\",\"\",Daten!Q5)","v":""},{"$f":"IF(A21=\"\",\"\",\"von \"&Stammdaten!$N$7)","v":""},4]
["",{"$f":"IF(Daten!P6=\"\",\"\",Daten!P6)","v":""},null,null,null,{"$f":"IF(Daten!Q6=\"\",\"\",Daten!Q6)","v":""},{"$f":"IF(A22=\"\",\"\",\"von \"&Stammdaten!$N$7)","v":""},5]
["",{"$f":"IF(Daten!P7=\"\",\"\",Daten!P7)","v":""},null,null,null,{"$f":"IF(Daten!Q7=\"\",\"\",Daten!Q7)","v":""},{"$f":"IF(A23=\"\",\"\",\"von \"&Stammdaten!$N$7)","v":""},6]
["",{"$f":"IF(Daten!P8=\"\",\"\",Daten!P8)","v":""},null,null,null,{"$f":"IF(Daten!Q8=\"\",\"\",Daten!Q8)","v":""},{"$f":"IF(A24=\"\",\"\",\"von \"&Stammdaten!$N$7)","v":""},7]
["",{"$f":"IF(Daten!P9=\"\",\"\",Daten!P9)","v":""},null,null,null,{"$f":"IF(Daten!Q9=\"\",\"\",Daten!Q9)","v":""},{"$f":"IF(A25=\"\",\"\",\"von \"&Stammdaten!$N$7)","v":""},8]
["",{"$f":"IF(Daten!P10=\"\",\"\",Daten!P10)","v":""},null,null,null,{"$f":"IF(Daten!Q10=\"\",\"\",Daten!Q10)","v":""},{"$f":"IF(A26=\"\",\"\",\"von \"&Stammdaten!$N$7)","v":""},9]
["",{"$f":"IF(Daten!P11=\"\",\"\",Daten!P11)","v":""},null,null,null,{"$f":"IF(Daten!Q11=\"\",\"\",Daten!Q11)","v":""},{"$f":"IF(A27=\"\",\"\",\"von \"&Stammdaten!$N$7)","v":""},10]
["",{"$f":"IF(Daten!P12=\"\",\"\",Daten!P12)","v":""},null,null,null,{"$f":"IF(Daten!Q12=\"\",\"\",Daten!Q12)","v":""},{"$f":"IF(A28=\"\",\"\",\"von \"&Stammdaten!$N$7)","v":""},11]
["",{"$f":"IF(Daten!P13=\"\",\"\",Daten!P13)","v":""},null,null,null,{"$f":"IF(Daten!Q13=\"\",\"\",Daten!Q13)","v":""},{"$f":"IF(A29=\"\",\"\",\"von \"&Stammdaten!$N$7)","v":""},12]
["",{"$f":"IF(Daten!P14=\"\",\"\",Daten!P14)","v":""},null,null,null,{"$f":"IF(Daten!Q14=\"\",\"\",Daten!Q14)","v":""},{"$f":"IF(A30=\"\",\"\",\"von \"&Stammdaten!$N$7)","v":""},13]
["",{"$f":"IF(Daten!P15=\"\",\"\",Daten!P15)","v":""},null,null,null,{"$f":"IF(Daten!Q15=\"\",\"\",Daten!Q15)","v":""},{"$f":"IF(A31=\"\",\"\",\"von \"&Stammdaten!$N$7)","v":""},14]
["",{"$f":"IF(Daten!P16=\"\",\"\",Daten!P16)","v":""},null,null,null,{"$f":"IF(Daten!Q16=\"\",\"\",Daten!Q16)","v":""},{"$f":"IF(A32=\"\",\"\",\"von \"&Stammdaten!$N$7)","v":""},15]
["",{"$f":"IF(Daten!P17=\"\",\"\",Daten!P17)","v":""},null,null,null,{"$f":"IF(Daten!Q17=\"\",\"\",Daten!Q17)","v":""},{"$f":"IF(A33=\"\",\"\",\"von \"&Stammdaten!$N$7)","v":""},16]
["",{"$f":"IF(Daten!P18=\"\",\"\",Daten!P18)","v":""},null,null,null,{"$f":"IF(Daten!Q18=\"\",\"\",Daten!Q18)","v":""},{"$f":"IF(A34=\"\",\"\",\"von \"&Stammdaten!$N$7)","v":""},17]
["",{"$f":"IF(Daten!P19=\"\",\"\",Daten!P19)","v":""},null,null,null,{"$f":"IF(Daten!Q19=\"\",\"\",Daten!Q19)","v":""},{"$f":"IF(A35=\"\",\"\",\"von \"&Stammdaten!$N$7)","v":""},18]
["",{"$f":"IF(Daten!P20=\"\",\"\",Daten!P20)","v":""},null,null,null,{"$f":"IF(Daten!Q20=\"\",\"\",Daten!Q20)","v":""},{"$f":"IF(A36=\"\",\"\",\"von \"&Stammdaten!$N$7)","v":""},19]
["",{"$f":"IF(Daten!P21=\"\",\"\",Daten!P21)","v":""},null,null,null,{"$f":"IF(Daten!Q21=\"\",\"\",Daten!Q21)","v":""},{"$f":"IF(A37=\"\",\"\",\"von \"&Stammdaten!$N$7)","v":""},20]
["",{"$f":"IF(Daten!P22=\"\",\"\",Daten!P22)","v":""},null,null,null,{"$f":"IF(Daten!Q22=\"\",\"\",Daten!Q22)","v":""},{"$f":"IF(A38=\"\",\"\",\"von \"&Stammdaten!$N$7)","v":""},21]
["",{"$f":"IF(Daten!P23=\"\",\"\",Daten!P23)","v":""},null,null,null,{"$f":"IF(Daten!Q23=\"\",\"\",Daten!Q23)","v":""},{"$f":"IF(A39=\"\",\"\",\"von \"&Stammdaten!$N$7)","v":""},22]
["",{"$f":"IF(Daten!P24=\"\",\"\",Daten!P24)","v":""},null,null,null,{"$f":"IF(Daten!Q24=\"\",\"\",Daten!Q24)","v":""},{"$f":"IF(A40=\"\",\"\",\"von \"&Stammdaten!$N$7)","v":""},23]
["",{"$f":"IF(Daten!P25=\"\",\"\",Daten!P25)","v":""},null,null,null,{"$f":"IF(Daten!Q25=\"\",\"\",Daten!Q25)","v":""},{"$f":"IF(A41=\"\",\"\",\"von \"&Stammdaten!$N$7)","v":""},24]
["",{"$f":"IF(Daten!P26=\"\",\"\",Daten!P26)","v":""},null,null,null,{"$f":"IF(Daten!Q26=\"\",\"\",Daten!Q26)","v":""},{"$f":"IF(A42=\"\",\"\",\"von \"&Stammdaten!$N$7)","v":""},25]
["",{"$f":"IF(Daten!P27=\"\",\"\",Daten!P27)","v":""},null,null,null,{"$f":"IF(Daten!Q27=\"\",\"\",Daten!Q27)","v":""},{"$f":"IF(A43=\"\",\"\",\"von \"&Stammdaten!$N$7)","v":""},26]
["",{"$f":"IF(Daten!P28=\"\",\"\",Daten!P28)","v":""},null,null,null,{"$f":"IF(Daten!Q28=\"\",\"\",Daten!Q28)","v":""},{"$f":"IF(A44=\"\",\"\",\"von \"&Stammdaten!$N$7)","v":""},27]
["",{"$f":"IF(Daten!P29=\"\",\"\",Daten!P29)","v":""},null,null,null,{"$f":"IF(Daten!Q29=\"\",\"\",Daten!Q29)","v":""},{"$f":"IF(A45=\"\",\"\",\"von \"&Stammdaten!$N$7)","v":""},28]
["",{"$f":"IF(Daten!P30=\"\",\"\",Daten!P30)","v":""},null,null,null,{"$f":"IF(Daten!Q30=\"\",\"\",Daten!Q30)","v":""},{"$f":"IF(A46=\"\",\"\",\"von \"&Stammdaten!$N$7)","v":""},29]
["",{"$f":"IF(Daten!P31=\"\",\"\",Daten!P31)","v":""},null,null,null,{"$f":"IF(Daten!Q31=\"\",\"\",Daten!Q31)","v":""},{"$f":"IF(A47=\"\",\"\",\"von \"&Stammdaten!$N$7)","v":""},30]
["",{"$f":"IF(Daten!P32=\"\",\"\",Daten!P32)","v":""},null,null,null,{"$f":"IF(Daten!Q32=\"\",\"\",Daten!Q32)","v":""},{"$f":"IF(A48=\"\",\"\",\"von \"&Stammdaten!$N$7)","v":""},31]
["",{"$f":"IF(Daten!P33=\"\",\"\",Daten!P33)","v":""},null,null,null,{"$f":"IF(Daten!Q33=\"\",\"\",Daten!Q33)","v":""},{"$f":"IF(A49=\"\",\"\",\"von \"&Stammdaten!$N$7)","v":""},32]
["",{"$f":"IF(Daten!P34=\"\",\"\",Daten!P34)","v":""},null,null,null,{"$f":"IF(Daten!Q34=\"\",\"\",Daten!Q34)","v":""},{"$f":"IF(A50=\"\",\"\",\"von \"&Stammdaten!$N$7)","v":""},33]
["",{"$f":"IF(Daten!P35=\"\",\"\",Daten!P35)","v":""},null,null,null,{"$f":"IF(Daten!Q35=\"\",\"\",Daten!Q35)","v":""},{"$f":"IF(A51=\"\",\"\",\"von \"&Stammdaten!$N$7)","v":""},34]
["",{"$f":"IF(Daten!P36=\"\",\"\",Daten!P36)","v":""},null,null,null,{"$f":"IF(Daten!Q36=\"\",\"\",Daten!Q36)","v":""},{"$f":"IF(A52=\"\",\"\",\"von \"&Stammdaten!$N$7)","v":""},35]
["",{"$f":"IF(Daten!P37=\"\",\"\",Daten!P37)","v":""},null,null,null,{"$f":"IF(Daten!Q37=\"\",\"\",Daten!Q37)","v":""},{"$f":"IF(A53=\"\",\"\",\"von \"&Stammdaten!$N$7)","v":""},36]
["",{"$f":"IF(Daten!P38=\"\",\"\",Daten!P38)","v":""},null,null,null,{"$f":"IF(Daten!Q38=\"\",\"\",Daten!Q38)","v":""},{"$f":"IF(A54=\"\",\"\",\"von \"&Stammdaten!$N$7)","v":""},37]
["",{"$f":"IF(Daten!P39=\"\",\"\",Daten!P39)","v":""},null,null,null,{"$f":"IF(Daten!Q39=\"\",\"\",Daten!Q39)","v":""},{"$f":"IF(A55=\"\",\"\",\"von \"&Stammdaten!$N$7)","v":""},38]
["",{"$f":"IF(Daten!P40=\"\",\"\",Daten!P40)","v":""},null,null,null,{"$f":"IF(Daten!Q40=\"\",\"\",Daten!Q40)","v":""},{"$f":"IF(A56=\"\",\"\",\"von \"&Stammdaten!$N$7)","v":""},39]
["",{"$f":"IF(Daten!P41=\"\",\"\",Daten!P41)","v":""},null,null,null,{"$f":"IF(Daten!Q41=\"\",\"\",Daten!Q41)","v":""},{"$f":"IF(A57=\"\",\"\",\"von \"&Stammdaten!$N$7)","v":""},40]
["",{"$f":"IF(Daten!P42=\"\",\"\",Daten!P42)","v":""},null,null,null,{"$f":"IF(Daten!Q42=\"\",\"\",Daten!Q42)","v":""},{"$f":"IF(A58=\"\",\"\",\"von \"&Stammdaten!$N$7)","v":""},41]
[{"$f":"IF(F59=\"\",\"\",A58+1)","v":""},{"$f":"IF(Daten!P43=\"\",\"\",Daten!P43)","v":""},null,null,null,{"$f":"IF(Daten!Q43=\"\",\"\",Daten!Q43)","v":""},{"$f":"IF(A59=\"\",\"\",\"von \"&Stammdaten!$N$7)","v":""},42]
["",{"$f":"IF(Daten!P44=\"\",\"\",Daten!P44)","v":""},null,null,null,{"$f":"IF(Daten!Q44=\"\",\"\",Daten!Q44)","v":""},{"$f":"IF(A60=\"\",\"\",\"von \"&Stammdaten!$N$7)","v":""},43]
["",{"$f":"IF(Daten!P45=\"\",\"\",Daten!P45)","v":""},null,null,null,{"$f":"IF(Daten!Q45=\"\",\"\",Daten!Q45)","v":""},{"$f":"IF(A61=\"\",\"\",\"von \"&Stammdaten!$N$7)","v":""},44]
["",{"$f":"IF(Daten!P46=\"\",\"\",Daten!P46)","v":""},null,null,null,{"$f":"IF(Daten!Q46=\"\",\"\",Daten!Q46)","v":""},{"$f":"IF(A62=\"\",\"\",\"von \"&Stammdaten!$N$7)","v":""},45]
["",{"$f":"IF(Daten!P47=\"\",\"\",Daten!P47)","v":""},null,null,null,{"$f":"IF(Daten!Q47=\"\",\"\",Daten!Q47)","v":""},{"$f":"IF(A63=\"\",\"\",\"von \"&Stammdaten!$N$7)","v":""},46]
["",{"$f":"IF(Daten!P48=\"\",\"\",Daten!P48)","v":""},null,null,null,{"$f":"IF(Daten!Q48=\"\",\"\",Daten!Q48)","v":""},{"$f":"IF(A64=\"\",\"\",\"von \"&Stammdaten!$N$7)","v":""},47]
["",{"$f":"IF(Daten!P49=\"\",\"\",Daten!P49)","v":""},null,null,null,{"$f":"IF(Daten!Q49=\"\",\"\",Daten!Q49)","v":""},{"$f":"IF(A65=\"\",\"\",\"von \"&Stammdaten!$N$7)","v":""},48]
["",{"$f":"IF(Daten!P50=\"\",\"\",Daten!P50)","v":""},null,null,null,{"$f":"IF(Daten!Q50=\"\",\"\",Daten!Q50)","v":""},{"$f":"IF(A66=\"\",\"\",\"von \"&Stammdaten!$N$7)","v":""},49]
["",{"$f":"IF(Daten!P51=\"\",\"\",Daten!P51)","v":""},null,null,null,{"$f":"IF(Daten!Q51=\"\",\"\",Daten!Q51)","v":""},{"$f":"IF(A67=\"\",\"\",\"von \"&Stammdaten!$N$7)","v":""},50]
["",{"$f":"IF(Daten!P52=\"\",\"\",Daten!P52)","v":""},null,null,null,{"$f":"IF(Daten!Q52=\"\",\"\",Daten!Q52)","v":""},{"$f":"IF(A68=\"\",\"\",\"von \"&Stammdaten!$N$7)","v":""},51]
["",{"$f":"IF(Daten!P53=\"\",\"\",Daten!P53)","v":""},null,null,null,{"$f":"IF(Daten!Q53=\"\",\"\",Daten!Q53)","v":""},{"$f":"IF(A69=\"\",\"\",\"von \"&Stammdaten!$N$7)","v":""},52]
["",{"$f":"IF(Daten!P54=\"\",\"\",Daten!P54)","v":""},null,null,null,{"$f":"IF(Daten!Q54=\"\",\"\",Daten!Q54)","v":""},{"$f":"IF(A70=\"\",\"\",\"von \"&Stammdaten!$N$7)","v":""},53]
["",{"$f":"IF(Daten!P55=\"\",\"\",Daten!P55)","v":""},null,null,null,{"$f":"IF(Daten!Q55=\"\",\"\",Daten!Q55)","v":""},{"$f":"IF(A71=\"\",\"\",\"von \"&Stammdaten!$N$7)","v":""},54]
["",{"$f":"IF(Daten!P56=\"\",\"\",Daten!P56)","v":""},null,null,null,{"$f":"IF(Daten!Q56=\"\",\"\",Daten!Q56)","v":""},{"$f":"IF(A72=\"\",\"\",\"von \"&Stammdaten!$N$7)","v":""},55]
["",{"$f":"IF(Daten!P57=\"\",\"\",Daten!P57)","v":""},null,null,null,{"$f":"IF(Daten!Q57=\"\",\"\",Daten!Q57)","v":""},{"$f":"IF(A73=\"\",\"\",\"von \"&Stammdaten!$N$7)","v":""},56]
["",{"$f":"IF(Daten!P58=\"\",\"\",Daten!P58)","v":""},null,null,null,{"$f":"IF(Daten!Q58=\"\",\"\",Daten!Q58)","v":""},{"$f":"IF(A74=\"\",\"\",\"von \"&Stammdaten!$N$7)","v":""},57]
["",{"$f":"IF(Daten!P59=\"\",\"\",Daten!P59)","v":""},null,null,null,{"$f":"IF(Daten!Q59=\"\",\"\",Daten!Q59)","v":""},{"$f":"IF(A75=\"\",\"\",\"von \"&Stammdaten!$N$7)","v":""},58]
["",{"$f":"IF(Daten!P60=\"\",\"\",Daten!P60)","v":""},null,null,null,{"$f":"IF(Daten!Q60=\"\",\"\",Daten!Q60)","v":""},{"$f":"IF(A76=\"\",\"\",\"von \"&Stammdaten!$N$7)","v":""},59]
["",{"$f":"IF(Daten!P61=\"\",\"\",Daten!P61)","v":""},null,null,null,{"$f":"IF(Daten!Q61=\"\",\"\",Daten!Q61)","v":""},{"$f":"IF(A77=\"\",\"\",\"von \"&Stammdaten!$N$7)","v":""},60]
["",{"$f":"IF(Daten!P62=\"\",\"\",Daten!P62)","v":""},null,null,null,{"$f":"IF(Daten!Q62=\"\",\"\",Daten!Q62)","v":""},{"$f":"IF(A78=\"\",\"\",\"von \"&Stammdaten!$N$7)","v":""},61]
["",{"$f":"IF(Daten!P63=\"\",\"\",Daten!P63)","v":""},null,null,null,{"$f":"IF(Daten!Q63=\"\",\"\",Daten!Q63)","v":""},{"$f":"IF(A79=\"\",\"\",\"von \"&Stammdaten!$N$7)","v":""},62]
["",{"$f":"IF(Daten!P64=\"\",\"\",Daten!P64)","v":""},null,null,null,{"$f":"IF(Daten!Q64=\"\",\"\",Daten!Q64)","v":""},{"$f":"IF(A80=\"\",\"\",\"von \"&Stammdaten!$N$7)","v":""},63]
["",{"$f":"IF(Daten!P65=\"\",\"\",Daten!P65)","v":""},null,null,null,{"$f":"IF(Daten!Q65=\"\",\"\",Daten!Q65)","v":""},{"$f":"IF(A81=\"\",\"\",\"von \"&Stammdaten!$N$7)","v":""},64]
["",{"$f":"IF(Daten!P66=\"\",\"\",Daten!P66)","v":""},null,null,null,{"$f":"IF(Daten!Q66=\"\",\"\",Daten!Q66)","v":""},{"$f":"IF(A82=\"\",\"\",\"von \"&Stammdaten!$N$7)","v":""},65]
["",{"$f":"IF(Daten!P67=\"\",\"\",Daten!P67)","v":""},null,null,null,{"$f":"IF(Daten!Q67=\"\",\"\",Daten!Q67)","v":""},{"$f":"IF(A83=\"\",\"\",\"von \"&Stammdaten!$N$7)","v":""},66]
["",{"$f":"IF(Daten!P68=\"\",\"\",Daten!P68)","v":""},null,null,null,{"$f":"IF(Daten!Q68=\"\",\"\",Daten!Q68)","v":""},{"$f":"IF(A84=\"\",\"\",\"von \"&Stammdaten!$N$7)","v":""},67]
[{"$f":"IF(F85=\"\",\"\",A84+1)","v":""},{"$f":"IF(Daten!P69=\"\",\"\",Daten!P69)","v":""},null,null,null,{"$f":"IF(Daten!Q69=\"\",\"\",Daten!Q69)","v":""},{"$f":"IF(A85=\"\",\"\",\"von \"&Stammdaten!$N$7)","v":""},68]
["",{"$f":"IF(Daten!P70=\"\",\"\",Daten!P70)","v":""},null,null,null,{"$f":"IF(Daten!Q70=\"\",\"\",Daten!Q70)","v":""},{"$f":"IF(A86=\"\",\"\",\"von \"&Stammdaten!$N$7)","v":""},69]
["",{"$f":"IF(Daten!P71=\"\",\"\",Daten!P71)","v":""},null,null,null,{"$f":"IF(Daten!Q71=\"\",\"\",Daten!Q71)","v":""},{"$f":"IF(A87=\"\",\"\",\"von \"&Stammdaten!$N$7)","v":""},70]
["",{"$f":"IF(Daten!P72=\"\",\"\",Daten!P72)","v":""},null,null,null,{"$f":"IF(Daten!Q72=\"\",\"\",Daten!Q72)","v":""},{"$f":"IF(A88=\"\",\"\",\"von \"&Stammdaten!$N$7)","v":""},71]
["",{"$f":"IF(Daten!P73=\"\",\"\",Daten!P73)","v":""},null,null,null,{"$f":"IF(Daten!Q73=\"\",\"\",Daten!Q73)","v":""},{"$f":"IF(A89=\"\",\"\",\"von \"&Stammdaten!$N$7)","v":""},72]
["",{"$f":"IF(Daten!P74=\"\",\"\",Daten!P74)","v":""},null,null,null,{"$f":"IF(Daten!Q74=\"\",\"\",Daten!Q74)","v":""},{"$f":"IF(A90=\"\",\"\",\"von \"&Stammdaten!$N$7)","v":""},73]
["",{"$f":"IF(Daten!P75=\"\",\"\",Daten!P75)","v":""},null,null,null,{"$f":"IF(Daten!Q75=\"\",\"\",Daten!Q75)","v":""},{"$f":"IF(A91=\"\",\"\",\"von \"&Stammdaten!$N$7)","v":""},74]
["",{"$f":"IF(Daten!P76=\"\",\"\",Daten!P76)","v":""},null,null,null,{"$f":"IF(Daten!Q76=\"\",\"\",Daten!Q76)","v":""},{"$f":"IF(A92=\"\",\"\",\"von \"&Stammdaten!$N$7)","v":""},75]
["",{"$f":"IF(Daten!P77=\"\",\"\",Daten!P77)","v":""},null,null,null,{"$f":"IF(Daten!Q77=\"\",\"\",Daten!Q77)","v":""},{"$f":"IF(A93=\"\",\"\",\"von \"&Stammdaten!$N$7)","v":""},76]
["",{"$f":"IF(Daten!P78=\"\",\"\",Daten!P78)","v":""},null,null,null,{"$f":"IF(Daten!Q78=\"\",\"\",Daten!Q78)","v":""},{"$f":"IF(A94=\"\",\"\",\"von \"&Stammdaten!$N$7)","v":""},77]
["",{"$f":"IF(Daten!P79=\"\",\"\",Daten!P79)","v":""},null,null,null,{"$f":"IF(Daten!Q79=\"\",\"\",Daten!Q79)","v":""},{"$f":"IF(A95=\"\",\"\",\"von \"&Stammdaten!$N$7)","v":""},78]
["",{"$f":"IF(Daten!P80=\"\",\"\",Daten!P80)","v":""},null,null,null,{"$f":"IF(Daten!Q80=\"\",\"\",Daten!Q80)","v":""},{"$f":"IF(A96=\"\",\"\",\"von \"&Stammdaten!$N$7)","v":""},79]
["",{"$f":"IF(Daten!P81=\"\",\"\",Daten!P81)","v":""},null,null,null,{"$f":"IF(Daten!Q81=\"\",\"\",Daten!Q81)","v":""},{"$f":"IF(A97=\"\",\"\",\"von \"&Stammdaten!$N$7)","v":""},80]
["",{"$f":"IF(Daten!P82=\"\",\"\",Daten!P82)","v":""},null,null,null,{"$f":"IF(Daten!Q82=\"\",\"\",Daten!Q82)","v":""},{"$f":"IF(A98=\"\",\"\",\"von \"&Stammdaten!$N$7)","v":""},81]
["",{"$f":"IF(Daten!P83=\"\",\"\",Daten!P83)","v":""},null,null,null,{"$f":"IF(Daten!Q83=\"\",\"\",Daten!Q83)","v":""},{"$f":"IF(A99=\"\",\"\",\"von \"&Stammdaten!$N$7)","v":""},82]
["",{"$f":"IF(Daten!P84=\"\",\"\",Daten!P84)","v":""},null,null,null,{"$f":"IF(Daten!Q84=\"\",\"\",Daten!Q84)","v":""},{"$f":"IF(A100=\"\",\"\",\"von \"&Stammdaten!$N$7)","v":""},83]
["",{"$f":"IF(Daten!P85=\"\",\"\",Daten!P85)","v":""},null,null,null,{"$f":"IF(Daten!Q85=\"\",\"\",Daten!Q85)","v":""},{"$f":"IF(A101=\"\",\"\",\"von \"&Stammdaten!$N$7)","v":""},84]
["",{"$f":"IF(Daten!P86=\"\",\"\",Daten!P86)","v":""},null,null,null,{"$f":"IF(Daten!Q86=\"\",\"\",Daten!Q86)","v":""},{"$f":"IF(A102=\"\",\"\",\"von \"&Stammdaten!$N$7)","v":""},85]
["",{"$f":"IF(Daten!P87=\"\",\"\",Daten!P87)","v":""},null,null,null,{"$f":"IF(Daten!Q87=\"\",\"\",Daten!Q87)","v":""},{"$f":"IF(A103=\"\",\"\",\"von \"&Stammdaten!$N$7)","v":""},86]
["",{"$f":"IF(Daten!P88=\"\",\"\",Daten!P88)","v":""},null,null,null,{"$f":"IF(Daten!Q88=\"\",\"\",Daten!Q88)","v":""},{"$f":"IF(A104=\"\",\"\",\"von \"&Stammdaten!$N$7)","v":""},87]
["",{"$f":"IF(Daten!P89=\"\",\"\",Daten!P89)","v":""},null,null,null,{"$f":"IF(Daten!Q89=\"\",\"\",Daten!Q89)","v":""},{"$f":"IF(A105=\"\",\"\",\"von \"&Stammdaten!$N$7)","v":""},88]
["",{"$f":"IF(Daten!P90=\"\",\"\",Daten!P90)","v":""},null,null,null,{"$f":"IF(Daten!Q90=\"\",\"\",Daten!Q90)","v":""},{"$f":"IF(A106=\"\",\"\",\"von \"&Stammdaten!$N$7)","v":""},89]
["",{"$f":"IF(Daten!P91=\"\",\"\",Daten!P91)","v":""},null,null,null,{"$f":"IF(Daten!Q91=\"\",\"\",Daten!Q91)","v":""},{"$f":"IF(A107=\"\",\"\",\"von \"&Stammdaten!$N$7)","v":""},90]
["",{"$f":"IF(Daten!P92=\"\",\"\",Daten!P92)","v":""},null,null,null,{"$f":"IF(Daten!Q92=\"\",\"\",Daten!Q92)","v":""},{"$f":"IF(A108=\"\",\"\",\"von \"&Stammdaten!$N$7)","v":""},91]
["",{"$f":"IF(Daten!P93=\"\",\"\",Daten!P93)","v":""},null,null,null,{"$f":"IF(Daten!Q93=\"\",\"\",Daten!Q93)","v":""},{"$f":"IF(A109=\"\",\"\",\"von \"&Stammdaten!$N$7)","v":""},92]
["",{"$f":"IF(Daten!P94=\"\",\"\",Daten!P94)","v":""},null,null,null,{"$f":"IF(Daten!Q94=\"\",\"\",Daten!Q94)","v":""},{"$f":"IF(A110=\"\",\"\",\"von \"&Stammdaten!$N$7)","v":""},93]
["",{"$f":"IF(Daten!P95=\"\",\"\",Daten!P95)","v":""},null,null,null,{"$f":"IF(Daten!Q95=\"\",\"\",Daten!Q95)","v":""},{"$f":"IF(A111=\"\",\"\",\"von \"&Stammdaten!$N$7)","v":""},94]
["",{"$f":"IF(Daten!P96=\"\",\"\",Daten!P96)","v":""},null,null,null,{"$f":"IF(Daten!Q96=\"\",\"\",Daten!Q96)","v":""},{"$f":"IF(A112=\"\",\"\",\"von \"&Stammdaten!$N$7)","v":""},95]
["",{"$f":"IF(Daten!P97=\"\",\"\",Daten!P97)","v":""},null,null,null,{"$f":"IF(Daten!Q97=\"\",\"\",Daten!Q97)","v":""},{"$f":"IF(A113=\"\",\"\",\"von \"&Stammdaten!$N$7)","v":""},96]
["",{"$f":"IF(Daten!P98=\"\",\"\",Daten!P98)","v":""},null,null,null,{"$f":"IF(Daten!Q98=\"\",\"\",Daten!Q98)","v":""},{"$f":"IF(A114=\"\",\"\",\"von \"&Stammdaten!$N$7)","v":""},97]
["",{"$f":"IF(Daten!P99=\"\",\"\",Daten!P99)","v":""},null,null,null,{"$f":"IF(Daten!Q99=\"\",\"\",Daten!Q99)","v":""},{"$f":"IF(A115=\"\",\"\",\"von \"&Stammdaten!$N$7)","v":""},98]
["",{"$f":"IF(Daten!P100=\"\",\"\",Daten!P100)","v":""},null,null,null,{"$f":"IF(Daten!Q100=\"\",\"\",Daten!Q100)","v":""},{"$f":"IF(A116=\"\",\"\",\"von \"&Stammdaten!$N$7)","v":""},99]
["",{"$f":"IF(Daten!P101=\"\",\"\",Daten!P101)","v":""},null,null,null,{"$f":"IF(Daten!Q101=\"\",\"\",Daten!Q101)","v":""},{"$f":"IF(A117=\"\",\"\",\"von \"&Stammdaten!$N$7)","v":""},100]
["",{"$f":"IF(Daten!P102=\"\",\"\",Daten!P102)","v":""},null,null,null,{"$f":"IF(Daten!Q102=\"\",\"\",Daten!Q102)","v":""},{"$f":"IF(A118=\"\",\"\",\"von \"&Stammdaten!$N$7)","v":""},101]
["",{"$f":"IF(Daten!P103=\"\",\"\",Daten!P103)","v":""},null,null,null,{"$f":"IF(Daten!Q103=\"\",\"\",Daten!Q103)","v":""},{"$f":"IF(A119=\"\",\"\",\"von \"&Stammdaten!$N$7)","v":""},102]
["",{"$f":"IF(Daten!P104=\"\",\"\",Daten!P104)","v":""},null,null,null,{"$f":"IF(Daten!Q104=\"\",\"\",Daten!Q104)","v":""},{"$f":"IF(A120=\"\",\"\",\"von \"&Stammdaten!$N$7)","v":""},103]
["",{"$f":"IF(Daten!P105=\"\",\"\",Daten!P105)","v":""},null,null,null,{"$f":"IF(Daten!Q105=\"\",\"\",Daten!Q105)","v":""},{"$f":"IF(A121=\"\",\"\",\"von \"&Stammdaten!$N$7)","v":""},104]
["",{"$f":"IF(Daten!P106=\"\",\"\",Daten!P106)","v":""},null,null,null,{"$f":"IF(Daten!Q106=\"\",\"\",Daten!Q106)","v":""},{"$f":"IF(A122=\"\",\"\",\"von \"&Stammdaten!$N$7)","v":""},105]
["",{"$f":"IF(Daten!P107=\"\",\"\",Daten!P107)","v":""},null,null,null,{"$f":"IF(Daten!Q107=\"\",\"\",Daten!Q107)","v":""},{"$f":"IF(A123=\"\",\"\",\"von \"&Stammdaten!$N$7)","v":""},106]
["",{"$f":"IF(Daten!P108=\"\",\"\",Daten!P108)","v":""},null,null,null,{"$f":"IF(Daten!Q108=\"\",\"\",Daten!Q108)","v":""},{"$f":"IF(A124=\"\",\"\",\"von \"&Stammdaten!$N$7)","v":""},107]
["",{"$f":"IF(Daten!P109=\"\",\"\",Daten!P109)","v":""},null,null,null,{"$f":"IF(Daten!Q109=\"\",\"\",Daten!Q109)","v":""},{"$f":"IF(A125=\"\",\"\",\"von \"&Stammdaten!$N$7)","v":""},108]
["",{"$f":"IF(Daten!P110=\"\",\"\",Daten!P110)","v":""},null,null,null,{"$f":"IF(Daten!Q110=\"\",\"\",Daten!Q110)","v":""},{"$f":"IF(A126=\"\",\"\",\"von \"&Stammdaten!$N$7)","v":""},109]
["",{"$f":"IF(Daten!P111=\"\",\"\",Daten!P111)","v":""},null,null,null,{"$f":"IF(Daten!Q111=\"\",\"\",Daten!Q111)","v":""},{"$f":"IF(A127=\"\",\"\",\"von \"&Stammdaten!$N$7)","v":""},110]
["",{"$f":"IF(Daten!P112=\"\",\"\",Daten!P112)","v":""},null,null,null,{"$f":"IF(Daten!Q112=\"\",\"\",Daten!Q112)","v":""},{"$f":"IF(A128=\"\",\"\",\"von \"&Stammdaten!$N$7)","v":""},111]
["",{"$f":"IF(Daten!P113=\"\",\"\",Daten!P113)","v":""},null,null,null,{"$f":"IF(Daten!Q113=\"\",\"\",Daten!Q113)","v":""},{"$f":"IF(A129=\"\",\"\",\"von \"&Stammdaten!$N$7)","v":""},112]
["",{"$f":"IF(Daten!P114=\"\",\"\",Daten!P114)","v":""},null,null,null,{"$f":"IF(Daten!Q114=\"\",\"\",Daten!Q114)","v":""},{"$f":"IF(A130=\"\",\"\",\"von \"&Stammdaten!$N$7)","v":""},113]
["",{"$f":"IF(Daten!P115=\"\",\"\",Daten!P115)","v":""},null,null,null,{"$f":"IF(Daten!Q115=\"\",\"\",Daten!Q115)","v":""},{"$f":"IF(A131=\"\",\"\",\"von \"&Stammdaten!$N$7)","v":""},114]
["",{"$f":"IF(Daten!P116=\"\",\"\",Daten!P116)","v":""},null,null,null,{"$f":"IF(Daten!Q116=\"\",\"\",Daten!Q116)","v":""},{"$f":"IF(A132=\"\",\"\",\"von \"&Stammdaten!$N$7)","v":""},115]
["",{"$f":"IF(Daten!P117=\"\",\"\",Daten!P117)","v":""},null,null,null,{"$f":"IF(Daten!Q117=\"\",\"\",Daten!Q117)","v":""},{"$f":"IF(A133=\"\",\"\",\"von \"&Stammdaten!$N$7)","v":""},116]
["",{"$f":"IF(Daten!P118=\"\",\"\",Daten!P118)","v":""},null,null,null,{"$f":"IF(Daten!Q118=\"\",\"\",Daten!Q118)","v":""},{"$f":"IF(A134=\"\",\"\",\"von \"&Stammdaten!$N$7)","v":""},117]
["",{"$f":"IF(Daten!P119=\"\",\"\",Daten!P119)","v":""},null,null,null,{"$f":"IF(Daten!Q119=\"\",\"\",Daten!Q119)","v":""},{"$f":"IF(A135=\"\",\"\",\"von \"&Stammdaten!$N$7)","v":""},118]
["",{"$f":"IF(Daten!P120=\"\",\"\",Daten!P120)","v":""},null,null,null,{"$f":"IF(Daten!Q120=\"\",\"\",Daten!Q120)","v":""},{"$f":"IF(A136=\"\",\"\",\"von \"&Stammdaten!$N$7)","v":""},119]
["",{"$f":"IF(Daten!P121=\"\",\"\",Daten!P121)","v":""},null,null,null,{"$f":"IF(Daten!Q121=\"\",\"\",Daten!Q121)","v":""},{"$f":"IF(A137=\"\",\"\",\"von \"&Stammdaten!$N$7)","v":""},120]
["",{"$f":"IF(Daten!P122=\"\",\"\",Daten!P122)","v":""},null,null,null,{"$f":"IF(Daten!Q122=\"\",\"\",Daten!Q122)","v":""},{"$f":"IF(A138=\"\",\"\",\"von \"&Stammdaten!$N$7)","v":""},121]
["",{"$f":"IF(Daten!P123=\"\",\"\",Daten!P123)","v":""},null,null,null,{"$f":"IF(Daten!Q123=\"\",\"\",Daten!Q123)","v":""},{"$f":"IF(A139=\"\",\"\",\"von \"&Stammdaten!$N$7)","v":""},122]
["",{"$f":"IF(Daten!P124=\"\",\"\",Daten!P124)","v":""},null,null,null,{"$f":"IF(Daten!Q124=\"\",\"\",Daten!Q124)","v":""},{"$f":"IF(A140=\"\",\"\",\"von \"&Stammdaten!$N$7)","v":""},123]
["",{"$f":"IF(Daten!P125=\"\",\"\",Daten!P125)","v":""},null,null,null,{"$f":"IF(Daten!Q125=\"\",\"\",Daten!Q125)","v":""},{"$f":"IF(A141=\"\",\"\",\"von \"&Stammdaten!$N$7)","v":""},124]
["",{"$f":"IF(Daten!P126=\"\",\"\",Daten!P126)","v":""},null,null,null,{"$f":"IF(Daten!Q126=\"\",\"\",Daten!Q126)","v":""},{"$f":"IF(A142=\"\",\"\",\"von \"&Stammdaten!$N$7)","v":""},125]
["",{"$f":"IF(Daten!P127=\"\",\"\",Daten!P127)","v":""},null,null,null,{"$f":"IF(Daten!Q127=\"\",\"\",Daten!Q127)","v":""},{"$f":"IF(A143=\"\",\"\",\"von \"&Stammdaten!$N$7)","v":""},126]
["",{"$f":"IF(Daten!P128=\"\",\"\",Daten!P128)","v":""},null,null,null,{"$f":"IF(Daten!Q128=\"\",\"\",Daten!Q128)","v":""},{"$f":"IF(A144=\"\",\"\",\"von \"&Stammdaten!$N$7)","v":""},127]
["",{"$f":"IF(Daten!P129=\"\",\"\",Daten!P129)","v":""},null,null,null,{"$f":"IF(Daten!Q129=\"\",\"\",Daten!Q129)","v":""},{"$f":"IF(A145=\"\",\"\",\"von \"&Stammdaten!$N$7)","v":""},128]
["",{"$f":"IF(Daten!P130=\"\",\"\",Daten!P130)","v":""},null,null,null,{"$f":"IF(Daten!Q130=\"\",\"\",Daten!Q130)","v":""},{"$f":"IF(A146=\"\",\"\",\"von \"&Stammdaten!$N$7)","v":""},129]
["",{"$f":"IF(Daten!P131=\"\",\"\",Daten!P131)","v":""},null,null,null,{"$f":"IF(Daten!Q131=\"\",\"\",Daten!Q131)","v":""},{"$f":"IF(A147=\"\",\"\",\"von \"&Stammdaten!$N$7)","v":""},130]
["",{"$f":"IF(Daten!P132=\"\",\"\",Daten!P132)","v":""},null,null,null,{"$f":"IF(Daten!Q132=\"\",\"\",Daten!Q132)","v":""},{"$f":"IF(A148=\"\",\"\",\"von \"&Stammdaten!$N$7)","v":""},131]
[{"$f":"IF(F149=\"\",\"\",A148+1)","v":""},{"$f":"IF(Daten!P133=\"\",\"\",Daten!P133)","v":""},null,null,null,{"$f":"IF(Daten!Q133=\"\",\"\",Daten!Q133)","v":""},{"$f":"IF(A149=\"\",\"\",\"von \"&Stammdaten!$N$7)","v":""},132]
["",{"$f":"IF(Daten!P134=\"\",\"\",Daten!P134)","v":""},null,null,null,{"$f":"IF(Daten!Q134=\"\",\"\",Daten!Q134)","v":""},{"$f":"IF(A150=\"\",\"\",\"von \"&Stammdaten!$N$7)","v":""},133]
["",{"$f":"IF(Daten!P135=\"\",\"\",Daten!P135)","v":""},null,null,null,{"$f":"IF(Daten!Q135=\"\",\"\",Daten!Q135)","v":""},{"$f":"IF(A151=\"\",\"\",\"von \"&Stammdaten!$N$7)","v":""},134]
["",{"$f":"IF(Daten!P136=\"\",\"\",Daten!P136)","v":""},null,null,null,{"$f":"IF(Daten!Q136=\"\",\"\",Daten!Q136)","v":""},{"$f":"IF(A152=\"\",\"\",\"von \"&Stammdaten!$N$7)","v":""},135]
["",{"$f":"IF(Daten!P137=\"\",\"\",Daten!P137)","v":""},null,null,null,{"$f":"IF(Daten!Q137=\"\",\"\",Daten!Q137)","v":""},{"$f":"IF(A153=\"\",\"\",\"von \"&Stammdaten!$N$7)","v":""},136]
["",{"$f":"IF(Daten!P138=\"\",\"\",Daten!P138)","v":""},null,null,null,{"$f":"IF(Daten!Q138=\"\",\"\",Daten!Q138)","v":""},{"$f":"IF(A154=\"\",\"\",\"von \"&Stammdaten!$N$7)","v":""},137]
["",{"$f":"IF(Daten!P139=\"\",\"\",Daten!P139)","v":""},null,null,null,{"$f":"IF(Daten!Q139=\"\",\"\",Daten!Q139)","v":""},{"$f":"IF(A155=\"\",\"\",\"von \"&Stammdaten!$N$7)","v":""},138]
["",{"$f":"IF(Daten!P140=\"\",\"\",Daten!P140)","v":""},null,null,null,{"$f":"IF(Daten!Q140=\"\",\"\",Daten!Q140)","v":""},{"$f":"IF(A156=\"\",\"\",\"von \"&Stammdaten!$N$7)","v":""},139]
["",{"$f":"IF(Daten!P141=\"\",\"\",Daten!P141)","v":""},null,null,null,{"$f":"IF(Daten!Q141=\"\",\"\",Daten!Q141)","v":""},{"$f":"IF(A157=\"\",\"\",\"von \"&Stammdaten!$N$7)","v":""},140]
["",{"$f":"IF(Daten!P142=\"\",\"\",Daten!P142)","v":""},null,null,null,{"$f":"IF(Daten!Q142=\"\",\"\",Daten!Q142)","v":""},{"$f":"IF(A158=\"\",\"\",\"von \"&Stammdaten!$N$7)","v":""},141]
["",{"$f":"IF(Daten!P143=\"\",\"\",Daten!P143)","v":""},null,null,null,{"$f":"IF(Daten!Q143=\"\",\"\",Daten!Q143)","v":""},{"$f":"IF(A159=\"\",\"\",\"von \"&Stammdaten!$N$7)","v":""},142]
["",{"$f":"IF(Daten!P144=\"\",\"\",Daten!P144)","v":""},null,null,null,{"$f":"IF(Daten!Q144=\"\",\"\",Daten!Q144)","v":""},{"$f":"IF(A160=\"\",\"\",\"von \"&Stammdaten!$N$7)","v":""},143]
["",{"$f":"IF(Daten!P145=\"\",\"\",Daten!P145)","v":""},null,null,null,{"$f":"IF(Daten!Q145=\"\",\"\",Daten!Q145)","v":""},{"$f":"IF(A161=\"\",\"\",\"von \"&Stammdaten!$N$7)","v":""},144]
["",{"$f":"IF(Daten!P146=\"\",\"\",Daten!P146)","v":""},null,null,null,{"$f":"IF(Daten!Q146=\"\",\"\",Daten!Q146)","v":""},{"$f":"IF(A162=\"\",\"\",\"von \"&Stammdaten!$N$7)","v":""},145]
["",{"$f":"IF(Daten!P147=\"\",\"\",Daten!P147)","v":""},null,null,null,{"$f":"IF(Daten!Q147=\"\",\"\",Daten!Q147)","v":""},{"$f":"IF(A163=\"\",\"\",\"von \"&Stammdaten!$N$7)","v":""},146]
["",{"$f":"IF(Daten!P148=\"\",\"\",Daten!P148)","v":""},null,null,null,{"$f":"IF(Daten!Q148=\"\",\"\",Daten!Q148)","v":""},{"$f":"IF(A164=\"\",\"\",\"von \"&Stammdaten!$N$7)","v":""},147]
["",{"$f":"IF(Daten!P149=\"\",\"\",Daten!P149)","v":""},null,null,null,{"$f":"IF(Daten!Q149=\"\",\"\",Daten!Q149)","v":""},{"$f":"IF(A165=\"\",\"\",\"von \"&Stammdaten!$N$7)","v":""},148]
["",{"$f":"IF(Daten!P150=\"\",\"\",Daten!P150)","v":""},null,null,null,{"$f":"IF(Daten!Q150=\"\",\"\",Daten!Q150)","v":""},{"$f":"IF(A166=\"\",\"\",\"von \"&Stammdaten!$N$7)","v":""},149]
[{"$f":"IF(F167=\"\",\"\",A166+1)","v":""},{"$f":"IF(Daten!P151=\"\",\"\",Daten!P151)","v":""},null,null,null,{"$f":"IF(Daten!Q151=\"\",\"\",Daten!Q151)","v":""},{"$f":"IF(A167=\"\",\"\",\"von \"&Stammdaten!$N$7)","v":""},150]

{"sheet":"K4 Urkunde-Platz 1","index":20,"n_rows":39,"n_cols":12,"rows_kept":39,"cut":false,"hidden":false,"merged":[[13,2,16,15],[25,2,25,14],[26,2,26,15],[27,2,27,15],[28,2,28,15],[29,2,29,15],[38,11,40,16],[31,8,31,16],[30,2,30,15],[32,2,32,15],[33,2,33,15],[34,2,34,15],[37,9,37,16]]}
[]
[]
[]
[]
[]
[]
[]
[]
[]
[]
[]
[]
[]
[null,null,{"$f":"IF(Stammdaten!$C$8=\"\",\"\",Stammdaten!$C$8)","v":"Dat Groote Püüster Scheeten"}]
[]
[]
[]
[]
[]
[]
[]
[]
[]
[]
[]
[]
[]
[]
[]
[null,null,{"$f":"Stammdaten!$J$10","v":"Hiermit verleiht der SV-Soderstorf"}]
[null,null,{"$f":"IF(Daten!$P$2=\"\",\"\",Daten!$P$2)","v":""}]
[null,null,"den 1. Platz in der",null,null,null,null,null,{"$f":"Stammdaten!$J$7","v":0}]
[null,null,"mit einer Trefferleistung von"]
[null,null,{"$f":"IF(Daten!$Q$2=\"\",\"\",Daten!$Q$2)","v":""}]
[null,null,"diese Urkunde"]
[]
[]
[null,null,null,null,null,null,null,null,null,{"$f":"IF(Stammdaten!$C$4=\"\",\"\",CONCATENATE(Stammdaten!$C$5,\", den\",\" \",TEXT(Stammdaten!$C$4,\"TT.MM.JJJJ\")))","v":""}]
[null,null,null,null,null,null,null,null,null,null,null,{"$f":"CONCATENATE(Stammdaten!$C$7)","v":"Rolf Marquardt"}]

{"sheet":"K4 Urkunde-Platz 2","index":21,"n_rows":39,"n_cols":12,"rows_kept":39,"cut":false,"hidden":false,"merged":[[13,2,16,15],[25,2,25,14],[26,2,26,15],[27,2,27,15],[28,2,28,15],[29,2,29,15],[38,11,40,16],[31,8,31,16],[30,2,30,15],[32,2,32,15],[33,2,33,15],[34,2,34,15],[37,9,37,16]]}
[]
[]
[]
[]
[]
[]
[]
[]
[]
[]
[]
[]
[]
[null,null,{"$f":"IF(Stammdaten!$C$8=\"\",\"\",Stammdaten!$C$8)","v":"Dat Groote Püüster Scheeten"}]
[]
[]
[]
[]
[]
[]
[]
[]
[]
[]
[]
[]
[]
[]
[]
[null,null,{"$f":"Stammdaten!$J$10","v":"Hiermit verleiht der SV-Soderstorf"}]
[null,null,{"$f":"IF(Daten!$P$3=\"\",\"\",Daten!$P$3)","v":""}]
[null,null,"den 2. Platz in der",null,null,null,null,null,{"$f":"Stammdaten!$J$7","v":0}]
[null,null,"mit einer Trefferleistung von"]
[null,null,{"$f":"IF(Daten!$Q$3=\"\",\"\",Daten!$Q$3)","v":""}]
[null,null,"diese Urkunde"]
[]
[]
[null,null,null,null,null,null,null,null,null,{"$f":"IF(Stammdaten!$C$4=\"\",\"\",CONCATENATE(Stammdaten!$C$5,\", den\",\" \",TEXT(Stammdaten!$C$4,\"TT.MM.JJJJ\")))","v":""}]
[null,null,null,null,null,null,null,null,null,null,null,{"$f":"CONCATENATE(Stammdaten!$C$7)","v":"Rolf Marquardt"}]

{"sheet":"K4 Urkunde-Platz 3","index":22,"n_rows":39,"n_cols":12,"rows_kept":39,"cut":false,"hidden":false,"merged":[[13,2,16,15],[25,2,25,14],[26,2,26,15],[27,2,27,15],[28,2,28,15],[29,2,29,15],[38,11,40,16],[31,8,31,16],[30,2,30,15],[32,2,32,15],[33,2,33,15],[34,2,34,15],[37,9,37,16]]}
[]
[]
[]
[]
[]
[]
[]
[]
[]
[]
[]
[]
[]
[null,null,{"$f":"IF(Stammdaten!$C$8=\"\",\"\",Stammdaten!$C$8)","v":"Dat Groote Püüster Scheeten"}]
[]
[]
[]
[]
[]
[]
[]
[]
[]
[]
[]
[]
[]
[]
[]
[null,null,{"$f":"Stammdaten!$J$10","v":"Hiermit verleiht der SV-Soderstorf"}]
[null,null,{"$f":"IF(Daten!$P$4=\"\",\"\",Daten!$P$4)","v":""}]
[null,null,"den 3. Platz in der",null,null,null,null,null,{"$f":"Stammdaten!$J$7","v":0}]
[null,null,"mit einer Trefferleistung von"]
[null,null,{"$f":"IF(Daten!$Q$4=\"\",\"\",Daten!$Q$4)","v":""}]
[null,null,"diese Urkunde"]
[]
[]
[null,null,null,null,null,null,null,null,null,{"$f":"IF(Stammdaten!$C$4=\"\",\"\",CONCATENATE(Stammdaten!$C$5,\", den\",\" \",TEXT(Stammdaten!$C$4,\"TT.MM.JJJJ\")))","v":""}]
[null,null,null,null,null,null,null,null,null,null,null,{"$f":"CONCATENATE(Stammdaten!$C$7)","v":"Rolf Marquardt"}]

{"sheet":"Ergebnis Klasse 5","index":23,"n_rows":167,"n_cols":8,"rows_kept":167,"cut":false,"hidden":false,"merged":[[164,1,164,4],[165,1,165,4],[166,1,166,4],[158,1,158,4],[159,1,159,4],[160,1,160,4],[161,1,161,4],[162,1,162,4],[163,1,163,4],[152,1,152,4],[153,1,153,4],[154,1,154,4],[155,1,155,4],[156,1,156,4],[157,1,157,4],[146,1,146,4],[147,1,147,4],[148,1,148,4],[149,1,149,4],[150,1,150,4],[151,1,151,4],[140,1,140,4],[141,1,141,4],[142,1,142,4],[143,1,143,4],[144,1,144,4],[145,1,145,4],[134,1,134,4],[135,1,135,4],[136,1,136,4],[137,1,137,4],[138,1,138,4],[139,1,139,4],[128,1,128,4],[129,1,129,4],[130,1,130,4],[131,1,131,4],[132,1,132,4],[133,1,133,4],[122,1,122,4],[123,1,123,4],[124,1,124,4],[125,1,125,4],[126,1,126,4],[127,1,127,4],[116,1,116,4],[117,1,117,4],[118,1,118,4],[119,1,119,4],[120,1,120,4],[121,1,121,4],[110,1,110,4],[111,1,111,4],[112,1,112,4],[113,1,113,4],[114,1,114,4],[115,1,115,4],[104,1,104,4],[105,1,105,4],[106,1,106,4],[107,1,107,4],[108,1,108,4],[109,1,109,4],[98,1,98,4],[99,1,99,4],[100,1,100,4],[101,1,101,4],[102,1,102,4],[103,1,103,4],[92,1,92,4],[93,1,93,4],[94,1,94,4],[95,1,95,4],[96,1,96,4],[97,1,97,4],[86,1,86,4],[87,1,87,4],[88,1,88,4],[89,1,89,4],[90,1,90,4],[91,1,91,4],[80,1,80,4],[81,1,81,4],[82,1,82,4],[83,1,83,4],[84,1,84,4],[85,1,85,4],[74,1,74,4],[75,1,75,4],[76,1,76,4],[77,1,77,4],[78,1,78,4],[79,1,79,4],[68,1,68,4],[69,1,69,4],[70,1,70,4],[71,1,71,4],[72,1,72,4],[73,1,73,4],[62,1,62,4],[63,1,63,4],[64,1,64,4],[65,1,65,4],[66,1,66,4],[67,1,67,4],[56,1,56,4],[57,1,57,4],[58,1,58,4],[59,1,59,4],[60,1,60,4],[61,1,61,4],[50,1,50,4],[51,1,51,4],[52,1,52,4],[53,1,53,4],[54,1,54,4],[55,1,55,4],[44,1,44,4],[45,1,45,4],[46,1,46,4],[47,1,47,4],[48,1,48,4],[49,1,49,4],[38,1,38,4],[39,1,39,4],[40,1,40,4],[41,1,41,4],[42,1,42,4],[43,1,43,4],[32,1,32,4],[33,1,33,4],[34,1,34,4],[35,1,35,4],[36,1,36,4],[37,1,37,4],[26,1,26,4],[27,1,27,4],[28,1,28,4],[29,1,29,4],[30,1,30,4],[31,1,31,4],[20,1,20,4],[21,1,21,4],[22,1,22,4],[23,1,23,4],[24,1,24,4],[25,1,25,4],[14,0,14,6],[15,0,15,6],[16,1,16,4],[17,1,17,4],[18,1,18,4],[19,1,19,4]]}
[]
[]
[]
[]
[]
[]
[]
[]
[]
[]
[]
[]
[]
[]
[{"$f":"IF(Stammdaten!$C$4=\"\",\"\",CONCATENATE(TEXT(Stammdaten!$C$4,\"TT.MM.JJJJ\"),\" \",\"in \",Stammdaten!$C$5,\" \"\"\",Stammdaten!C8,\"\"\"\"))","v":""}]
[{"$f":"IF(Stammdaten!J8=\"\",\"\",Stammdaten!J8)","v":""}]
["Platz:","Name:",null,null,null,"Treffer:"]
[{"$f":"IF(Daten!T2=\"\",\"\",1)","v":""},{"$f":"IF(Daten!S2=\"\",\"\",Daten!S2)","v":""},null,null,null,{"$f":"IF(Daten!T2=\"\",\"\",Daten!T2)","v":""},{"$f":"IF(A18=\"\",\"\",\"von \"&Stammdaten!$N$8)","v":""},1]
[{"$f":"IF(F19=\"\",\"\",A18+1)","v":""},{"$f":"IF(Daten!S3=\"\",\"\",Daten!S3)","v":""},null,null,null,{"$f":"IF(Daten!T3=\"\",\"\",Daten!T3)","v":""},{"$f":"IF(A19=\"\",\"\",\"von \"&Stammdaten!$N$8)","v":""},2]
[{"$f":"IF(F20=\"\",\"\",A19+1)","v":""},{"$f":"IF(Daten!S4=\"\",\"\",Daten!S4)","v":""},null,null,null,{"$f":"IF(Daten!T4=\"\",\"\",Daten!T4)","v":""},{"$f":"IF(A20=\"\",\"\",\"von \"&Stammdaten!$N$8)","v":""},3]
[{"$f":"IF(F21=\"\",\"\",A20+1)","v":""},{"$f":"IF(Daten!S5=\"\",\"\",Daten!S5)","v":""},null,null,null,{"$f":"IF(Daten!T5=\"\",\"\",Daten!T5)","v":""},{"$f":"IF(A21=\"\",\"\",\"von \"&Stammdaten!$N$8)","v":""},4]
["",{"$f":"IF(Daten!S6=\"\",\"\",Daten!S6)","v":""},null,null,null,{"$f":"IF(Daten!T6=\"\",\"\",Daten!T6)","v":""},{"$f":"IF(A22=\"\",\"\",\"von \"&Stammdaten!$N$8)","v":""},5]
["",{"$f":"IF(Daten!S7=\"\",\"\",Daten!S7)","v":""},null,null,null,{"$f":"IF(Daten!T7=\"\",\"\",Daten!T7)","v":""},{"$f":"IF(A23=\"\",\"\",\"von \"&Stammdaten!$N$8)","v":""},6]
["",{"$f":"IF(Daten!S8=\"\",\"\",Daten!S8)","v":""},null,null,null,{"$f":"IF(Daten!T8=\"\",\"\",Daten!T8)","v":""},{"$f":"IF(A24=\"\",\"\",\"von \"&Stammdaten!$N$8)","v":""},7]
["",{"$f":"IF(Daten!S9=\"\",\"\",Daten!S9)","v":""},null,null,null,{"$f":"IF(Daten!T9=\"\",\"\",Daten!T9)","v":""},{"$f":"IF(A25=\"\",\"\",\"von \"&Stammdaten!$N$8)","v":""},8]
["",{"$f":"IF(Daten!S10=\"\",\"\",Daten!S10)","v":""},null,null,null,{"$f":"IF(Daten!T10=\"\",\"\",Daten!T10)","v":""},{"$f":"IF(A26=\"\",\"\",\"von \"&Stammdaten!$N$8)","v":""},9]
["",{"$f":"IF(Daten!S11=\"\",\"\",Daten!S11)","v":""},null,null,null,{"$f":"IF(Daten!T11=\"\",\"\",Daten!T11)","v":""},{"$f":"IF(A27=\"\",\"\",\"von \"&Stammdaten!$N$8)","v":""},10]
["",{"$f":"IF(Daten!S12=\"\",\"\",Daten!S12)","v":""},null,null,null,{"$f":"IF(Daten!T12=\"\",\"\",Daten!T12)","v":""},{"$f":"IF(A28=\"\",\"\",\"von \"&Stammdaten!$N$8)","v":""},11]
["",{"$f":"IF(Daten!S13=\"\",\"\",Daten!S13)","v":""},null,null,null,{"$f":"IF(Daten!T13=\"\",\"\",Daten!T13)","v":""},{"$f":"IF(A29=\"\",\"\",\"von \"&Stammdaten!$N$8)","v":""},12]
["",{"$f":"IF(Daten!S14=\"\",\"\",Daten!S14)","v":""},null,null,null,{"$f":"IF(Daten!T14=\"\",\"\",Daten!T14)","v":""},{"$f":"IF(A30=\"\",\"\",\"von \"&Stammdaten!$N$8)","v":""},13]
["",{"$f":"IF(Daten!S15=\"\",\"\",Daten!S15)","v":""},null,null,null,{"$f":"IF(Daten!T15=\"\",\"\",Daten!T15)","v":""},{"$f":"IF(A31=\"\",\"\",\"von \"&Stammdaten!$N$8)","v":""},14]
["",{"$f":"IF(Daten!S16=\"\",\"\",Daten!S16)","v":""},null,null,null,{"$f":"IF(Daten!T16=\"\",\"\",Daten!T16)","v":""},{"$f":"IF(A32=\"\",\"\",\"von \"&Stammdaten!$N$8)","v":""},15]
["",{"$f":"IF(Daten!S17=\"\",\"\",Daten!S17)","v":""},null,null,null,{"$f":"IF(Daten!T17=\"\",\"\",Daten!T17)","v":""},{"$f":"IF(A33=\"\",\"\",\"von \"&Stammdaten!$N$8)","v":""},16]
["",{"$f":"IF(Daten!S18=\"\",\"\",Daten!S18)","v":""},null,null,null,{"$f":"IF(Daten!T18=\"\",\"\",Daten!T18)","v":""},{"$f":"IF(A34=\"\",\"\",\"von \"&Stammdaten!$N$8)","v":""},17]
["",{"$f":"IF(Daten!S19=\"\",\"\",Daten!S19)","v":""},null,null,null,{"$f":"IF(Daten!T19=\"\",\"\",Daten!T19)","v":""},{"$f":"IF(A35=\"\",\"\",\"von \"&Stammdaten!$N$8)","v":""},18]
["",{"$f":"IF(Daten!S20=\"\",\"\",Daten!S20)","v":""},null,null,null,{"$f":"IF(Daten!T20=\"\",\"\",Daten!T20)","v":""},{"$f":"IF(A36=\"\",\"\",\"von \"&Stammdaten!$N$8)","v":""},19]
["",{"$f":"IF(Daten!S21=\"\",\"\",Daten!S21)","v":""},null,null,null,{"$f":"IF(Daten!T21=\"\",\"\",Daten!T21)","v":""},{"$f":"IF(A37=\"\",\"\",\"von \"&Stammdaten!$N$8)","v":""},20]
["",{"$f":"IF(Daten!S22=\"\",\"\",Daten!S22)","v":""},null,null,null,{"$f":"IF(Daten!T22=\"\",\"\",Daten!T22)","v":""},{"$f":"IF(A38=\"\",\"\",\"von \"&Stammdaten!$N$8)","v":""},21]
["",{"$f":"IF(Daten!S23=\"\",\"\",Daten!S23)","v":""},null,null,null,{"$f":"IF(Daten!T23=\"\",\"\",Daten!T23)","v":""},{"$f":"IF(A39=\"\",\"\",\"von \"&Stammdaten!$N$8)","v":""},22]
["",{"$f":"IF(Daten!S24=\"\",\"\",Daten!S24)","v":""},null,null,null,{"$f":"IF(Daten!T24=\"\",\"\",Daten!T24)","v":""},{"$f":"IF(A40=\"\",\"\",\"von \"&Stammdaten!$N$8)","v":""},23]
["",{"$f":"IF(Daten!S25=\"\",\"\",Daten!S25)","v":""},null,null,null,{"$f":"IF(Daten!T25=\"\",\"\",Daten!T25)","v":""},{"$f":"IF(A41=\"\",\"\",\"von \"&Stammdaten!$N$8)","v":""},24]
["",{"$f":"IF(Daten!S26=\"\",\"\",Daten!S26)","v":""},null,null,null,{"$f":"IF(Daten!T26=\"\",\"\",Daten!T26)","v":""},{"$f":"IF(A42=\"\",\"\",\"von \"&Stammdaten!$N$8)","v":""},25]
["",{"$f":"IF(Daten!S27=\"\",\"\",Daten!S27)","v":""},null,null,null,{"$f":"IF(Daten!T27=\"\",\"\",Daten!T27)","v":""},{"$f":"IF(A43=\"\",\"\",\"von \"&Stammdaten!$N$8)","v":""},26]
["",{"$f":"IF(Daten!S28=\"\",\"\",Daten!S28)","v":""},null,null,null,{"$f":"IF(Daten!T28=\"\",\"\",Daten!T28)","v":""},{"$f":"IF(A44=\"\",\"\",\"von \"&Stammdaten!$N$8)","v":""},27]
["",{"$f":"IF(Daten!S29=\"\",\"\",Daten!S29)","v":""},null,null,null,{"$f":"IF(Daten!T29=\"\",\"\",Daten!T29)","v":""},{"$f":"IF(A45=\"\",\"\",\"von \"&Stammdaten!$N$8)","v":""},28]
["",{"$f":"IF(Daten!S30=\"\",\"\",Daten!S30)","v":""},null,null,null,{"$f":"IF(Daten!T30=\"\",\"\",Daten!T30)","v":""},{"$f":"IF(A46=\"\",\"\",\"von \"&Stammdaten!$N$8)","v":""},29]
["",{"$f":"IF(Daten!S31=\"\",\"\",Daten!S31)","v":""},null,null,null,{"$f":"IF(Daten!T31=\"\",\"\",Daten!T31)","v":""},{"$f":"IF(A47=\"\",\"\",\"von \"&Stammdaten!$N$8)","v":""},30]
["",{"$f":"IF(Daten!S32=\"\",\"\",Daten!S32)","v":""},null,null,null,{"$f":"IF(Daten!T32=\"\",\"\",Daten!T32)","v":""},{"$f":"IF(A48=\"\",\"\",\"von \"&Stammdaten!$N$8)","v":""},31]
["",{"$f":"IF(Daten!S33=\"\",\"\",Daten!S33)","v":""},null,null,null,{"$f":"IF(Daten!T33=\"\",\"\",Daten!T33)","v":""},{"$f":"IF(A49=\"\",\"\",\"von \"&Stammdaten!$N$8)","v":""},32]
["",{"$f":"IF(Daten!S34=\"\",\"\",Daten!S34)","v":""},null,null,null,{"$f":"IF(Daten!T34=\"\",\"\",Daten!T34)","v":""},{"$f":"IF(A50=\"\",\"\",\"von \"&Stammdaten!$N$8)","v":""},33]
["",{"$f":"IF(Daten!S35=\"\",\"\",Daten!S35)","v":""},null,null,null,{"$f":"IF(Daten!T35=\"\",\"\",Daten!T35)","v":""},{"$f":"IF(A51=\"\",\"\",\"von \"&Stammdaten!$N$8)","v":""},34]
["",{"$f":"IF(Daten!S36=\"\",\"\",Daten!S36)","v":""},null,null,null,{"$f":"IF(Daten!T36=\"\",\"\",Daten!T36)","v":""},{"$f":"IF(A52=\"\",\"\",\"von \"&Stammdaten!$N$8)","v":""},35]
["",{"$f":"IF(Daten!S37=\"\",\"\",Daten!S37)","v":""},null,null,null,{"$f":"IF(Daten!T37=\"\",\"\",Daten!T37)","v":""},{"$f":"IF(A53=\"\",\"\",\"von \"&Stammdaten!$N$8)","v":""},36]
["",{"$f":"IF(Daten!S38=\"\",\"\",Daten!S38)","v":""},null,null,null,{"$f":"IF(Daten!T38=\"\",\"\",Daten!T38)","v":""},{"$f":"IF(A54=\"\",\"\",\"von \"&Stammdaten!$N$8)","v":""},37]
["",{"$f":"IF(Daten!S39=\"\",\"\",Daten!S39)","v":""},null,null,null,{"$f":"IF(Daten!T39=\"\",\"\",Daten!T39)","v":""},{"$f":"IF(A55=\"\",\"\",\"von \"&Stammdaten!$N$8)","v":""},38]
["",{"$f":"IF(Daten!S40=\"\",\"\",Daten!S40)","v":""},null,null,null,{"$f":"IF(Daten!T40=\"\",\"\",Daten!T40)","v":""},{"$f":"IF(A56=\"\",\"\",\"von \"&Stammdaten!$N$8)","v":""},39]
["",{"$f":"IF(Daten!S41=\"\",\"\",Daten!S41)","v":""},null,null,null,{"$f":"IF(Daten!T41=\"\",\"\",Daten!T41)","v":""},{"$f":"IF(A57=\"\",\"\",\"von \"&Stammdaten!$N$8)","v":""},40]
["",{"$f":"IF(Daten!S42=\"\",\"\",Daten!S42)","v":""},null,null,null,{"$f":"IF(Daten!T42=\"\",\"\",Daten!T42)","v":""},{"$f":"IF(A58=\"\",\"\",\"von \"&Stammdaten!$N$8)","v":""},41]
[{"$f":"IF(F59=\"\",\"\",A58+1)","v":""},{"$f":"IF(Daten!S43=\"\",\"\",Daten!S43)","v":""},null,null,null,{"$f":"IF(Daten!T43=\"\",\"\",Daten!T43)","v":""},{"$f":"IF(A59=\"\",\"\",\"von \"&Stammdaten!$N$8)","v":""},42]
["",{"$f":"IF(Daten!S44=\"\",\"\",Daten!S44)","v":""},null,null,null,{"$f":"IF(Daten!T44=\"\",\"\",Daten!T44)","v":""},{"$f":"IF(A60=\"\",\"\",\"von \"&Stammdaten!$N$8)","v":""},43]
["",{"$f":"IF(Daten!S45=\"\",\"\",Daten!S45)","v":""},null,null,null,{"$f":"IF(Daten!T45=\"\",\"\",Daten!T45)","v":""},{"$f":"IF(A61=\"\",\"\",\"von \"&Stammdaten!$N$8)","v":""},44]
["",{"$f":"IF(Daten!S46=\"\",\"\",Daten!S46)","v":""},null,null,null,{"$f":"IF(Daten!T46=\"\",\"\",Daten!T46)","v":""},{"$f":"IF(A62=\"\",\"\",\"von \"&Stammdaten!$N$8)","v":""},45]
["",{"$f":"IF(Daten!S47=\"\",\"\",Daten!S47)","v":""},null,null,null,{"$f":"IF(Daten!T47=\"\",\"\",Daten!T47)","v":""},{"$f":"IF(A63=\"\",\"\",\"von \"&Stammdaten!$N$8)","v":""},46]
["",{"$f":"IF(Daten!S48=\"\",\"\",Daten!S48)","v":""},null,null,null,{"$f":"IF(Daten!T48=\"\",\"\",Daten!T48)","v":""},{"$f":"IF(A64=\"\",\"\",\"von \"&Stammdaten!$N$8)","v":""},47]
["",{"$f":"IF(Daten!S49=\"\",\"\",Daten!S49)","v":""},null,null,null,{"$f":"IF(Daten!T49=\"\",\"\",Daten!T49)","v":""},{"$f":"IF(A65=\"\",\"\",\"von \"&Stammdaten!$N$8)","v":""},48]
["",{"$f":"IF(Daten!S50=\"\",\"\",Daten!S50)","v":""},null,null,null,{"$f":"IF(Daten!T50=\"\",\"\",Daten!T50)","v":""},{"$f":"IF(A66=\"\",\"\",\"von \"&Stammdaten!$N$8)","v":""},49]
["",{"$f":"IF(Daten!S51=\"\",\"\",Daten!S51)","v":""},null,null,null,{"$f":"IF(Daten!T51=\"\",\"\",Daten!T51)","v":""},{"$f":"IF(A67=\"\",\"\",\"von \"&Stammdaten!$N$8)","v":""},50]
["",{"$f":"IF(Daten!S52=\"\",\"\",Daten!S52)","v":""},null,null,null,{"$f":"IF(Daten!T52=\"\",\"\",Daten!T52)","v":""},{"$f":"IF(A68=\"\",\"\",\"von \"&Stammdaten!$N$8)","v":""},51]
["",{"$f":"IF(Daten!S53=\"\",\"\",Daten!S53)","v":""},null,null,null,{"$f":"IF(Daten!T53=\"\",\"\",Daten!T53)","v":""},{"$f":"IF(A69=\"\",\"\",\"von \"&Stammdaten!$N$8)","v":""},52]
["",{"$f":"IF(Daten!S54=\"\",\"\",Daten!S54)","v":""},null,null,null,{"$f":"IF(Daten!T54=\"\",\"\",Daten!T54)","v":""},{"$f":"IF(A70=\"\",\"\",\"von \"&Stammdaten!$N$8)","v":""},53]
["",{"$f":"IF(Daten!S55=\"\",\"\",Daten!S55)","v":""},null,null,null,{"$f":"IF(Daten!T55=\"\",\"\",Daten!T55)","v":""},{"$f":"IF(A71=\"\",\"\",\"von \"&Stammdaten!$N$8)","v":""},54]
["",{"$f":"IF(Daten!S56=\"\",\"\",Daten!S56)","v":""},null,null,null,{"$f":"IF(Daten!T56=\"\",\"\",Daten!T56)","v":""},{"$f":"IF(A72=\"\",\"\",\"von \"&Stammdaten!$N$8)","v":""},55]
["",{"$f":"IF(Daten!S57=\"\",\"\",Daten!S57)","v":""},null,null,null,{"$f":"IF(Daten!T57=\"\",\"\",Daten!T57)","v":""},{"$f":"IF(A73=\"\",\"\",\"von \"&Stammdaten!$N$8)","v":""},56]
["",{"$f":"IF(Daten!S58=\"\",\"\",Daten!S58)","v":""},null,null,null,{"$f":"IF(Daten!T58=\"\",\"\",Daten!T58)","v":""},{"$f":"IF(A74=\"\",\"\",\"von \"&Stammdaten!$N$8)","v":""},57]
["",{"$f":"IF(Daten!S59=\"\",\"\",Daten!S59)","v":""},null,null,null,{"$f":"IF(Daten!T59=\"\",\"\",Daten!T59)","v":""},{"$f":"IF(A75=\"\",\"\",\"von \"&Stammdaten!$N$8)","v":""},58]
["",{"$f":"IF(Daten!S60=\"\",\"\",Daten!S60)","v":""},null,null,null,{"$f":"IF(Daten!T60=\"\",\"\",Daten!T60)","v":""},{"$f":"IF(A76=\"\",\"\",\"von \"&Stammdaten!$N$8)","v":""},59]
["",{"$f":"IF(Daten!S61=\"\",\"\",Daten!S61)","v":""},null,null,null,{"$f":"IF(Daten!T61=\"\",\"\",Daten!T61)","v":""},{"$f":"IF(A77=\"\",\"\",\"von \"&Stammdaten!$N$8)","v":""},60]
["",{"$f":"IF(Daten!S62=\"\",\"\",Daten!S62)","v":""},null,null,null,{"$f":"IF(Daten!T62=\"\",\"\",Daten!T62)","v":""},{"$f":"IF(A78=\"\",\"\",\"von \"&Stammdaten!$N$8)","v":""},61]
["",{"$f":"IF(Daten!S63=\"\",\"\",Daten!S63)","v":""},null,null,null,{"$f":"IF(Daten!T63=\"\",\"\",Daten!T63)","v":""},{"$f":"IF(A79=\"\",\"\",\"von \"&Stammdaten!$N$8)","v":""},62]
["",{"$f":"IF(Daten!S64=\"\",\"\",Daten!S64)","v":""},null,null,null,{"$f":"IF(Daten!T64=\"\",\"\",Daten!T64)","v":""},{"$f":"IF(A80=\"\",\"\",\"von \"&Stammdaten!$N$8)","v":""},63]
["",{"$f":"IF(Daten!S65=\"\",\"\",Daten!S65)","v":""},null,null,null,{"$f":"IF(Daten!T65=\"\",\"\",Daten!T65)","v":""},{"$f":"IF(A81=\"\",\"\",\"von \"&Stammdaten!$N$8)","v":""},64]
["",{"$f":"IF(Daten!S66=\"\",\"\",Daten!S66)","v":""},null,null,null,{"$f":"IF(Daten!T66=\"\",\"\",Daten!T66)","v":""},{"$f":"IF(A82=\"\",\"\",\"von \"&Stammdaten!$N$8)","v":""},65]
["",{"$f":"IF(Daten!S67=\"\",\"\",Daten!S67)","v":""},null,null,null,{"$f":"IF(Daten!T67=\"\",\"\",Daten!T67)","v":""},{"$f":"IF(A83=\"\",\"\",\"von \"&Stammdaten!$N$8)","v":""},66]
["",{"$f":"IF(Daten!S68=\"\",\"\",Daten!S68)","v":""},null,null,null,{"$f":"IF(Daten!T68=\"\",\"\",Daten!T68)","v":""},{"$f":"IF(A84=\"\",\"\",\"von \"&Stammdaten!$N$8)","v":""},67]
[{"$f":"IF(F85=\"\",\"\",A84+1)","v":""},{"$f":"IF(Daten!S69=\"\",\"\",Daten!S69)","v":""},null,null,null,{"$f":"IF(Daten!T69=\"\",\"\",Daten!T69)","v":""},{"$f":"IF(A85=\"\",\"\",\"von \"&Stammdaten!$N$8)","v":""},68]
["",{"$f":"IF(Daten!S70=\"\",\"\",Daten!S70)","v":""},null,null,null,{"$f":"IF(Daten!T70=\"\",\"\",Daten!T70)","v":""},{"$f":"IF(A86=\"\",\"\",\"von \"&Stammdaten!$N$8)","v":""},69]
["",{"$f":"IF(Daten!S71=\"\",\"\",Daten!S71)","v":""},null,null,null,{"$f":"IF(Daten!T71=\"\",\"\",Daten!T71)","v":""},{"$f":"IF(A87=\"\",\"\",\"von \"&Stammdaten!$N$8)","v":""},70]
["",{"$f":"IF(Daten!S72=\"\",\"\",Daten!S72)","v":""},null,null,null,{"$f":"IF(Daten!T72=\"\",\"\",Daten!T72)","v":""},{"$f":"IF(A88=\"\",\"\",\"von \"&Stammdaten!$N$8)","v":""},71]
["",{"$f":"IF(Daten!S73=\"\",\"\",Daten!S73)","v":""},null,null,null,{"$f":"IF(Daten!T73=\"\",\"\",Daten!T73)","v":""},{"$f":"IF(A89=\"\",\"\",\"von \"&Stammdaten!$N$8)","v":""},72]
["",{"$f":"IF(Daten!S74=\"\",\"\",Daten!S74)","v":""},null,null,null,{"$f":"IF(Daten!T74=\"\",\"\",Daten!T74)","v":""},{"$f":"IF(A90=\"\",\"\",\"von \"&Stammdaten!$N$8)","v":""},73]
["",{"$f":"IF(Daten!S75=\"\",\"\",Daten!S75)","v":""},null,null,null,{"$f":"IF(Daten!T75=\"\",\"\",Daten!T75)","v":""},{"$f":"IF(A91=\"\",\"\",\"von \"&Stammdaten!$N$8)","v":""},74]
["",{"$f":"IF(Daten!S76=\"\",\"\",Daten!S76)","v":""},null,null,null,{"$f":"IF(Daten!T76=\"\",\"\",Daten!T76)","v":""},{"$f":"IF(A92=\"\",\"\",\"von \"&Stammdaten!$N$8)","v":""},75]
["",{"$f":"IF(Daten!S77=\"\",\"\",Daten!S77)","v":""},null,null,null,{"$f":"IF(Daten!T77=\"\",\"\",Daten!T77)","v":""},{"$f":"IF(A93=\"\",\"\",\"von \"&Stammdaten!$N$8)","v":""},76]
["",{"$f":"IF(Daten!S78=\"\",\"\",Daten!S78)","v":""},null,null,null,{"$f":"IF(Daten!T78=\"\",\"\",Daten!T78)","v":""},{"$f":"IF(A94=\"\",\"\",\"von \"&Stammdaten!$N$8)","v":""},77]
["",{"$f":"IF(Daten!S79=\"\",\"\",Daten!S79)","v":""},null,null,null,{"$f":"IF(Daten!T79=\"\",\"\",Daten!T79)","v":""},{"$f":"IF(A95=\"\",\"\",\"von \"&Stammdaten!$N$8)","v":""},78]
["",{"$f":"IF(Daten!S80=\"\",\"\",Daten!S80)","v":""},null,null,null,{"$f":"IF(Daten!T80=\"\",\"\",Daten!T80)","v":""},{"$f":"IF(A96=\"\",\"\",\"von \"&Stammdaten!$N$8)","v":""},79]
["",{"$f":"IF(Daten!S81=\"\",\"\",Daten!S81)","v":""},null,null,null,{"$f":"IF(Daten!T81=\"\",\"\",Daten!T81)","v":""},{"$f":"IF(A97=\"\",\"\",\"von \"&Stammdaten!$N$8)","v":""},80]
["",{"$f":"IF(Daten!S82=\"\",\"\",Daten!S82)","v":""},null,null,null,{"$f":"IF(Daten!T82=\"\",\"\",Daten!T82)","v":""},{"$f":"IF(A98=\"\",\"\",\"von \"&Stammdaten!$N$8)","v":""},81]
["",{"$f":"IF(Daten!S83=\"\",\"\",Daten!S83)","v":""},null,null,null,{"$f":"IF(Daten!T83=\"\",\"\",Daten!T83)","v":""},{"$f":"IF(A99=\"\",\"\",\"von \"&Stammdaten!$N$8)","v":""},82]
["",{"$f":"IF(Daten!S84=\"\",\"\",Daten!S84)","v":""},null,null,null,{"$f":"IF(Daten!T84=\"\",\"\",Daten!T84)","v":""},{"$f":"IF(A100=\"\",\"\",\"von \"&Stammdaten!$N$8)","v":""},83]
["",{"$f":"IF(Daten!S85=\"\",\"\",Daten!S85)","v":""},null,null,null,{"$f":"IF(Daten!T85=\"\",\"\",Daten!T85)","v":""},{"$f":"IF(A101=\"\",\"\",\"von \"&Stammdaten!$N$8)","v":""},84]
["",{"$f":"IF(Daten!S86=\"\",\"\",Daten!S86)","v":""},null,null,null,{"$f":"IF(Daten!T86=\"\",\"\",Daten!T86)","v":""},{"$f":"IF(A102=\"\",\"\",\"von \"&Stammdaten!$N$8)","v":""},85]
["",{"$f":"IF(Daten!S87=\"\",\"\",Daten!S87)","v":""},null,null,null,{"$f":"IF(Daten!T87=\"\",\"\",Daten!T87)","v":""},{"$f":"IF(A103=\"\",\"\",\"von \"&Stammdaten!$N$8)","v":""},86]
["",{"$f":"IF(Daten!S88=\"\",\"\",Daten!S88)","v":""},null,null,null,{"$f":"IF(Daten!T88=\"\",\"\",Daten!T88)","v":""},{"$f":"IF(A104=\"\",\"\",\"von \"&Stammdaten!$N$8)","v":""},87]
["",{"$f":"IF(Daten!S89=\"\",\"\",Daten!S89)","v":""},null,null,null,{"$f":"IF(Daten!T89=\"\",\"\",Daten!T89)","v":""},{"$f":"IF(A105=\"\",\"\",\"von \"&Stammdaten!$N$8)","v":""},88]
["",{"$f":"IF(Daten!S90=\"\",\"\",Daten!S90)","v":""},null,null,null,{"$f":"IF(Daten!T90=\"\",\"\",Daten!T90)","v":""},{"$f":"IF(A106=\"\",\"\",\"von \"&Stammdaten!$N$8)","v":""},89]
["",{"$f":"IF(Daten!S91=\"\",\"\",Daten!S91)","v":""},null,null,null,{"$f":"IF(Daten!T91=\"\",\"\",Daten!T91)","v":""},{"$f":"IF(A107=\"\",\"\",\"von \"&Stammdaten!$N$8)","v":""},90]
["",{"$f":"IF(Daten!S92=\"\",\"\",Daten!S92)","v":""},null,null,null,{"$f":"IF(Daten!T92=\"\",\"\",Daten!T92)","v":""},{"$f":"IF(A108=\"\",\"\",\"von \"&Stammdaten!$N$8)","v":""},91]
["",{"$f":"IF(Daten!S93=\"\",\"\",Daten!S93)","v":""},null,null,null,{"$f":"IF(Daten!T93=\"\",\"\",Daten!T93)","v":""},{"$f":"IF(A109=\"\",\"\",\"von \"&Stammdaten!$N$8)","v":""},92]
["",{"$f":"IF(Daten!S94=\"\",\"\",Daten!S94)","v":""},null,null,null,{"$f":"IF(Daten!T94=\"\",\"\",Daten!T94)","v":""},{"$f":"IF(A110=\"\",\"\",\"von \"&Stammdaten!$N$8)","v":""},93]
["",{"$f":"IF(Daten!S95=\"\",\"\",Daten!S95)","v":""},null,null,null,{"$f":"IF(Daten!T95=\"\",\"\",Daten!T95)","v":""},{"$f":"IF(A111=\"\",\"\",\"von \"&Stammdaten!$N$8)","v":""},94]
["",{"$f":"IF(Daten!S96=\"\",\"\",Daten!S96)","v":""},null,null,null,{"$f":"IF(Daten!T96=\"\",\"\",Daten!T96)","v":""},{"$f":"IF(A112=\"\",\"\",\"von \"&Stammdaten!$N$8)","v":""},95]
["",{"$f":"IF(Daten!S97=\"\",\"\",Daten!S97)","v":""},null,null,null,{"$f":"IF(Daten!T97=\"\",\"\",Daten!T97)","v":""},{"$f":"IF(A113=\"\",\"\",\"von \"&Stammdaten!$N$8)","v":""},96]
["",{"$f":"IF(Daten!S98=\"\",\"\",Daten!S98)","v":""},null,null,null,{"$f":"IF(Daten!T98=\"\",\"\",Daten!T98)","v":""},{"$f":"IF(A114=\"\",\"\",\"von \"&Stammdaten!$N$8)","v":""},97]
["",{"$f":"IF(Daten!S99=\"\",\"\",Daten!S99)","v":""},null,null,null,{"$f":"IF(Daten!T99=\"\",\"\",Daten!T99)","v":""},{"$f":"IF(A115=\"\",\"\",\"von \"&Stammdaten!$N$8)","v":""},98]
["",{"$f":"IF(Daten!S100=\"\",\"\",Daten!S100)","v":""},null,null,null,{"$f":"IF(Daten!T100=\"\",\"\",Daten!T100)","v":""},{"$f":"IF(A116=\"\",\"\",\"von \"&Stammdaten!$N$8)","v":""},99]
["",{"$f":"IF(Daten!S101=\"\",\"\",Daten!S101)","v":""},null,null,null,{"$f":"IF(Daten!T101=\"\",\"\",Daten!T101)","v":""},{"$f":"IF(A117=\"\",\"\",\"von \"&Stammdaten!$N$8)","v":""},100]
["",{"$f":"IF(Daten!S102=\"\",\"\",Daten!S102)","v":""},null,null,null,{"$f":"IF(Daten!T102=\"\",\"\",Daten!T102)","v":""},{"$f":"IF(A118=\"\",\"\",\"von \"&Stammdaten!$N$8)","v":""},101]
["",{"$f":"IF(Daten!S103=\"\",\"\",Daten!S103)","v":""},null,null,null,{"$f":"IF(Daten!T103=\"\",\"\",Daten!T103)","v":""},{"$f":"IF(A119=\"\",\"\",\"von \"&Stammdaten!$N$8)","v":""},102]
["",{"$f":"IF(Daten!S104=\"\",\"\",Daten!S104)","v":""},null,null,null,{"$f":"IF(Daten!T104=\"\",\"\",Daten!T104)","v":""},{"$f":"IF(A120=\"\",\"\",\"von \"&Stammdaten!$N$8)","v":""},103]
["",{"$f":"IF(Daten!S105=\"\",\"\",Daten!S105)","v":""},null,null,null,{"$f":"IF(Daten!T105=\"\",\"\",Daten!T105)","v":""},{"$f":"IF(A121=\"\",\"\",\"von \"&Stammdaten!$N$8)","v":""},104]
["",{"$f":"IF(Daten!S106=\"\",\"\",Daten!S106)","v":""},null,null,null,{"$f":"IF(Daten!T106=\"\",\"\",Daten!T106)","v":""},{"$f":"IF(A122=\"\",\"\",\"von \"&Stammdaten!$N$8)","v":""},105]
["",{"$f":"IF(Daten!S107=\"\",\"\",Daten!S107)","v":""},null,null,null,{"$f":"IF(Daten!T107=\"\",\"\",Daten!T107)","v":""},{"$f":"IF(A123=\"\",\"\",\"von \"&Stammdaten!$N$8)","v":""},106]
["",{"$f":"IF(Daten!S108=\"\",\"\",Daten!S108)","v":""},null,null,null,{"$f":"IF(Daten!T108=\"\",\"\",Daten!T108)","v":""},{"$f":"IF(A124=\"\",\"\",\"von \"&Stammdaten!$N$8)","v":""},107]
["",{"$f":"IF(Daten!S109=\"\",\"\",Daten!S109)","v":""},null,null,null,{"$f":"IF(Daten!T109=\"\",\"\",Daten!T109)","v":""},{"$f":"IF(A125=\"\",\"\",\"von \"&Stammdaten!$N$8)","v":""},108]
["",{"$f":"IF(Daten!S110=\"\",\"\",Daten!S110)","v":""},null,null,null,{"$f":"IF(Daten!T110=\"\",\"\",Daten!T110)","v":""},{"$f":"IF(A126=\"\",\"\",\"von \"&Stammdaten!$N$8)","v":""},109]
["",{"$f":"IF(Daten!S111=\"\",\"\",Daten!S111)","v":""},null,null,null,{"$f":"IF(Daten!T111=\"\",\"\",Daten!T111)","v":""},{"$f":"IF(A127=\"\",\"\",\"von \"&Stammdaten!$N$8)","v":""},110]
["",{"$f":"IF(Daten!S112=\"\",\"\",Daten!S112)","v":""},null,null,null,{"$f":"IF(Daten!T112=\"\",\"\",Daten!T112)","v":""},{"$f":"IF(A128=\"\",\"\",\"von \"&Stammdaten!$N$8)","v":""},111]
["",{"$f":"IF(Daten!S113=\"\",\"\",Daten!S113)","v":""},null,null,null,{"$f":"IF(Daten!T113=\"\",\"\",Daten!T113)","v":""},{"$f":"IF(A129=\"\",\"\",\"von \"&Stammdaten!$N$8)","v":""},112]
["",{"$f":"IF(Daten!S114=\"\",\"\",Daten!S114)","v":""},null,null,null,{"$f":"IF(Daten!T114=\"\",\"\",Daten!T114)","v":""},{"$f":"IF(A130=\"\",\"\",\"von \"&Stammdaten!$N$8)","v":""},113]
["",{"$f":"IF(Daten!S115=\"\",\"\",Daten!S115)","v":""},null,null,null,{"$f":"IF(Daten!T115=\"\",\"\",Daten!T115)","v":""},{"$f":"IF(A131=\"\",\"\",\"von \"&Stammdaten!$N$8)","v":""},114]
["",{"$f":"IF(Daten!S116=\"\",\"\",Daten!S116)","v":""},null,null,null,{"$f":"IF(Daten!T116=\"\",\"\",Daten!T116)","v":""},{"$f":"IF(A132=\"\",\"\",\"von \"&Stammdaten!$N$8)","v":""},115]
["",{"$f":"IF(Daten!S117=\"\",\"\",Daten!S117)","v":""},null,null,null,{"$f":"IF(Daten!T117=\"\",\"\",Daten!T117)","v":""},{"$f":"IF(A133=\"\",\"\",\"von \"&Stammdaten!$N$8)","v":""},116]
["",{"$f":"IF(Daten!S118=\"\",\"\",Daten!S118)","v":""},null,null,null,{"$f":"IF(Daten!T118=\"\",\"\",Daten!T118)","v":""},{"$f":"IF(A134=\"\",\"\",\"von \"&Stammdaten!$N$8)","v":""},117]
["",{"$f":"IF(Daten!S119=\"\",\"\",Daten!S119)","v":""},null,null,null,{"$f":"IF(Daten!T119=\"\",\"\",Daten!T119)","v":""},{"$f":"IF(A135=\"\",\"\",\"von \"&Stammdaten!$N$8)","v":""},118]
["",{"$f":"IF(Daten!S120=\"\",\"\",Daten!S120)","v":""},null,null,null,{"$f":"IF(Daten!T120=\"\",\"\",Daten!T120)","v":""},{"$f":"IF(A136=\"\",\"\",\"von \"&Stammdaten!$N$8)","v":""},119]
["",{"$f":"IF(Daten!S121=\"\",\"\",Daten!S121)","v":""},null,null,null,{"$f":"IF(Daten!T121=\"\",\"\",Daten!T121)","v":""},{"$f":"IF(A137=\"\",\"\",\"von \"&Stammdaten!$N$8)","v":""},120]
["",{"$f":"IF(Daten!S122=\"\",\"\",Daten!S122)","v":""},null,null,null,{"$f":"IF(Daten!T122=\"\",\"\",Daten!T122)","v":""},{"$f":"IF(A138=\"\",\"\",\"von \"&Stammdaten!$N$8)","v":""},121]
["",{"$f":"IF(Daten!S123=\"\",\"\",Daten!S123)","v":""},null,null,null,{"$f":"IF(Daten!T123=\"\",\"\",Daten!T123)","v":""},{"$f":"IF(A139=\"\",\"\",\"von \"&Stammdaten!$N$8)","v":""},122]
["",{"$f":"IF(Daten!S124=\"\",\"\",Daten!S124)","v":""},null,null,null,{"$f":"IF(Daten!T124=\"\",\"\",Daten!T124)","v":""},{"$f":"IF(A140=\"\",\"\",\"von \"&Stammdaten!$N$8)","v":""},123]
["",{"$f":"IF(Daten!S125=\"\",\"\",Daten!S125)","v":""},null,null,null,{"$f":"IF(Daten!T125=\"\",\"\",Daten!T125)","v":""},{"$f":"IF(A141=\"\",\"\",\"von \"&Stammdaten!$N$8)","v":""},124]
["",{"$f":"IF(Daten!S126=\"\",\"\",Daten!S126)","v":""},null,null,null,{"$f":"IF(Daten!T126=\"\",\"\",Daten!T126)","v":""},{"$f":"IF(A142=\"\",\"\",\"von \"&Stammdaten!$N$8)","v":""},125]
["",{"$f":"IF(Daten!S127=\"\",\"\",Daten!S127)","v":""},null,null,null,{"$f":"IF(Daten!T127=\"\",\"\",Daten!T127)","v":""},{"$f":"IF(A143=\"\",\"\",\"von \"&Stammdaten!$N$8)","v":""},126]
["",{"$f":"IF(Daten!S128=\"\",\"\",Daten!S128)","v":""},null,null,null,{"$f":"IF(Daten!T128=\"\",\"\",Daten!T128)","v":""},{"$f":"IF(A144=\"\",\"\",\"von \"&Stammdaten!$N$8)","v":""},127]
["",{"$f":"IF(Daten!S129=\"\",\"\",Daten!S129)","v":""},null,null,null,{"$f":"IF(Daten!T129=\"\",\"\",Daten!T129)","v":""},{"$f":"IF(A145=\"\",\"\",\"von \"&Stammdaten!$N$8)","v":""},128]
["",{"$f":"IF(Daten!S130=\"\",\"\",Daten!S130)","v":""},null,null,null,{"$f":"IF(Daten!T130=\"\",\"\",Daten!T130)","v":""},{"$f":"IF(A146=\"\",\"\",\"von \"&Stammdaten!$N$8)","v":""},129]
["",{"$f":"IF(Daten!S131=\"\",\"\",Daten!S131)","v":""},null,null,null,{"$f":"IF(Daten!T131=\"\",\"\",Daten!T131)","v":""},{"$f":"IF(A147=\"\",\"\",\"von \"&Stammdaten!$N$8)","v":""},130]
["",{"$f":"IF(Daten!S132=\"\",\"\",Daten!S132)","v":""},null,null,null,{"$f":"IF(Daten!T132=\"\",\"\",Daten!T132)","v":""},{"$f":"IF(A148=\"\",\"\",\"von \"&Stammdaten!$N$8)","v":""},131]
[{"$f":"IF(F149=\"\",\"\",A148+1)","v":""},{"$f":"IF(Daten!S133=\"\",\"\",Daten!S133)","v":""},null,null,null,{"$f":"IF(Daten!T133=\"\",\"\",Daten!T133)","v":""},{"$f":"IF(A149=\"\",\"\",\"von \"&Stammdaten!$N$8)","v":""},132]
["",{"$f":"IF(Daten!S134=\"\",\"\",Daten!S134)","v":""},null,null,null,{"$f":"IF(Daten!T134=\"\",\"\",Daten!T134)","v":""},{"$f":"IF(A150=\"\",\"\",\"von \"&Stammdaten!$N$8)","v":""},133]
["",{"$f":"IF(Daten!S135=\"\",\"\",Daten!S135)","v":""},null,null,null,{"$f":"IF(Daten!T135=\"\",\"\",Daten!T135)","v":""},{"$f":"IF(A151=\"\",\"\",\"von \"&Stammdaten!$N$8)","v":""},134]
["",{"$f":"IF(Daten!S136=\"\",\"\",Daten!S136)","v":""},null,null,null,{"$f":"IF(Daten!T136=\"\",\"\",Daten!T136)","v":""},{"$f":"IF(A152=\"\",\"\",\"von \"&Stammdaten!$N$8)","v":""},135]
["",{"$f":"IF(Daten!S137=\"\",\"\",Daten!S137)","v":""},null,null,null,{"$f":"IF(Daten!T137=\"\",\"\",Daten!T137)","v":""},{"$f":"IF(A153=\"\",\"\",\"von \"&Stammdaten!$N$8)","v":""},136]
["",{"$f":"IF(Daten!S138=\"\",\"\",Daten!S138)","v":""},null,null,null,{"$f":"IF(Daten!T138=\"\",\"\",Daten!T138)","v":""},{"$f":"IF(A154=\"\",\"\",\"von \"&Stammdaten!$N$8)","v":""},137]
["",{"$f":"IF(Daten!S139=\"\",\"\",Daten!S139)","v":""},null,null,null,{"$f":"IF(Daten!T139=\"\",\"\",Daten!T139)","v":""},{"$f":"IF(A155=\"\",\"\",\"von \"&Stammdaten!$N$8)","v":""},138]
["",{"$f":"IF(Daten!S140=\"\",\"\",Daten!S140)","v":""},null,null,null,{"$f":"IF(Daten!T140=\"\",\"\",Daten!T140)","v":""},{"$f":"IF(A156=\"\",\"\",\"von \"&Stammdaten!$N$8)","v":""},139]
["",{"$f":"IF(Daten!S141=\"\",\"\",Daten!S141)","v":""},null,null,null,{"$f":"IF(Daten!T141=\"\",\"\",Daten!T141)","v":""},{"$f":"IF(A157=\"\",\"\",\"von \"&Stammdaten!$N$8)","v":""},140]
["",{"$f":"IF(Daten!S142=\"\",\"\",Daten!S142)","v":""},null,null,null,{"$f":"IF(Daten!T142=\"\",\"\",Daten!T142)","v":""},{"$f":"IF(A158=\"\",\"\",\"von \"&Stammdaten!$N$8)","v":""},141]
["",{"$f":"IF(Daten!S143=\"\",\"\",Daten!S143)","v":""},null,null,null,{"$f":"IF(Daten!T143=\"\",\"\",Daten!T143)","v":""},{"$f":"IF(A159=\"\",\"\",\"von \"&Stammdaten!$N$8)","v":""},142]
["",{"$f":"IF(Daten!S144=\"\",\"\",Daten!S144)","v":""},null,null,null,{"$f":"IF(Daten!T144=\"\",\"\",Daten!T144)","v":""},{"$f":"IF(A160=\"\",\"\",\"von \"&Stammdaten!$N$8)","v":""},143]
["",{"$f":"IF(Daten!S145=\"\",\"\",Daten!S145)","v":""},null,null,null,{"$f":"IF(Daten!T145=\"\",\"\",Daten!T145)","v":""},{"$f":"IF(A161=\"\",\"\",\"von \"&Stammdaten!$N$8)","v":""},144]
["",{"$f":"IF(Daten!S146=\"\",\"\",Daten!S146)","v":""},null,null,null,{"$f":"IF(Daten!T146=\"\",\"\",Daten!T146)","v":""},{"$f":"IF(A162=\"\",\"\",\"von \"&Stammdaten!$N$8)","v":""},145]
["",{"$f":"IF(Daten!S147=\"\",\"\",Daten!S147)","v":""},null,null,null,{"$f":"IF(Daten!T147=\"\",\"\",Daten!T147)","v":""},{"$f":"IF(A163=\"\",\"\",\"von \"&Stammdaten!$N$8)","v":""},146]
["",{"$f":"IF(Daten!S148=\"\",\"\",Daten!S148)","v":""},null,null,null,{"$f":"IF(Daten!T148=\"\",\"\",Daten!T148)","v":""},{"$f":"IF(A164=\"\",\"\",\"von \"&Stammdaten!$N$8)","v":""},147]
["",{"$f":"IF(Daten!S149=\"\",\"\",Daten!S149)","v":""},null,null,null,{"$f":"IF(Daten!T149=\"\",\"\",Daten!T149)","v":""},{"$f":"IF(A165=\"\",\"\",\"von \"&Stammdaten!$N$8)","v":""},148]
["",{"$f":"IF(Daten!S150=\"\",\"\",Daten!S150)","v":""},null,null,null,{"$f":"IF(Daten!T150=\"\",\"\",Daten!T150)","v":""},{"$f":"IF(A166=\"\",\"\",\"von \"&Stammdaten!$N$8)","v":""},149]
[{"$f":"IF(F167=\"\",\"\",A166+1)","v":""},{"$f":"IF(Daten!S151=\"\",\"\",Daten!S151)","v":""},null,null,null,{"$f":"IF(Daten!T151=\"\",\"\",Daten!T151)","v":""},{"$f":"IF(A167=\"\",\"\",\"von \"&Stammdaten!$N$8)","v":""},150]

{"sheet":"K5 Urkunde-Platz 1","index":24,"n_rows":39,"n_cols":12,"rows_kept":39,"cut":false,"hidden":false,"merged":[[13,2,16,15],[25,2,25,14],[26,2,26,15],[27,2,27,15],[28,2,28,15],[29,2,29,15],[38,11,40,16],[31,8,31,16],[30,2,30,15],[32,2,32,15],[33,2,33,15],[34,2,34,15],[37,9,37,16]]}
[]
[]
[]
[]
[]
[]
[]
[]
[]
[]
[]
[]
[]
[null,null,{"$f":"IF(Stammdaten!$C$8=\"\",\"\",Stammdaten!$C$8)","v":"Dat Groote Püüster Scheeten"}]
[]
[]
[]
[]
[]
[]
[]
[]
[]
[]
[]
[]
[]
[]
[]
[null,null,{"$f":"Stammdaten!$J$10","v":"Hiermit verleiht der SV-Soderstorf"}]
[null,null,{"$f":"IF(Daten!$S$2=\"\",\"\",Daten!$S$2)","v":""}]
[null,null,"den 1. Platz in der",null,null,null,null,null,{"$f":"Stammdaten!$J$8","v":0}]
[null,null,"mit einer Trefferleistung von"]
[null,null,{"$f":"IF(Daten!$T$2=\"\",\"\",Daten!$T$2)","v":""}]
[null,null,"diese Urkunde"]
[]
[]
[null,null,null,null,null,null,null,null,null,{"$f":"IF(Stammdaten!$C$4=\"\",\"\",CONCATENATE(Stammdaten!$C$5,\", den\",\" \",TEXT(Stammdaten!$C$4,\"TT.MM.JJJJ\")))","v":""}]
[null,null,null,null,null,null,null,null,null,null,null,{"$f":"CONCATENATE(Stammdaten!$C$7)","v":"Rolf Marquardt"}]

{"sheet":"K5 Urkunde-Platz 2","index":25,"n_rows":39,"n_cols":12,"rows_kept":39,"cut":false,"hidden":false,"merged":[[13,2,16,15],[25,2,25,14],[26,2,26,15],[27,2,27,15],[28,2,28,15],[29,2,29,15],[38,11,40,16],[31,8,31,16],[30,2,30,15],[32,2,32,15],[33,2,33,15],[34,2,34,15],[37,9,37,16]]}
[]
[]
[]
[]
[]
[]
[]
[]
[]
[]
[]
[]
[]
[null,null,{"$f":"IF(Stammdaten!$C$8=\"\",\"\",Stammdaten!$C$8)","v":"Dat Groote Püüster Scheeten"}]
[]
[]
[]
[]
[]
[]
[]
[]
[]
[]
[]
[]
[]
[]
[]
[null,null,{"$f":"Stammdaten!$J$10","v":"Hiermit verleiht der SV-Soderstorf"}]
[null,null,{"$f":"IF(Daten!$S$3=\"\",\"\",Daten!$S$3)","v":""}]
[null,null,"den 2. Platz in der",null,null,null,null,null,{"$f":"Stammdaten!$J$8","v":0}]
[null,null,"mit einer Trefferleistung von"]
[null,null,{"$f":"IF(Daten!$T$3=\"\",\"\",Daten!$T$3)","v":""}]
[null,null,"diese Urkunde"]
[]
[]
[null,null,null,null,null,null,null,null,null,{"$f":"IF(Stammdaten!$C$4=\"\",\"\",CONCATENATE(Stammdaten!$C$5,\", den\",\" \",TEXT(Stammdaten!$C$4,\"TT.MM.JJJJ\")))","v":""}]
[null,null,null,null,null,null,null,null,null,null,null,{"$f":"CONCATENATE(Stammdaten!$C$7)","v":"Rolf Marquardt"}]

{"sheet":"K5 Urkunde-Platz 3","index":26,"n_rows":39,"n_cols":12,"rows_kept":39,"cut":false,"hidden":false,"merged":[[13,2,16,15],[25,2,25,14],[26,2,26,15],[27,2,27,15],[28,2,28,15],[29,2,29,15],[38,11,40,16],[31,8,31,16],[30,2,30,15],[32,2,32,15],[33,2,33,15],[34,2,34,15],[37,9,37,16]]}
[]
[]
[]
[]
[]
[]
[]
[]
[]
[]
[]
[]
[]
[null,null,{"$f":"IF(Stammdaten!$C$8=\"\",\"\",Stammdaten!$C$8)","v":"Dat Groote Püüster Scheeten"}]
[]
[]
[]
[]
[]
[]
[]
[]
[]
[]
[]
[]
[]
[]
[]
[null,null,{"$f":"Stammdaten!$J$10","v":"Hiermit verleiht der SV-Soderstorf"}]
[null,null,{"$f":"IF(Daten!$S$4=\"\",\"\",Daten!$S$4)","v":""}]
[null,null,"den 3. Platz in der",null,null,null,null,null,{"$f":"Stammdaten!$J$8","v":0}]
[null,null,"mit einer Trefferleistung von"]
[null,null,{"$f":"IF(Daten!$T$4=\"\",\"\",Daten!$T$4)","v":""}]
[null,null,"diese Urkunde"]
[]
[]
[null,null,null,null,null,null,null,null,null,{"$f":"IF(Stammdaten!$C$4=\"\",\"\",CONCATENATE(Stammdaten!$C$5,\", den\",\" \",TEXT(Stammdaten!$C$4,\"TT.MM.JJJJ\")))","v":""}]
[null,null,null,null,null,null,null,null,null,null,null,{"$f":"CONCATENATE(Stammdaten!$C$7)","v":"Rolf Marquardt"}]

{"sheet":"Ergebnis ohne Klassen","index":27,"n_rows":167,"n_cols":8,"rows_kept":167,"cut":false,"hidden":false,"merged":[[165,1,165,4],[166,1,166,4],[159,1,159,4],[160,1,160,4],[161,1,161,4],[162,1,162,4],[163,1,163,4],[164,1,164,4],[153,1,153,4],[154,1,154,4],[155,1,155,4],[156,1,156,4],[157,1,157,4],[158,1,158,4],[147,1,147,4],[148,1,148,4],[149,1,149,4],[150,1,150,4],[151,1,151,4],[152,1,152,4],[141,1,141,4],[142,1,142,4],[143,1,143,4],[144,1,144,4],[145,1,145,4],[146,1,146,4],[135,1,135,4],[136,1,136,4],[137,1,137,4],[138,1,138,4],[139,1,139,4],[140,1,140,4],[129,1,129,4],[130,1,130,4],[131,1,131,4],[132,1,132,4],[133,1,133,4],[134,1,134,4],[123,1,123,4],[124,1,124,4],[125,1,125,4],[126,1,126,4],[127,1,127,4],[128,1,128,4],[117,1,117,4],[118,1,118,4],[119,1,119,4],[120,1,120,4],[121,1,121,4],[122,1,122,4],[111,1,111,4],[112,1,112,4],[113,1,113,4],[114,1,114,4],[115,1,115,4],[116,1,116,4],[105,1,105,4],[106,1,106,4],[107,1,107,4],[108,1,108,4],[109,1,109,4],[110,1,110,4],[99,1,99,4],[100,1,100,4],[101,1,101,4],[102,1,102,4],[103,1,103,4],[104,1,104,4],[93,1,93,4],[94,1,94,4],[95,1,95,4],[96,1,96,4],[97,1,97,4],[98,1,98,4],[87,1,87,4],[88,1,88,4],[89,1,89,4],[90,1,90,4],[91,1,91,4],[92,1,92,4],[81,1,81,4],[82,1,82,4],[83,1,83,4],[84,1,84,4],[85,1,85,4],[86,1,86,4],[75,1,75,4],[76,1,76,4],[77,1,77,4],[78,1,78,4],[79,1,79,4],[80,1,80,4],[69,1,69,4],[70,1,70,4],[71,1,71,4],[72,1,72,4],[73,1,73,4],[74,1,74,4],[63,1,63,4],[64,1,64,4],[65,1,65,4],[66,1,66,4],[67,1,67,4],[68,1,68,4],[57,1,57,4],[58,1,58,4],[59,1,59,4],[60,1,60,4],[61,1,61,4],[62,1,62,4],[51,1,51,4],[52,1,52,4],[53,1,53,4],[54,1,54,4],[55,1,55,4],[56,1,56,4],[45,1,45,4],[46,1,46,4],[47,1,47,4],[48,1,48,4],[49,1,49,4],[50,1,50,4],[39,1,39,4],[40,1,40,4],[41,1,41,4],[42,1,42,4],[43,1,43,4],[44,1,44,4],[33,1,33,4],[34,1,34,4],[35,1,35,4],[36,1,36,4],[37,1,37,4],[38,1,38,4],[29,1,29,4],[30,1,30,4],[31,1,31,4],[32,1,32,4],[21,1,21,4],[22,1,22,4],[23,1,23,4],[24,1,24,4],[25,1,25,4],[26,1,26,4],[12,4,13,6],[14,0,15,6],[16,1,16,4],[17,1,17,4],[18,1,18,4],[19,1,19,4],[20,1,20,4],[27,1,27,4],[28,1,28,4]]}
[]
[]
[]
[]
[]
[]
[]
[]
[]
[]
[]
[]
[null,null,null,null,"Ergebnis ohne Klassen Einteilung  "]
[]
[{"$f":"IF(Stammdaten!$C$4=\"\",\"\",CONCATENATE(TEXT(Stammdaten!$C$4,\"TT.MM.JJJJ\"),\" \",\"in \",Stammdaten!$C$5,\" \"\"\",Stammdaten!C8,\"\"\"\"))","v":""}]
[]
["Platz:","Name:",null,null,null,"Treffer:"]
[{"$f":"IF(Daten!X2,1,\"\")","v":""},{"$f":"IF(Daten!X2=0,\"\",Daten!W2)","v":""},null,null,null,{"$f":"IF(Daten!X2=0,\"\",Daten!X2)","v":""},{"$f":"IF(A18=\"\",\"\",\"von \"&Stammdaten!$N$4)","v":""},1]
[{"$f":"IF(F19=\"\",\"\",A18+1)","v":""},{"$f":"IF(Daten!X3=0,\"\",Daten!W3)","v":""},null,null,null,{"$f":"IF(Daten!X3=0,\"\",Daten!X3)","v":""},{"$f":"IF(A19=\"\",\"\",\"von \"&Stammdaten!$N$4)","v":""},2]
[{"$f":"IF(F20=\"\",\"\",A19+1)","v":""},{"$f":"IF(Daten!X4=0,\"\",Daten!W4)","v":""},null,null,null,{"$f":"IF(Daten!X4=0,\"\",Daten!X4)","v":""},{"$f":"IF(A20=\"\",\"\",\"von \"&Stammdaten!$N$4)","v":""},3]
["",{"$f":"IF(Daten!X5=0,\"\",Daten!W5)","v":""},null,null,null,{"$f":"IF(Daten!X5=0,\"\",Daten!X5)","v":""},{"$f":"IF(A21=\"\",\"\",\"von \"&Stammdaten!$N$4)","v":""},4]
["",{"$f":"IF(Daten!X6=0,\"\",Daten!W6)","v":""},null,null,null,{"$f":"IF(Daten!X6=0,\"\",Daten!X6)","v":""},{"$f":"IF(A22=\"\",\"\",\"von \"&Stammdaten!$N$4)","v":""},5]
["",{"$f":"IF(Daten!X7=0,\"\",Daten!W7)","v":""},null,null,null,{"$f":"IF(Daten!X7=0,\"\",Daten!X7)","v":""},{"$f":"IF(A23=\"\",\"\",\"von \"&Stammdaten!$N$4)","v":""},6]
["",{"$f":"IF(Daten!X8=0,\"\",Daten!W8)","v":""},null,null,null,{"$f":"IF(Daten!X8=0,\"\",Daten!X8)","v":""},{"$f":"IF(A24=\"\",\"\",\"von \"&Stammdaten!$N$4)","v":""},7]
["",{"$f":"IF(Daten!X9=0,\"\",Daten!W9)","v":""},null,null,null,{"$f":"IF(Daten!X9=0,\"\",Daten!X9)","v":""},{"$f":"IF(A25=\"\",\"\",\"von \"&Stammdaten!$N$4)","v":""},8]
["",{"$f":"IF(Daten!X10=0,\"\",Daten!W10)","v":""},null,null,null,{"$f":"IF(Daten!X10=0,\"\",Daten!X10)","v":""},{"$f":"IF(A26=\"\",\"\",\"von \"&Stammdaten!$N$4)","v":""},9]
["",{"$f":"IF(Daten!X11=0,\"\",Daten!W11)","v":""},null,null,null,{"$f":"IF(Daten!X11=0,\"\",Daten!X11)","v":""},{"$f":"IF(A27=\"\",\"\",\"von \"&Stammdaten!$N$4)","v":""},10]
["",{"$f":"IF(Daten!X12=0,\"\",Daten!W12)","v":""},null,null,null,{"$f":"IF(Daten!X12=0,\"\",Daten!X12)","v":""},{"$f":"IF(A28=\"\",\"\",\"von \"&Stammdaten!$N$4)","v":""},11]
["",{"$f":"IF(Daten!X13=0,\"\",Daten!W13)","v":""},null,null,null,{"$f":"IF(Daten!X13=0,\"\",Daten!X13)","v":""},{"$f":"IF(A29=\"\",\"\",\"von \"&Stammdaten!$N$4)","v":""},12]
["",{"$f":"IF(Daten!X14=0,\"\",Daten!W14)","v":""},null,null,null,{"$f":"IF(Daten!X14=0,\"\",Daten!X14)","v":""},{"$f":"IF(A30=\"\",\"\",\"von \"&Stammdaten!$N$4)","v":""},13]
["",{"$f":"IF(Daten!X15=0,\"\",Daten!W15)","v":""},null,null,null,{"$f":"IF(Daten!X15=0,\"\",Daten!X15)","v":""},{"$f":"IF(A31=\"\",\"\",\"von \"&Stammdaten!$N$4)","v":""},14]
["",{"$f":"IF(Daten!X16=0,\"\",Daten!W16)","v":""},null,null,null,{"$f":"IF(Daten!X16=0,\"\",Daten!X16)","v":""},{"$f":"IF(A32=\"\",\"\",\"von \"&Stammdaten!$N$4)","v":""},15]
["",{"$f":"IF(Daten!X17=0,\"\",Daten!W17)","v":""},null,null,null,{"$f":"IF(Daten!X17=0,\"\",Daten!X17)","v":""},{"$f":"IF(A33=\"\",\"\",\"von \"&Stammdaten!$N$4)","v":""},16]
["",{"$f":"IF(Daten!X18=0,\"\",Daten!W18)","v":""},null,null,null,{"$f":"IF(Daten!X18=0,\"\",Daten!X18)","v":""},{"$f":"IF(A34=\"\",\"\",\"von \"&Stammdaten!$N$4)","v":""},17]
["",{"$f":"IF(Daten!X19=0,\"\",Daten!W19)","v":""},null,null,null,{"$f":"IF(Daten!X19=0,\"\",Daten!X19)","v":""},{"$f":"IF(A35=\"\",\"\",\"von \"&Stammdaten!$N$4)","v":""},18]
["",{"$f":"IF(Daten!X20=0,\"\",Daten!W20)","v":""},null,null,null,{"$f":"IF(Daten!X20=0,\"\",Daten!X20)","v":""},{"$f":"IF(A36=\"\",\"\",\"von \"&Stammdaten!$N$4)","v":""},19]
["",{"$f":"IF(Daten!X21=0,\"\",Daten!W21)","v":""},null,null,null,{"$f":"IF(Daten!X21=0,\"\",Daten!X21)","v":""},{"$f":"IF(A37=\"\",\"\",\"von \"&Stammdaten!$N$4)","v":""},20]
["",{"$f":"IF(Daten!X22=0,\"\",Daten!W22)","v":""},null,null,null,{"$f":"IF(Daten!X22=0,\"\",Daten!X22)","v":""},{"$f":"IF(A38=\"\",\"\",\"von \"&Stammdaten!$N$4)","v":""},21]
["",{"$f":"IF(Daten!X23=0,\"\",Daten!W23)","v":""},null,null,null,{"$f":"IF(Daten!X23=0,\"\",Daten!X23)","v":""},{"$f":"IF(A39=\"\",\"\",\"von \"&Stammdaten!$N$4)","v":""},22]
["",{"$f":"IF(Daten!X24=0,\"\",Daten!W24)","v":""},null,null,null,{"$f":"IF(Daten!X24=0,\"\",Daten!X24)","v":""},{"$f":"IF(A40=\"\",\"\",\"von \"&Stammdaten!$N$4)","v":""},23]
["",{"$f":"IF(Daten!X25=0,\"\",Daten!W25)","v":""},null,null,null,{"$f":"IF(Daten!X25=0,\"\",Daten!X25)","v":""},{"$f":"IF(A41=\"\",\"\",\"von \"&Stammdaten!$N$4)","v":""},24]
["",{"$f":"IF(Daten!X26=0,\"\",Daten!W26)","v":""},null,null,null,{"$f":"IF(Daten!X26=0,\"\",Daten!X26)","v":""},{"$f":"IF(A42=\"\",\"\",\"von \"&Stammdaten!$N$4)","v":""},25]
["",{"$f":"IF(Daten!X27=0,\"\",Daten!W27)","v":""},null,null,null,{"$f":"IF(Daten!X27=0,\"\",Daten!X27)","v":""},{"$f":"IF(A43=\"\",\"\",\"von \"&Stammdaten!$N$4)","v":""},26]
["",{"$f":"IF(Daten!X28=0,\"\",Daten!W28)","v":""},null,null,null,{"$f":"IF(Daten!X28=0,\"\",Daten!X28)","v":""},{"$f":"IF(A44=\"\",\"\",\"von \"&Stammdaten!$N$4)","v":""},27]
["",{"$f":"IF(Daten!X29=0,\"\",Daten!W29)","v":""},null,null,null,{"$f":"IF(Daten!X29=0,\"\",Daten!X29)","v":""},{"$f":"IF(A45=\"\",\"\",\"von \"&Stammdaten!$N$4)","v":""},28]
["",{"$f":"IF(Daten!X30=0,\"\",Daten!W30)","v":""},null,null,null,{"$f":"IF(Daten!X30=0,\"\",Daten!X30)","v":""},{"$f":"IF(A46=\"\",\"\",\"von \"&Stammdaten!$N$4)","v":""},29]
["",{"$f":"IF(Daten!X31=0,\"\",Daten!W31)","v":""},null,null,null,{"$f":"IF(Daten!X31=0,\"\",Daten!X31)","v":""},{"$f":"IF(A47=\"\",\"\",\"von \"&Stammdaten!$N$4)","v":""},30]
["",{"$f":"IF(Daten!X32=0,\"\",Daten!W32)","v":""},null,null,null,{"$f":"IF(Daten!X32=0,\"\",Daten!X32)","v":""},{"$f":"IF(A48=\"\",\"\",\"von \"&Stammdaten!$N$4)","v":""},31]
["",{"$f":"IF(Daten!X33=0,\"\",Daten!W33)","v":""},null,null,null,{"$f":"IF(Daten!X33=0,\"\",Daten!X33)","v":""},{"$f":"IF(A49=\"\",\"\",\"von \"&Stammdaten!$N$4)","v":""},32]
["",{"$f":"IF(Daten!X34=0,\"\",Daten!W34)","v":""},null,null,null,{"$f":"IF(Daten!X34=0,\"\",Daten!X34)","v":""},{"$f":"IF(A50=\"\",\"\",\"von \"&Stammdaten!$N$4)","v":""},33]
["",{"$f":"IF(Daten!X35=0,\"\",Daten!W35)","v":""},null,null,null,{"$f":"IF(Daten!X35=0,\"\",Daten!X35)","v":""},{"$f":"IF(A51=\"\",\"\",\"von \"&Stammdaten!$N$4)","v":""},34]
["",{"$f":"IF(Daten!X36=0,\"\",Daten!W36)","v":""},null,null,null,{"$f":"IF(Daten!X36=0,\"\",Daten!X36)","v":""},{"$f":"IF(A52=\"\",\"\",\"von \"&Stammdaten!$N$4)","v":""},35]
["",{"$f":"IF(Daten!X37=0,\"\",Daten!W37)","v":""},null,null,null,{"$f":"IF(Daten!X37=0,\"\",Daten!X37)","v":""},{"$f":"IF(A53=\"\",\"\",\"von \"&Stammdaten!$N$4)","v":""},36]
["",{"$f":"IF(Daten!X38=0,\"\",Daten!W38)","v":""},null,null,null,{"$f":"IF(Daten!X38=0,\"\",Daten!X38)","v":""},{"$f":"IF(A54=\"\",\"\",\"von \"&Stammdaten!$N$4)","v":""},37]
["",{"$f":"IF(Daten!X39=0,\"\",Daten!W39)","v":""},null,null,null,{"$f":"IF(Daten!X39=0,\"\",Daten!X39)","v":""},{"$f":"IF(A55=\"\",\"\",\"von \"&Stammdaten!$N$4)","v":""},38]
["",{"$f":"IF(Daten!X40=0,\"\",Daten!W40)","v":""},null,null,null,{"$f":"IF(Daten!X40=0,\"\",Daten!X40)","v":""},{"$f":"IF(A56=\"\",\"\",\"von \"&Stammdaten!$N$4)","v":""},39]
["",{"$f":"IF(Daten!X41=0,\"\",Daten!W41)","v":""},null,null,null,{"$f":"IF(Daten!X41=0,\"\",Daten!X41)","v":""},{"$f":"IF(A57=\"\",\"\",\"von \"&Stammdaten!$N$4)","v":""},40]
["",{"$f":"IF(Daten!X42=0,\"\",Daten!W42)","v":""},null,null,null,{"$f":"IF(Daten!X42=0,\"\",Daten!X42)","v":""},{"$f":"IF(A58=\"\",\"\",\"von \"&Stammdaten!$N$4)","v":""},41]
["",{"$f":"IF(Daten!X43=0,\"\",Daten!W43)","v":""},null,null,null,{"$f":"IF(Daten!X43=0,\"\",Daten!X43)","v":""},{"$f":"IF(A59=\"\",\"\",\"von \"&Stammdaten!$N$4)","v":""},42]
["",{"$f":"IF(Daten!X44=0,\"\",Daten!W44)","v":""},null,null,null,{"$f":"IF(Daten!X44=0,\"\",Daten!X44)","v":""},{"$f":"IF(A60=\"\",\"\",\"von \"&Stammdaten!$N$4)","v":""},43]
["",{"$f":"IF(Daten!X45=0,\"\",Daten!W45)","v":""},null,null,null,{"$f":"IF(Daten!X45=0,\"\",Daten!X45)","v":""},{"$f":"IF(A61=\"\",\"\",\"von \"&Stammdaten!$N$4)","v":""},44]
["",{"$f":"IF(Daten!X46=0,\"\",Daten!W46)","v":""},null,null,null,{"$f":"IF(Daten!X46=0,\"\",Daten!X46)","v":""},{"$f":"IF(A62=\"\",\"\",\"von \"&Stammdaten!$N$4)","v":""},45]
["",{"$f":"IF(Daten!X47=0,\"\",Daten!W47)","v":""},null,null,null,{"$f":"IF(Daten!X47=0,\"\",Daten!X47)","v":""},{"$f":"IF(A63=\"\",\"\",\"von \"&Stammdaten!$N$4)","v":""},46]
["",{"$f":"IF(Daten!X48=0,\"\",Daten!W48)","v":""},null,null,null,{"$f":"IF(Daten!X48=0,\"\",Daten!X48)","v":""},{"$f":"IF(A64=\"\",\"\",\"von \"&Stammdaten!$N$4)","v":""},47]
["",{"$f":"IF(Daten!X49=0,\"\",Daten!W49)","v":""},null,null,null,{"$f":"IF(Daten!X49=0,\"\",Daten!X49)","v":""},{"$f":"IF(A65=\"\",\"\",\"von \"&Stammdaten!$N$4)","v":""},48]
["",{"$f":"IF(Daten!X50=0,\"\",Daten!W50)","v":""},null,null,null,{"$f":"IF(Daten!X50=0,\"\",Daten!X50)","v":""},{"$f":"IF(A66=\"\",\"\",\"von \"&Stammdaten!$N$4)","v":""},49]
["",{"$f":"IF(Daten!X51=0,\"\",Daten!W51)","v":""},null,null,null,{"$f":"IF(Daten!X51=0,\"\",Daten!X51)","v":""},{"$f":"IF(A67=\"\",\"\",\"von \"&Stammdaten!$N$4)","v":""},50]
["",{"$f":"IF(Daten!X52=0,\"\",Daten!W52)","v":""},null,null,null,{"$f":"IF(Daten!X52=0,\"\",Daten!X52)","v":""},{"$f":"IF(A68=\"\",\"\",\"von \"&Stammdaten!$N$4)","v":""},51]
["",{"$f":"IF(Daten!X53=0,\"\",Daten!W53)","v":""},null,null,null,{"$f":"IF(Daten!X53=0,\"\",Daten!X53)","v":""},{"$f":"IF(A69=\"\",\"\",\"von \"&Stammdaten!$N$4)","v":""},52]
["",{"$f":"IF(Daten!X54=0,\"\",Daten!W54)","v":""},null,null,null,{"$f":"IF(Daten!X54=0,\"\",Daten!X54)","v":""},{"$f":"IF(A70=\"\",\"\",\"von \"&Stammdaten!$N$4)","v":""},53]
["",{"$f":"IF(Daten!X55=0,\"\",Daten!W55)","v":""},null,null,null,{"$f":"IF(Daten!X55=0,\"\",Daten!X55)","v":""},{"$f":"IF(A71=\"\",\"\",\"von \"&Stammdaten!$N$4)","v":""},54]
["",{"$f":"IF(Daten!X56=0,\"\",Daten!W56)","v":""},null,null,null,{"$f":"IF(Daten!X56=0,\"\",Daten!X56)","v":""},{"$f":"IF(A72=\"\",\"\",\"von \"&Stammdaten!$N$4)","v":""},55]
["",{"$f":"IF(Daten!X57=0,\"\",Daten!W57)","v":""},null,null,null,{"$f":"IF(Daten!X57=0,\"\",Daten!X57)","v":""},{"$f":"IF(A73=\"\",\"\",\"von \"&Stammdaten!$N$4)","v":""},56]
["",{"$f":"IF(Daten!X58=0,\"\",Daten!W58)","v":""},null,null,null,{"$f":"IF(Daten!X58=0,\"\",Daten!X58)","v":""},{"$f":"IF(A74=\"\",\"\",\"von \"&Stammdaten!$N$4)","v":""},57]
["",{"$f":"IF(Daten!X59=0,\"\",Daten!W59)","v":""},null,null,null,{"$f":"IF(Daten!X59=0,\"\",Daten!X59)","v":""},{"$f":"IF(A75=\"\",\"\",\"von \"&Stammdaten!$N$4)","v":""},58]
["",{"$f":"IF(Daten!X60=0,\"\",Daten!W60)","v":""},null,null,null,{"$f":"IF(Daten!X60=0,\"\",Daten!X60)","v":""},{"$f":"IF(A76=\"\",\"\",\"von \"&Stammdaten!$N$4)","v":""},59]
["",{"$f":"IF(Daten!X61=0,\"\",Daten!W61)","v":""},null,null,null,{"$f":"IF(Daten!X61=0,\"\",Daten!X61)","v":""},{"$f":"IF(A77=\"\",\"\",\"von \"&Stammdaten!$N$4)","v":""},60]
["",{"$f":"IF(Daten!X62=0,\"\",Daten!W62)","v":""},null,null,null,{"$f":"IF(Daten!X62=0,\"\",Daten!X62)","v":""},{"$f":"IF(A78=\"\",\"\",\"von \"&Stammdaten!$N$4)","v":""},61]
["",{"$f":"IF(Daten!X63=0,\"\",Daten!W63)","v":""},null,null,null,{"$f":"IF(Daten!X63=0,\"\",Daten!X63)","v":""},{"$f":"IF(A79=\"\",\"\",\"von \"&Stammdaten!$N$4)","v":""},62]
["",{"$f":"IF(Daten!X64=0,\"\",Daten!W64)","v":""},null,null,null,{"$f":"IF(Daten!X64=0,\"\",Daten!X64)","v":""},{"$f":"IF(A80=\"\",\"\",\"von \"&Stammdaten!$N$4)","v":""},63]
["",{"$f":"IF(Daten!X65=0,\"\",Daten!W65)","v":""},null,null,null,{"$f":"IF(Daten!X65=0,\"\",Daten!X65)","v":""},{"$f":"IF(A81=\"\",\"\",\"von \"&Stammdaten!$N$4)","v":""},64]
["",{"$f":"IF(Daten!X66=0,\"\",Daten!W66)","v":""},null,null,null,{"$f":"IF(Daten!X66=0,\"\",Daten!X66)","v":""},{"$f":"IF(A82=\"\",\"\",\"von \"&Stammdaten!$N$4)","v":""},65]
["",{"$f":"IF(Daten!X67=0,\"\",Daten!W67)","v":""},null,null,null,{"$f":"IF(Daten!X67=0,\"\",Daten!X67)","v":""},{"$f":"IF(A83=\"\",\"\",\"von \"&Stammdaten!$N$4)","v":""},66]
[{"$f":"IF(F84=\"\",\"\",A83+1)","v":""},{"$f":"IF(Daten!X68=0,\"\",Daten!W68)","v":""},null,null,null,{"$f":"IF(Daten!X68=0,\"\",Daten!X68)","v":""},{"$f":"IF(A84=\"\",\"\",\"von \"&Stammdaten!$N$4)","v":""},67]
["",{"$f":"IF(Daten!X69=0,\"\",Daten!W69)","v":""},null,null,null,{"$f":"IF(Daten!X69=0,\"\",Daten!X69)","v":""},{"$f":"IF(A85=\"\",\"\",\"von \"&Stammdaten!$N$4)","v":""},68]
["",{"$f":"IF(Daten!X70=0,\"\",Daten!W70)","v":""},null,null,null,{"$f":"IF(Daten!X70=0,\"\",Daten!X70)","v":""},{"$f":"IF(A86=\"\",\"\",\"von \"&Stammdaten!$N$4)","v":""},69]
["",{"$f":"IF(Daten!X71=0,\"\",Daten!W71)","v":""},null,null,null,{"$f":"IF(Daten!X71=0,\"\",Daten!X71)","v":""},{"$f":"IF(A87=\"\",\"\",\"von \"&Stammdaten!$N$4)","v":""},70]
["",{"$f":"IF(Daten!X72=0,\"\",Daten!W72)","v":""},null,null,null,{"$f":"IF(Daten!X72=0,\"\",Daten!X72)","v":""},{"$f":"IF(A88=\"\",\"\",\"von \"&Stammdaten!$N$4)","v":""},71]
["",{"$f":"IF(Daten!X73=0,\"\",Daten!W73)","v":""},null,null,null,{"$f":"IF(Daten!X73=0,\"\",Daten!X73)","v":""},{"$f":"IF(A89=\"\",\"\",\"von \"&Stammdaten!$N$4)","v":""},72]
["",{"$f":"IF(Daten!X74=0,\"\",Daten!W74)","v":""},null,null,null,{"$f":"IF(Daten!X74=0,\"\",Daten!X74)","v":""},{"$f":"IF(A90=\"\",\"\",\"von \"&Stammdaten!$N$4)","v":""},73]
["",{"$f":"IF(Daten!X75=0,\"\",Daten!W75)","v":""},null,null,null,{"$f":"IF(Daten!X75=0,\"\",Daten!X75)","v":""},{"$f":"IF(A91=\"\",\"\",\"von \"&Stammdaten!$N$4)","v":""},74]
["",{"$f":"IF(Daten!X76=0,\"\",Daten!W76)","v":""},null,null,null,{"$f":"IF(Daten!X76=0,\"\",Daten!X76)","v":""},{"$f":"IF(A92=\"\",\"\",\"von \"&Stammdaten!$N$4)","v":""},75]
["",{"$f":"IF(Daten!X77=0,\"\",Daten!W77)","v":""},null,null,null,{"$f":"IF(Daten!X77=0,\"\",Daten!X77)","v":""},{"$f":"IF(A93=\"\",\"\",\"von \"&Stammdaten!$N$4)","v":""},76]
["",{"$f":"IF(Daten!X78=0,\"\",Daten!W78)","v":""},null,null,null,{"$f":"IF(Daten!X78=0,\"\",Daten!X78)","v":""},{"$f":"IF(A94=\"\",\"\",\"von \"&Stammdaten!$N$4)","v":""},77]
["",{"$f":"IF(Daten!X79=0,\"\",Daten!W79)","v":""},null,null,null,{"$f":"IF(Daten!X79=0,\"\",Daten!X79)","v":""},{"$f":"IF(A95=\"\",\"\",\"von \"&Stammdaten!$N$4)","v":""},78]
["",{"$f":"IF(Daten!X80=0,\"\",Daten!W80)","v":""},null,null,null,{"$f":"IF(Daten!X80=0,\"\",Daten!X80)","v":""},{"$f":"IF(A96=\"\",\"\",\"von \"&Stammdaten!$N$4)","v":""},79]
["",{"$f":"IF(Daten!X81=0,\"\",Daten!W81)","v":""},null,null,null,{"$f":"IF(Daten!X81=0,\"\",Daten!X81)","v":""},{"$f":"IF(A97=\"\",\"\",\"von \"&Stammdaten!$N$4)","v":""},80]
["",{"$f":"IF(Daten!X82=0,\"\",Daten!W82)","v":""},null,null,null,{"$f":"IF(Daten!X82=0,\"\",Daten!X82)","v":""},{"$f":"IF(A98=\"\",\"\",\"von \"&Stammdaten!$N$4)","v":""},81]
["",{"$f":"IF(Daten!X83=0,\"\",Daten!W83)","v":""},null,null,null,{"$f":"IF(Daten!X83=0,\"\",Daten!X83)","v":""},{"$f":"IF(A99=\"\",\"\",\"von \"&Stammdaten!$N$4)","v":""},82]
["",{"$f":"IF(Daten!X84=0,\"\",Daten!W84)","v":""},null,null,null,{"$f":"IF(Daten!X84=0,\"\",Daten!X84)","v":""},{"$f":"IF(A100=\"\",\"\",\"von \"&Stammdaten!$N$4)","v":""},83]
["",{"$f":"IF(Daten!X85=0,\"\",Daten!W85)","v":""},null,null,null,{"$f":"IF(Daten!X85=0,\"\",Daten!X85)","v":""},{"$f":"IF(A101=\"\",\"\",\"von \"&Stammdaten!$N$4)","v":""},84]
["",{"$f":"IF(Daten!X86=0,\"\",Daten!W86)","v":""},null,null,null,{"$f":"IF(Daten!X86=0,\"\",Daten!X86)","v":""},{"$f":"IF(A102=\"\",\"\",\"von \"&Stammdaten!$N$4)","v":""},85]
["",{"$f":"IF(Daten!X87=0,\"\",Daten!W87)","v":""},null,null,null,{"$f":"IF(Daten!X87=0,\"\",Daten!X87)","v":""},{"$f":"IF(A103=\"\",\"\",\"von \"&Stammdaten!$N$4)","v":""},86]
["",{"$f":"IF(Daten!X88=0,\"\",Daten!W88)","v":""},null,null,null,{"$f":"IF(Daten!X88=0,\"\",Daten!X88)","v":""},{"$f":"IF(A104=\"\",\"\",\"von \"&Stammdaten!$N$4)","v":""},87]
["",{"$f":"IF(Daten!X89=0,\"\",Daten!W89)","v":""},null,null,null,{"$f":"IF(Daten!X89=0,\"\",Daten!X89)","v":""},{"$f":"IF(A105=\"\",\"\",\"von \"&Stammdaten!$N$4)","v":""},88]
["",{"$f":"IF(Daten!X90=0,\"\",Daten!W90)","v":""},null,null,null,{"$f":"IF(Daten!X90=0,\"\",Daten!X90)","v":""},{"$f":"IF(A106=\"\",\"\",\"von \"&Stammdaten!$N$4)","v":""},89]
["",{"$f":"IF(Daten!X91=0,\"\",Daten!W91)","v":""},null,null,null,{"$f":"IF(Daten!X91=0,\"\",Daten!X91)","v":""},{"$f":"IF(A107=\"\",\"\",\"von \"&Stammdaten!$N$4)","v":""},90]
["",{"$f":"IF(Daten!X92=0,\"\",Daten!W92)","v":""},null,null,null,{"$f":"IF(Daten!X92=0,\"\",Daten!X92)","v":""},{"$f":"IF(A108=\"\",\"\",\"von \"&Stammdaten!$N$4)","v":""},91]
["",{"$f":"IF(Daten!X93=0,\"\",Daten!W93)","v":""},null,null,null,{"$f":"IF(Daten!X93=0,\"\",Daten!X93)","v":""},{"$f":"IF(A109=\"\",\"\",\"von \"&Stammdaten!$N$4)","v":""},92]
["",{"$f":"IF(Daten!X94=0,\"\",Daten!W94)","v":""},null,null,null,{"$f":"IF(Daten!X94=0,\"\",Daten!X94)","v":""},{"$f":"IF(A110=\"\",\"\",\"von \"&Stammdaten!$N$4)","v":""},93]
["",{"$f":"IF(Daten!X95=0,\"\",Daten!W95)","v":""},null,null,null,{"$f":"IF(Daten!X95=0,\"\",Daten!X95)","v":""},{"$f":"IF(A111=\"\",\"\",\"von \"&Stammdaten!$N$4)","v":""},94]
["",{"$f":"IF(Daten!X96=0,\"\",Daten!W96)","v":""},null,null,null,{"$f":"IF(Daten!X96=0,\"\",Daten!X96)","v":""},{"$f":"IF(A112=\"\",\"\",\"von \"&Stammdaten!$N$4)","v":""},95]
["",{"$f":"IF(Daten!X97=0,\"\",Daten!W97)","v":""},null,null,null,{"$f":"IF(Daten!X97=0,\"\",Daten!X97)","v":""},{"$f":"IF(A113=\"\",\"\",\"von \"&Stammdaten!$N$4)","v":""},96]
["",{"$f":"IF(Daten!X98=0,\"\",Daten!W98)","v":""},null,null,null,{"$f":"IF(Daten!X98=0,\"\",Daten!X98)","v":""},{"$f":"IF(A114=\"\",\"\",\"von \"&Stammdaten!$N$4)","v":""},97]
["",{"$f":"IF(Daten!X99=0,\"\",Daten!W99)","v":""},null,null,null,{"$f":"IF(Daten!X99=0,\"\",Daten!X99)","v":""},{"$f":"IF(A115=\"\",\"\",\"von \"&Stammdaten!$N$4)","v":""},98]
["",{"$f":"IF(Daten!X100=0,\"\",Daten!W100)","v":""},null,null,null,{"$f":"IF(Daten!X100=0,\"\",Daten!X100)","v":""},{"$f":"IF(A116=\"\",\"\",\"von \"&Stammdaten!$N$4)","v":""},99]
["",{"$f":"IF(Daten!X101=0,\"\",Daten!W101)","v":""},null,null,null,{"$f":"IF(Daten!X101=0,\"\",Daten!X101)","v":""},{"$f":"IF(A117=\"\",\"\",\"von \"&Stammdaten!$N$4)","v":""},100]
["",{"$f":"IF(Daten!X102=0,\"\",Daten!W102)","v":""},null,null,null,{"$f":"IF(Daten!X102=0,\"\",Daten!X102)","v":""},{"$f":"IF(A118=\"\",\"\",\"von \"&Stammdaten!$N$4)","v":""},101]
["",{"$f":"IF(Daten!X103=0,\"\",Daten!W103)","v":""},null,null,null,{"$f":"IF(Daten!X103=0,\"\",Daten!X103)","v":""},{"$f":"IF(A119=\"\",\"\",\"von \"&Stammdaten!$N$4)","v":""},102]
["",{"$f":"IF(Daten!X104=0,\"\",Daten!W104)","v":""},null,null,null,{"$f":"IF(Daten!X104=0,\"\",Daten!X104)","v":""},{"$f":"IF(A120=\"\",\"\",\"von \"&Stammdaten!$N$4)","v":""},103]
["",{"$f":"IF(Daten!X105=0,\"\",Daten!W105)","v":""},null,null,null,{"$f":"IF(Daten!X105=0,\"\",Daten!X105)","v":""},{"$f":"IF(A121=\"\",\"\",\"von \"&Stammdaten!$N$4)","v":""},104]
["",{"$f":"IF(Daten!X106=0,\"\",Daten!W106)","v":""},null,null,null,{"$f":"IF(Daten!X106=0,\"\",Daten!X106)","v":""},{"$f":"IF(A122=\"\",\"\",\"von \"&Stammdaten!$N$4)","v":""},105]
["",{"$f":"IF(Daten!X107=0,\"\",Daten!W107)","v":""},null,null,null,{"$f":"IF(Daten!X107=0,\"\",Daten!X107)","v":""},{"$f":"IF(A123=\"\",\"\",\"von \"&Stammdaten!$N$4)","v":""},106]
["",{"$f":"IF(Daten!X108=0,\"\",Daten!W108)","v":""},null,null,null,{"$f":"IF(Daten!X108=0,\"\",Daten!X108)","v":""},{"$f":"IF(A124=\"\",\"\",\"von \"&Stammdaten!$N$4)","v":""},107]
["",{"$f":"IF(Daten!X109=0,\"\",Daten!W109)","v":""},null,null,null,{"$f":"IF(Daten!X109=0,\"\",Daten!X109)","v":""},{"$f":"IF(A125=\"\",\"\",\"von \"&Stammdaten!$N$4)","v":""},108]
["",{"$f":"IF(Daten!X110=0,\"\",Daten!W110)","v":""},null,null,null,{"$f":"IF(Daten!X110=0,\"\",Daten!X110)","v":""},{"$f":"IF(A126=\"\",\"\",\"von \"&Stammdaten!$N$4)","v":""},109]
["",{"$f":"IF(Daten!X111=0,\"\",Daten!W111)","v":""},null,null,null,{"$f":"IF(Daten!X111=0,\"\",Daten!X111)","v":""},{"$f":"IF(A127=\"\",\"\",\"von \"&Stammdaten!$N$4)","v":""},110]
["",{"$f":"IF(Daten!X112=0,\"\",Daten!W112)","v":""},null,null,null,{"$f":"IF(Daten!X112=0,\"\",Daten!X112)","v":""},{"$f":"IF(A128=\"\",\"\",\"von \"&Stammdaten!$N$4)","v":""},111]
["",{"$f":"IF(Daten!X113=0,\"\",Daten!W113)","v":""},null,null,null,{"$f":"IF(Daten!X113=0,\"\",Daten!X113)","v":""},{"$f":"IF(A129=\"\",\"\",\"von \"&Stammdaten!$N$4)","v":""},112]
["",{"$f":"IF(Daten!X114=0,\"\",Daten!W114)","v":""},null,null,null,{"$f":"IF(Daten!X114=0,\"\",Daten!X114)","v":""},{"$f":"IF(A130=\"\",\"\",\"von \"&Stammdaten!$N$4)","v":""},113]
["",{"$f":"IF(Daten!X115=0,\"\",Daten!W115)","v":""},null,null,null,{"$f":"IF(Daten!X115=0,\"\",Daten!X115)","v":""},{"$f":"IF(A131=\"\",\"\",\"von \"&Stammdaten!$N$4)","v":""},114]
["",{"$f":"IF(Daten!X116=0,\"\",Daten!W116)","v":""},null,null,null,{"$f":"IF(Daten!X116=0,\"\",Daten!X116)","v":""},{"$f":"IF(A132=\"\",\"\",\"von \"&Stammdaten!$N$4)","v":""},115]
["",{"$f":"IF(Daten!X117=0,\"\",Daten!W117)","v":""},null,null,null,{"$f":"IF(Daten!X117=0,\"\",Daten!X117)","v":""},{"$f":"IF(A133=\"\",\"\",\"von \"&Stammdaten!$N$4)","v":""},116]
["",{"$f":"IF(Daten!X118=0,\"\",Daten!W118)","v":""},null,null,null,{"$f":"IF(Daten!X118=0,\"\",Daten!X118)","v":""},{"$f":"IF(A134=\"\",\"\",\"von \"&Stammdaten!$N$4)","v":""},117]
["",{"$f":"IF(Daten!X119=0,\"\",Daten!W119)","v":""},null,null,null,{"$f":"IF(Daten!X119=0,\"\",Daten!X119)","v":""},{"$f":"IF(A135=\"\",\"\",\"von \"&Stammdaten!$N$4)","v":""},118]
["",{"$f":"IF(Daten!X120=0,\"\",Daten!W120)","v":""},null,null,null,{"$f":"IF(Daten!X120=0,\"\",Daten!X120)","v":""},{"$f":"IF(A136=\"\",\"\",\"von \"&Stammdaten!$N$4)","v":""},119]
["",{"$f":"IF(Daten!X121=0,\"\",Daten!W121)","v":""},null,null,null,{"$f":"IF(Daten!X121=0,\"\",Daten!X121)","v":""},{"$f":"IF(A137=\"\",\"\",\"von \"&Stammdaten!$N$4)","v":""},120]
["",{"$f":"IF(Daten!X122=0,\"\",Daten!W122)","v":""},null,null,null,{"$f":"IF(Daten!X122=0,\"\",Daten!X122)","v":""},{"$f":"IF(A138=\"\",\"\",\"von \"&Stammdaten!$N$4)","v":""},121]
["",{"$f":"IF(Daten!X123=0,\"\",Daten!W123)","v":""},null,null,null,{"$f":"IF(Daten!X123=0,\"\",Daten!X123)","v":""},{"$f":"IF(A139=\"\",\"\",\"von \"&Stammdaten!$N$4)","v":""},122]
["",{"$f":"IF(Daten!X124=0,\"\",Daten!W124)","v":""},null,null,null,{"$f":"IF(Daten!X124=0,\"\",Daten!X124)","v":""},{"$f":"IF(A140=\"\",\"\",\"von \"&Stammdaten!$N$4)","v":""},123]
["",{"$f":"IF(Daten!X125=0,\"\",Daten!W125)","v":""},null,null,null,{"$f":"IF(Daten!X125=0,\"\",Daten!X125)","v":""},{"$f":"IF(A141=\"\",\"\",\"von \"&Stammdaten!$N$4)","v":""},124]
["",{"$f":"IF(Daten!X126=0,\"\",Daten!W126)","v":""},null,null,null,{"$f":"IF(Daten!X126=0,\"\",Daten!X126)","v":""},{"$f":"IF(A142=\"\",\"\",\"von \"&Stammdaten!$N$4)","v":""},125]
["",{"$f":"IF(Daten!X127=0,\"\",Daten!W127)","v":""},null,null,null,{"$f":"IF(Daten!X127=0,\"\",Daten!X127)","v":""},{"$f":"IF(A143=\"\",\"\",\"von \"&Stammdaten!$N$4)","v":""},126]
["",{"$f":"IF(Daten!X128=0,\"\",Daten!W128)","v":""},null,null,null,{"$f":"IF(Daten!X128=0,\"\",Daten!X128)","v":""},{"$f":"IF(A144=\"\",\"\",\"von \"&Stammdaten!$N$4)","v":""},127]
["",{"$f":"IF(Daten!X129=0,\"\",Daten!W129)","v":""},null,null,null,{"$f":"IF(Daten!X129=0,\"\",Daten!X129)","v":""},{"$f":"IF(A145=\"\",\"\",\"von \"&Stammdaten!$N$4)","v":""},128]
["",{"$f":"IF(Daten!X130=0,\"\",Daten!W130)","v":""},null,null,null,{"$f":"IF(Daten!X130=0,\"\",Daten!X130)","v":""},{"$f":"IF(A146=\"\",\"\",\"von \"&Stammdaten!$N$4)","v":""},129]
["",{"$f":"IF(Daten!X131=0,\"\",Daten!W131)","v":""},null,null,null,{"$f":"IF(Daten!X131=0,\"\",Daten!X131)","v":""},{"$f":"IF(A147=\"\",\"\",\"von \"&Stammdaten!$N$4)","v":""},130]
[{"$f":"IF(F148=\"\",\"\",A147+1)","v":""},{"$f":"IF(Daten!X132=0,\"\",Daten!W132)","v":""},null,null,null,{"$f":"IF(Daten!X132=0,\"\",Daten!X132)","v":""},{"$f":"IF(A148=\"\",\"\",\"von \"&Stammdaten!$N$4)","v":""},131]
["",{"$f":"IF(Daten!X133=0,\"\",Daten!W133)","v":""},null,null,null,{"$f":"IF(Daten!X133=0,\"\",Daten!X133)","v":""},{"$f":"IF(A149=\"\",\"\",\"von \"&Stammdaten!$N$4)","v":""},132]
["",{"$f":"IF(Daten!X134=0,\"\",Daten!W134)","v":""},null,null,null,{"$f":"IF(Daten!X134=0,\"\",Daten!X134)","v":""},{"$f":"IF(A150=\"\",\"\",\"von \"&Stammdaten!$N$4)","v":""},133]
["",{"$f":"IF(Daten!X135=0,\"\",Daten!W135)","v":""},null,null,null,{"$f":"IF(Daten!X135=0,\"\",Daten!X135)","v":""},{"$f":"IF(A151=\"\",\"\",\"von \"&Stammdaten!$N$4)","v":""},134]
["",{"$f":"IF(Daten!X136=0,\"\",Daten!W136)","v":""},null,null,null,{"$f":"IF(Daten!X136=0,\"\",Daten!X136)","v":""},{"$f":"IF(A152=\"\",\"\",\"von \"&Stammdaten!$N$4)","v":""},135]
["",{"$f":"IF(Daten!X137=0,\"\",Daten!W137)","v":""},null,null,null,{"$f":"IF(Daten!X137=0,\"\",Daten!X137)","v":""},{"$f":"IF(A153=\"\",\"\",\"von \"&Stammdaten!$N$4)","v":""},136]
["",{"$f":"IF(Daten!X138=0,\"\",Daten!W138)","v":""},null,null,null,{"$f":"IF(Daten!X138=0,\"\",Daten!X138)","v":""},{"$f":"IF(A154=\"\",\"\",\"von \"&Stammdaten!$N$4)","v":""},137]
["",{"$f":"IF(Daten!X139=0,\"\",Daten!W139)","v":""},null,null,null,{"$f":"IF(Daten!X139=0,\"\",Daten!X139)","v":""},{"$f":"IF(A155=\"\",\"\",\"von \"&Stammdaten!$N$4)","v":""},138]
["",{"$f":"IF(Daten!X140=0,\"\",Daten!W140)","v":""},null,null,null,{"$f":"IF(Daten!X140=0,\"\",Daten!X140)","v":""},{"$f":"IF(A156=\"\",\"\",\"von \"&Stammdaten!$N$4)","v":""},139]
["",{"$f":"IF(Daten!X141=0,\"\",Daten!W141)","v":""},null,null,null,{"$f":"IF(Daten!X141=0,\"\",Daten!X141)","v":""},{"$f":"IF(A157=\"\",\"\",\"von \"&Stammdaten!$N$4)","v":""},140]
["",{"$f":"IF(Daten!X142=0,\"\",Daten!W142)","v":""},null,null,null,{"$f":"IF(Daten!X142=0,\"\",Daten!X142)","v":""},{"$f":"IF(A158=\"\",\"\",\"von \"&Stammdaten!$N$4)","v":""},141]
["",{"$f":"IF(Daten!X143=0,\"\",Daten!W143)","v":""},null,null,null,{"$f":"IF(Daten!X143=0,\"\",Daten!X143)","v":""},{"$f":"IF(A159=\"\",\"\",\"von \"&Stammdaten!$N$4)","v":""},142]
["",{"$f":"IF(Daten!X144=0,\"\",Daten!W144)","v":""},null,null,null,{"$f":"IF(Daten!X144=0,\"\",Daten!X144)","v":""},{"$f":"IF(A160=\"\",\"\",\"von \"&Stammdaten!$N$4)","v":""},143]
["",{"$f":"IF(Daten!X145=0,\"\",Daten!W145)","v":""},null,null,null,{"$f":"IF(Daten!X145=0,\"\",Daten!X145)","v":""},{"$f":"IF(A161=\"\",\"\",\"von \"&Stammdaten!$N$4)","v":""},144]
["",{"$f":"IF(Daten!X146=0,\"\",Daten!W146)","v":""},null,null,null,{"$f":"IF(Daten!X146=0,\"\",Daten!X146)","v":""},{"$f":"IF(A162=\"\",\"\",\"von \"&Stammdaten!$N$4)","v":""},145]
["",{"$f":"IF(Daten!X147=0,\"\",Daten!W147)","v":""},null,null,null,{"$f":"IF(Daten!X147=0,\"\",Daten!X147)","v":""},{"$f":"IF(A163=\"\",\"\",\"von \"&Stammdaten!$N$4)","v":""},146]
["",{"$f":"IF(Daten!X148=0,\"\",Daten!W148)","v":""},null,null,null,{"$f":"IF(Daten!X148=0,\"\",Daten!X148)","v":""},{"$f":"IF(A164=\"\",\"\",\"von \"&Stammdaten!$N$4)","v":""},147]
["",{"$f":"IF(Daten!X149=0,\"\",Daten!W149)","v":""},null,null,null,{"$f":"IF(Daten!X149=0,\"\",Daten!X149)","v":""},{"$f":"IF(A165=\"\",\"\",\"von \"&Stammdaten!$N$4)","v":""},148]
["",{"$f":"IF(Daten!X150=0,\"\",Daten!W150)","v":""},null,null,null,{"$f":"IF(Daten!X150=0,\"\",Daten!X150)","v":""},{"$f":"IF(A166=\"\",\"\",\"von \"&Stammdaten!$N$4)","v":""},149]
["",{"$f":"IF(Daten!X151=0,\"\",Daten!W151)","v":""},null,null,null,{"$f":"IF(Daten!X151=0,\"\",Daten!X151)","v":""},{"$f":"IF(A167=\"\",\"\",\"von \"&Stammdaten!$N$4)","v":""},150]

{"sheet":"Urkunde-Platz 1","index":28,"n_rows":39,"n_cols":12,"rows_kept":39,"cut":false,"hidden":false,"merged":[[13,2,16,15],[25,2,25,14],[26,2,26,15],[27,2,27,15],[28,2,28,15],[29,2,29,15],[37,9,37,16],[38,11,40,16],[30,2,30,15],[31,2,31,15],[32,2,32,15],[33,2,33,15],[34,2,34,15]]}
[]
[]
[]
[]
[]
[]
[]
[]
[]
[]
[]
[]
[]
[null,null,{"$f":"IF(Stammdaten!$C$8=\"\",\"\",Stammdaten!$C$8)","v":"Dat Groote Püüster Scheeten"}]
[]
[]
[]
[]
[]
[]
[]
[]
[]
[]
[]
[]
[]
[]
[]
[null,null,{"$f":"Stammdaten!$J$10","v":"Hiermit verleiht der SV-Soderstorf"}]
[null,null,{"$f":"IF(Daten!W2=\"\",\"\",Daten!W2)","v":0}]
[null,null,"den 1. Platz"]
[null,null,"mit einer Trefferleistung von"]
[null,null,{"$f":"IF(Daten!X2=0,\"\",Daten!X2)","v":""}]
[null,null,"diese Urkunde"]
[]
[]
[null,null,null,null,null,null,null,null,null,{"$f":"IF(Stammdaten!$C$4=\"\",\"\",CONCATENATE(Stammdaten!$C$5,\", den\",\" \",TEXT(Stammdaten!$C$4,\"TT.MM.JJJJ\")))","v":""}]
[null,null,null,null,null,null,null,null,null,null,null,{"$f":"CONCATENATE(Stammdaten!$C$7)","v":"Rolf Marquardt"}]

{"sheet":"Urkunde-Platz 2","index":29,"n_rows":39,"n_cols":12,"rows_kept":39,"cut":false,"hidden":false,"merged":[[13,2,16,15],[25,2,25,14],[26,2,26,15],[27,2,27,15],[28,2,28,15],[29,2,29,15],[37,9,37,16],[38,11,40,16],[30,2,30,15],[31,2,31,15],[32,2,32,15],[33,2,33,15],[34,2,34,15]]}
[]
[]
[]
[]
[]
[]
[]
[]
[]
[]
[]
[]
[]
[null,null,{"$f":"IF(Stammdaten!$C$8=\"\",\"\",Stammdaten!$C$8)","v":"Dat Groote Püüster Scheeten"}]
[]
[]
[]
[]
[]
[]
[]
[]
[]
[]
[]
[]
[]
[]
[]
[null,null,{"$f":"Stammdaten!$J$10","v":"Hiermit verleiht der SV-Soderstorf"}]
[null,null,{"$f":"IF(Daten!$W$3=\"\",\"\",Daten!$W$3)","v":0}]
[null,null,"den 2. Platz"]
[null,null,"mit einer Trefferleistung von"]
[null,null,{"$f":"IF(Daten!X3=0,\"\",Daten!X3)","v":""}]
[null,null,"diese Urkunde"]
[]
[]
[null,null,null,null,null,null,null,null,null,{"$f":"IF(Stammdaten!$C$4=\"\",\"\",CONCATENATE(Stammdaten!$C$5,\", den\",\" \",TEXT(Stammdaten!$C$4,\"TT.MM.JJJJ\")))","v":""}]
[null,null,null,null,null,null,null,null,null,null,null,{"$f":"CONCATENATE(Stammdaten!$C$7)","v":"Rolf Marquardt"}]

{"sheet":"Urkunde-Platz 3","index":30,"n_rows":39,"n_cols":12,"rows_kept":39,"cut":false,"hidden":false,"merged":[[13,2,16,15],[25,2,25,14],[26,2,26,15],[27,2,27,15],[28,2,28,15],[29,2,29,15],[37,9,37,16],[38,11,40,16],[30,2,30,15],[31,2,31,15],[32,2,32,15],[33,2,33,15],[34,2,34,15]]}
[]
[]
[]
[]
[]
[]
[]
[]
[]
[]
[]
[]
[]
[null,null,{"$f":"IF(Stammdaten!$C$8=\"\",\"\",Stammdaten!$C$8)","v":"Dat Groote Püüster Scheeten"}]
[]
[]
[]
[]
[]
[]
[]
[]
[]
[]
[]
[]
[]
[]
[]
[null,null,{"$f":"Stammdaten!$J$10","v":"Hiermit verleiht der SV-Soderstorf"}]
[null,null,{"$f":"IF(Daten!$W$4=\"\",\"\",Daten!$W$4)","v":0}]
[null,null,"den 3. Platz"]
[null,null,"mit einer Trefferleistung von"]
[null,null,{"$f":"IF(Daten!$X$4=0,\"\",Daten!$X$4)","v":""}]
[null,null,"diese Urkunde"]
[]
[]
[null,null,null,null,null,null,null,null,null,{"$f":"IF(Stammdaten!$C$4=\"\",\"\",CONCATENATE(Stammdaten!$C$5,\", den\",\" \",TEXT(Stammdaten!$C$4,\"TT.MM.JJJJ\")))","v":""}]
[null,null,null,null,null,null,null,null,null,null,null,{"$f":"CONCATENATE(Stammdaten!$C$7)","v":"Rolf Marquardt"}]

{"sheet":"Wanderfliese","index":31,"n_rows":35,"n_cols":6,"rows_kept":35,"cut":false,"hidden":false,"merged":[[0,0,0,5]]}
["Dat Groote Püüster Scheeten\n\"Wanderfliese\""]
[]
[]
["Platz","Name","Schuss 1","Schuss 2","Summe","Teiler"]
[{"$f":"IF(B5=\"\",\"\",1)","v":""}]
[{"$f":"IF(B6=\"\",\"\",A5+1)","v":""}]
[{"$f":"IF(B7=\"\",\"\",A6+1)","v":""}]
[""]
[""]
[""]
[""]
[""]
[""]
[""]
[""]
[""]
[""]
[""]
[""]
[""]
[""]
[""]
[""]
[""]
[""]
[""]
[""]
["",null,null,null,{"$f":"IF(SUM(C28:D28)>1,SUM(C28:D28),0)","v":0}]
["",null,null,null,0]
["",null,null,null,0]
["",null,null,null,0]
["",null,null,null,0]
["",null,null,null,0]
["",null,null,null,0]
["",null,null,null,0]

{"sheet":"Turniervorlage (1)","index":32,"n_rows":46,"n_cols":12,"rows_kept":46,"cut":false,"hidden":false,"merged":[[47,6,47,9],[4,8,4,9],[0,0,0,12],[2,0,2,1],[4,0,4,1],[6,0,6,2],[2,8,2,9]]}
["Hunter Field Target (HFT) Turnier Ergebniserfassung"]
[]
["Name:",null,null,null,null,null,null,null,"Datum:  "]
[]
["Waffe:",null,null,null,null,null,null,null,"Klasse:  "]
[]
[]
[1,1,2,2,3,3,4,4,5,5,null,"Summe"]
[null,null,null,null,null,null,null,null,null,null,null,{"$f":"IF(A9=\"\",\"\",SUM(A9:J9))","v":""}]
[]
[6,6,7,7,8,8,9,9,10,10,null,"Summe"]
[null,null,null,null,null,null,null,null,null,null,null,{"$f":"IF(A12=\"\",\"\",SUM(A12:J12))","v":""}]
[]
[11,11,12,12,13,13,14,14,15,15,null,"Summe"]
[null,null,null,null,null,null,null,null,null,null,null,{"$f":"IF(A15=\"\",\"\",SUM(A15:J15))","v":""}]
[]
[16,16,17,17,18,18,19,19,20,20,null,"Summe"]
[null,null,null,null,null,null,null,null,null,null,null,{"$f":"IF(A18=\"\",\"\",SUM(A18:J18))","v":""}]
[]
[21,21,22,22,23,23,24,24,25,25,null,"Summe"]
[null,null,null,null,null,null,null,null,null,null,null,{"$f":"IF(A21=\"\",\"\",SUM(A21:J21))","v":""}]
[]
[26,26,27,27,28,28,29,29,30,30,null,"Summe"]
[null,null,null,null,null,null,null,null,null,null,null,{"$f":"IF(A24=\"\",\"\",SUM(A24:J24))","v":""}]
[]
[31,31,32,32,33,33,34,34,35,35,null,"Summe"]
[null,null,null,null,null,null,null,null,null,null,null,{"$f":"IF(A27=\"\",\"\",SUM(A27:J27))","v":""}]
[]
[36,36,37,37,38,38,39,39,40,40,null,"Summe"]
[null,null,null,null,null,null,null,null,null,null,null,{"$f":"IF(A30=\"\",\"\",SUM(A30:J30))","v":""}]
[]
[41,41,42,42,43,43,44,44,45,45,null,"Summe"]
[null,null,null,null,null,null,null,null,null,null,null,{"$f":"IF(A33=\"\",\"\",SUM(A33:J33))","v":""}]
[]
[46,46,47,47,48,48,49,49,50,50,null,"Summe"]
[null,null,null,null,null,null,null,null,null,null,null,{"$f":"IF(A36=\"\",\"\",SUM(A36:J36))","v":""}]
[]
[51,51,52,52,53,53,54,54,55,55,null,"Summe"]
[null,null,null,null,null,null,null,null,null,null,null,{"$f":"IF(A39=\"\",\"\",SUM(A39:J39))","v":""}]
[]
[56,56,57,57,58,58,59,59,60,60,null,"Summe"]
[null,null,null,null,null,null,null,null,null,null,null,{"$f":"IF(A42=\"\",\"\",SUM(A42:J42))","v":""}]
[]
["   2 Punkte = Ziel umgeklappt"]
["   1 Punkt = Treffer Silhouette",null,null,null,null,null,null,null,"gesamt Ergebnis:   "]
["   0 Punkte = kein Treffer"]

{"sheet":"Turniervorlage (2)","index":33,"n_rows":50,"n_cols":15,"rows_kept":50,"cut":false,"hidden":false,"merged":[[36,14,45,14],[47,8,48,12],[47,14,48,14],[51,6,51,9],[10,14,19,14],[21,0,21,2],[21,14,22,14],[23,14,32,14],[34,0,34,2],[34,14,35,14],[8,0,8,2],[8,14,9,14],[0,0,0,14],[2,0,3,1],[2,8,2,9],[4,0,4,1],[6,0,6,1]]}
["Hunter Field Target (HFT) Turnier Ergebniserfassung"]
[]
["Name:",null,null,null,null,null,null,null,"Datum:  "]
[]
[null,null,null,null,null,null,null,null,"MIT Prellschlag"]
[]
["Waffe:",null,null,null,null,null,null,null,"OHNE Prellschlag"]
[]
["1. Durchgang",null,null,null,null,null,null,null,null,null,null,null,null,null,"1. Durchgang\ngesamt Summe"]
[1,1,2,2,3,3,4,4,5,5,null,null,"Summe"]
[null,null,null,null,null,null,null,null,null,null,null,null,{"$f":"IF(A11=\"\",\"\",SUM(A11:J11))","v":""},null,{"$f":"IF(A11=\"\",\"\",SUM(M11,M14,M17,M20))","v":""}]
[]
[6,6,7,7,8,8,9,9,10,10,null,null,"Summe"]
[null,null,null,null,null,null,null,null,null,null,null,null,{"$f":"IF(A14=\"\",\"\",SUM(A14:J14))","v":""}]
[]
[11,11,12,12,13,13,14,14,15,15,null,null,"Summe"]
[null,null,null,null,null,null,null,null,null,null,null,null,{"$f":"IF(A17=\"\",\"\",SUM(A17:J17))","v":""}]
[]
[16,16,17,17,18,18,19,19,20,20,null,null,"Summe"]
[null,null,null,null,null,null,null,null,null,null,null,null,{"$f":"IF(A20=\"\",\"\",SUM(A20:J20))","v":""}]
[]
["2. Durchgang",null,null,null,null,null,null,null,null,null,null,null,null,null,"2. Durchgang\ngesamt Summe"]
[1,1,2,2,3,3,4,4,5,5,null,null,"Summe"]
[null,null,null,null,null,null,null,null,null,null,null,null,{"$f":"IF(A24=\"\",\"\",SUM(A24:J24))","v":""},null,{"$f":"IF(A24=\"\",\"\",SUM(M24,M27,M30,M33))","v":""}]
[]
[6,6,7,7,8,8,9,9,10,10,null,null,"Summe"]
[null,null,null,null,null,null,null,null,null,null,null,null,{"$f":"IF(A27=\"\",\"\",SUM(A27:J27))","v":""}]
[]
[11,11,12,12,13,13,14,14,15,15,null,null,"Summe"]
[null,null,null,null,null,null,null,null,null,null,null,null,{"$f":"IF(A30=\"\",\"\",SUM(A30:J30))","v":""}]
[]
[16,16,17,17,18,18,19,19,20,20,null,null,"Summe"]
[null,null,null,null,null,null,null,null,null,null,null,null,{"$f":"IF(A33=\"\",\"\",SUM(A33:J33))","v":""}]
[]
["3. Durchgang",null,null,null,null,null,null,null,null,null,null,null,null,null,"3. Durchgang\ngesamt Summe"]
[1,1,2,2,3,3,4,4,5,5,null,null,"Summe"]
[null,null,null,null,null,null,null,null,null,null,null,null,{"$f":"IF(A37=\"\",\"\",SUM(A37:J37))","v":""},null,{"$f":"IF(A37=\"\",\"\",SUM(M37,M40,M43,M46))","v":""}]
[]
[6,6,7,7,8,8,9,9,10,10,null,null,"Summe"]
[null,null,null,null,null,null,null,null,null,null,null,null,{"$f":"IF(A40=\"\",\"\",SUM(A40:J40))","v":""}]
[]
[11,11,12,12,13,13,14,14,15,15,null,null,"Summe"]
[null,null,null,null,null,null,null,null,null,null,null,null,{"$f":"IF(A43=\"\",\"\",SUM(A43:J43))","v":""}]
[]
[16,16,17,17,18,18,19,19,20,20,null,null,"Summe"]
[null,null,null,null,null,null,null,null,null,null,null,null,{"$f":"IF(A46=\"\",\"\",SUM(A46:J46))","v":""}]
[]
["2 Punkte = Ziel umgeklappt",null,null,null,null,null,null,null,"gesamt Ergebnis:",null,null,null,null,null,{"$f":"IF(A11=\"\",\"\",SUM(O11,O24,O37))","v":""}]
["1 Punkt = Treffer Silhouette"]
["0 Punkte = kein Treffer"]