{"text_format":"1","workbook":"xlsx","n_sheets":24,"sheets":["HM","1","2","3","4","5","6","7","8","9","10","11","12","13","14","15","16","17","18","D","Sammler","EM","EW","Hilfe"],"not_rendered":{"charts":0,"images":54,"macros":1,"external_links":0,"defined_names":21,"comments":19,"pivot_tables":0},"unopened":[],"bounds":{"document_bytes":16777216,"sheet_cells":100000,"rows_first":2000,"rows_last":500,"rows_between":2000,"halvings":0,"cell_chars":16384,"cell_head_chars":4096},"cells_cut":0,"cells_raw":0,"read":"whole","date_system":"1900"}

{"sheet":"HM","index":0,"n_rows":32,"n_cols":13,"rows_kept":32,"cut":false,"hidden":false,"merged":[[28,11,29,11],[31,11,32,11],[16,11,17,11],[19,11,20,11],[22,11,23,11],[25,11,26,11],[10,4,11,6],[13,4,14,6],[16,4,17,6],[10,12,11,14],[16,12,17,14],[5,12,5,14],[22,9,23,9],[22,10,23,10],[22,12,23,14],[10,9,11,9],[19,9,20,9],[19,10,20,10],[19,12,20,14],[31,9,32,9],[3,14,3,15],[31,10,32,10],[31,12,32,14],[28,12,29,14],[7,12,8,14],[10,10,11,10],[25,9,26,9],[25,10,26,10],[13,12,14,14],[25,12,26,14],[16,9,17,9],[16,10,17,10],[7,11,8,11],[10,11,11,11],[13,11,14,11],[31,1,32,1],[31,2,32,2],[31,4,32,6],[19,4,20,6],[31,3,32,3],[22,3,23,3],[25,3,26,3],[22,4,23,6],[1,5,2,15],[7,4,8,6],[28,1,29,1],[28,2,29,2],[5,9,5,10],[7,9,8,9],[7,10,8,10],[13,9,14,9],[13,10,14,10],[28,9,29,9],[28,10,29,10],[28,4,29,6],[7,1,8,1],[7,2,8,2],[10,1,11,1],[28,3,29,3],[0,0,0,2],[25,1,26,1],[25,2,26,2],[5,1,5,2],[13,1,14,1],[13,2,14,2],[16,1,17,1],[16,2,17,2],[19,2,20,2],[22,1,23,1],[22,2,23,2],[10,2,11,2],[1,0,1,4],[25,4,26,6],[19,1,20,1],[5,4,5,6],[7,3,8,3],[10,3,11,3],[13,3,14,3],[16,3,17,3],[19,3,20,3]]}
["23.04.2023"]
["Kirchgellersen",null,null,null,null,{"$f":"CONCATENATE(\"   Volksbankschießen\",\" \",TEXT(A1,\"JJJJ\"))","v":"   Volksbankschießen 2023"}]
[]
[]
[]
[null,"Gewehr-\ngewinn-\nberechtigt?",null,null,"Verein:",null,null,null,null,"Gewehr-\ngewinn-\nberechtigt?",null,null,"Verein:"]
[null,"Ja","Nein",null,null,null,null,null,null,"Ja","Nein"]
[null,null,null,{"$f":"IF('1'!$R$3=1,\"þ\",\"ý\")","v":"ý"},"SV-Verein 01",null,null,null,null,null,null,{"$f":"IF('10'!$R$3=1,\"þ\",\"ý\")","v":"ý"},"SV-Verein 10"]
[]
[]
[null,null,null,{"$f":"IF('2'!$R$3=1,\"þ\",\"ý\")","v":"ý"},"SV-Verein 02",null,null,null,null,null,null,{"$f":"IF('11'!$R$3=1,\"þ\",\"ý\")","v":"ý"},"SV-Verein 11"]
[]
[]
[null,null,null,{"$f":"IF('3'!$R$3=1,\"þ\",\"ý\")","v":"ý"},"SV-Verein 03",null,null,null,null,null,null,{"$f":"IF('12'!$R$3=1,\"þ\",\"ý\")","v":"ý"},"SV-Verein 12"]
[]
[]
[null,null,null,{"$f":"IF('4'!$R$3=1,\"þ\",\"ý\")","v":"ý"},"SV-Verein 04",null,null,null,null,null,null,{"$f":"IF('13'!$R$3=1,\"þ\",\"ý\")","v":"ý"},"SV-Verein 13"]
[]
[]
[null,null,null,{"$f":"IF('5'!$R$3=1,\"þ\",\"ý\")","v":"ý"},"SV-Verein 05",null,null,null,null,null,null,{"$f":"IF('14'!$R$3=1,\"þ\",\"ý\")","v":"ý"},"SV-Verein 14"]
[]
[]
[null,null,null,{"$f":"IF('6'!$R$3=1,\"þ\",\"ý\")","v":"ý"},"SV-Verein 06",null,null,null,null,null,null,{"$f":"IF('15'!$R$3=1,\"þ\",\"ý\")","v":"ý"},"SV-Verein 15"]
[]
[]
[null,null,null,{"$f":"IF('7'!$R$3=1,\"þ\",\"ý\")","v":"ý"},"SV-Verein 07",null,null,null,null,null,null,{"$f":"IF('16'!$R$3=1,\"þ\",\"ý\")","v":"ý"},"SV-Verein 16"]
[]
[]
[null,null,null,{"$f":"IF('8'!$R$3=1,\"þ\",\"ý\")","v":"ý"},"SV-Verein 08",null,null,null,null,null,null,{"$f":"IF('17'!$R$3=1,\"þ\",\"ý\")","v":"ý"},"SV-Verein 17"]
[]
[]
[null,null,null,{"$f":"IF('9'!$R$3=1,\"þ\",\"ý\")","v":"ý"},"SV-Verein 09",null,null,null,null,null,null,{"$f":"IF('18'!$R$3=1,\"þ\",\"ý\")","v":"ý"},"SV-Verein 18"]

{"sheet":"1","index":1,"n_rows":23,"n_cols":26,"rows_kept":23,"cut":false,"hidden":false,"merged":[[0,1,1,15],[2,12,2,14],[3,12,3,14],[11,13,11,14],[13,2,13,4],[13,7,13,9],[13,12,13,14],[3,2,3,4],[2,7,2,9],[3,7,3,9],[11,8,11,9],[14,7,16,9],[11,3,11,4],[2,2,2,4],[14,12,14,14],[22,3,22,4],[22,13,22,14],[17,7,17,9],[18,7,18,9],[19,7,19,9],[20,7,20,9],[14,2,14,4],[21,7,21,9],[22,6,23,9]]}
[null,{"$f":"IF(HM!E8=\"\",\"Welcher Verein ?\",HM!E8)","v":"SV-Verein 01"}]
[null,null,null,null,null,null,null,null,null,null,null,null,null,null,null,null,{"$f":"IF(C4=\"\",\"\",IF(C7=\"\",\"\",IF(C8=\"\",\"\",IF(C9=\"\",\"\",IF(C10=\"\",\"\",IF(C11=\"\",\"\",1))))))","v":""},{"$f":"IF(H4=\"\",\"\",IF(H7=\"\",\"\",IF(H8=\"\",\"\",IF(H9=\"\",\"\",IF(H10=\"\",\"\",IF(H11=\"\",\"\",1))))))","v":""},{"$f":"IF(M4=\"\",\"\",IF(M7=\"\",\"\",IF(M8=\"\",\"\",IF(M9=\"\",\"\",IF(M10=\"\",\"\",IF(M11=\"\",\"\",1))))))","v":""},null,null,null,null,null,null,"N"]
[null,"Info","König:",null,null,null,null,"Adjutant:",null,null,null,null,"Präsident:",null,null,null,{"$f":"IF(C15=\"\",\"\",IF(C18=\"\",\"\",IF(C19=\"\",\"\",IF(C20=\"\",\"\",IF(C21=\"\",\"\",IF(C22=\"\",\"\",1))))))","v":""},{"$f":"IF(SUM(Q2:S2,Q3,S3)=5,1,0)","v":0},{"$f":"IF(M15=\"\",\"\",IF(M18=\"\",\"\",IF(M19=\"\",\"\",IF(M20=\"\",\"\",IF(M21=\"\",\"\",IF(M22=\"\",\"\",1))))))","v":""},null,null,null,null,null,null,1]
[null,null,null,null,null,null,null,null,null,null,null,null,null,null,null,null,null,null,null,null,null,null,null,null,null,2]
[null,null,null,null,null,null,null,null,null,null,null,null,null,null,null,null,null,null,null,null,null,null,null,null,null,3]
[null,null,"Ringe:","Punkte:","Teiler:",null,null,"Ringe:","Punkte:","Teiler:",null,null,"Ringe:","Punkte:","Teiler:",null,null,null,null,null,null,null,null,null,null,4]
[null,"1.",null,{"$f":"IF(C7=\"n\",10500)+IF(C7=1,9500)+IF(C7=2,8500)+IF(C7=3,7500)+IF(C7=4,6500)+IF(C7=5,5500)+IF(C7=6,4500)+IF(C7=7,3500)+IF(C7=8,2500)+IF(C7=9,1500)","v":0},null,null,"1.",null,{"$f":"IF(H7=\"n\",10500)+IF(H7=1,9500)+IF(H7=2,8500)+IF(H7=3,7500)+IF(H7=4,6500)+IF(H7=5,5500)+IF(H7=6,4500)+IF(H7=7,3500)+IF(H7=8,2500)+IF(H7=9,1500)","v":0},null,null,"1.",null,{"$f":"IF(M7=\"n\",10500)+IF(M7=1,9500)+IF(M7=2,8500)+IF(M7=3,7500)+IF(M7=4,6500)+IF(M7=5,5500)+IF(M7=6,4500)+IF(M7=7,3500)+IF(M7=8,2500)+IF(M7=9,1500)","v":0},null,null,null,null,null,null,null,null,null,null,null,5]
[null,"2.",null,{"$f":"IF(C8=\"n\",10500)+IF(C8=1,9500)+IF(C8=2,8500)+IF(C8=3,7500)+IF(C8=4,6500)+IF(C8=5,5500)+IF(C8=6,4500)+IF(C8=7,3500)+IF(C8=8,2500)+IF(C8=9,1500)","v":0},null,null,"2.",null,{"$f":"IF(H8=\"n\",10500)+IF(H8=1,9500)+IF(H8=2,8500)+IF(H8=3,7500)+IF(H8=4,6500)+IF(H8=5,5500)+IF(H8=6,4500)+IF(H8=7,3500)+IF(H8=8,2500)+IF(H8=9,1500)","v":0},null,null,"2.",null,{"$f":"IF(M8=\"n\",10500)+IF(M8=1,9500)+IF(M8=2,8500)+IF(M8=3,7500)+IF(M8=4,6500)+IF(M8=5,5500)+IF(M8=6,4500)+IF(M8=7,3500)+IF(M8=8,2500)+IF(M8=9,1500)","v":0},null,null,null,null,null,null,null,null,null,null,null,6]
[null,"3.",null,{"$f":"IF(C9=\"n\",10500)+IF(C9=1,9500)+IF(C9=2,8500)+IF(C9=3,7500)+IF(C9=4,6500)+IF(C9=5,5500)+IF(C9=6,4500)+IF(C9=7,3500)+IF(C9=8,2500)+IF(C9=9,1500)","v":0},null,null,"3.",null,{"$f":"IF(H9=\"n\",10500)+IF(H9=1,9500)+IF(H9=2,8500)+IF(H9=3,7500)+IF(H9=4,6500)+IF(H9=5,5500)+IF(H9=6,4500)+IF(H9=7,3500)+IF(H9=8,2500)+IF(H9=9,1500)","v":0},null,null,"3.",null,{"$f":"IF(M9=\"n\",10500)+IF(M9=1,9500)+IF(M9=2,8500)+IF(M9=3,7500)+IF(M9=4,6500)+IF(M9=5,5500)+IF(M9=6,4500)+IF(M9=7,3500)+IF(M9=8,2500)+IF(M9=9,1500)","v":0},null,null,null,null,null,null,null,null,null,null,null,7]
[null,"4.",null,{"$f":"IF(C10=\"n\",10500)+IF(C10=1,9500)+IF(C10=2,8500)+IF(C10=3,7500)+IF(C10=4,6500)+IF(C10=5,5500)+IF(C10=6,4500)+IF(C10=7,3500)+IF(C10=8,2500)+IF(C10=9,1500)","v":0},null,null,"4.",null,{"$f":"IF(H10=\"n\",10500)+IF(H10=1,9500)+IF(H10=2,8500)+IF(H10=3,7500)+IF(H10=4,6500)+IF(H10=5,5500)+IF(H10=6,4500)+IF(H10=7,3500)+IF(H10=8,2500)+IF(H10=9,1500)","v":0},null,null,"4.",null,{"$f":"IF(M10=\"n\",10500)+IF(M10=1,9500)+IF(M10=2,8500)+IF(M10=3,7500)+IF(M10=4,6500)+IF(M10=5,5500)+IF(M10=6,4500)+IF(M10=7,3500)+IF(M10=8,2500)+IF(M10=9,1500)","v":0},null,null,null,null,null,null,null,null,null,null,null,8]
[null,"5.",null,{"$f":"IF(C11=\"n\",10500)+IF(C11=1,9500)+IF(C11=2,8500)+IF(C11=3,7500)+IF(C11=4,6500)+IF(C11=5,5500)+IF(C11=6,4500)+IF(C11=7,3500)+IF(C11=8,2500)+IF(C11=9,1500)","v":0},null,null,"5.",null,{"$f":"IF(H11=\"n\",10500)+IF(H11=1,9500)+IF(H11=2,8500)+IF(H11=3,7500)+IF(H11=4,6500)+IF(H11=5,5500)+IF(H11=6,4500)+IF(H11=7,3500)+IF(H11=8,2500)+IF(H11=9,1500)","v":0},null,null,"5.",null,{"$f":"IF(M11=\"n\",10500)+IF(M11=1,9500)+IF(M11=2,8500)+IF(M11=3,7500)+IF(M11=4,6500)+IF(M11=5,5500)+IF(M11=6,4500)+IF(M11=7,3500)+IF(M11=8,2500)+IF(M11=9,1500)","v":0},null,null,null,null,null,null,null,null,null,null,null,9]
[null,null,"Punkte:",{"$f":"IF(SUM(C7:C11)=\"\",\"\",SUM(D7:E11))","v":0},null,null,null,"Punkte:",{"$f":"IF(SUM(H7:H11)=\"\",\"\",SUM(I7:J11))","v":0},null,null,null,"Punkte:",{"$f":"IF(SUM(M7:M11)=\"\",\"\",SUM(N7:O11))","v":0},null,null,null,null,null,null,null,null,null,null,null,10]
[]
[null,null,"Schütze - 1",null,null,null,null,"gesamt Punkte:",null,null,null,null,"Schütze - 2"]
[null,null,null,null,null,null,null,{"$f":"SUM(D12,I12,N12,D23,N23)","v":0}]
[]
[null,null,"Ringe:","Punkte:","Teiler:",null,null,null,null,null,null,null,"Ringe:","Punkte:","Teiler:"]
[null,"1.",null,{"$f":"IF(C18=\"n\",10500)+IF(C18=1,9500)+IF(C18=2,8500)+IF(C18=3,7500)+IF(C18=4,6500)+IF(C18=5,5500)+IF(C18=6,4500)+IF(C18=7,3500)+IF(C18=8,2500)+IF(C18=9,1500)","v":0},null,null,null,null,null,null,null,"1.",null,{"$f":"IF(M18=\"n\",10500)+IF(M18=1,9500)+IF(M18=2,8500)+IF(M18=3,7500)+IF(M18=4,6500)+IF(M18=5,5500)+IF(M18=6,4500)+IF(M18=7,3500)+IF(M18=8,2500)+IF(M18=9,1500)","v":0}]
[null,"2.",null,{"$f":"IF(C19=\"n\",10500)+IF(C19=1,9500)+IF(C19=2,8500)+IF(C19=3,7500)+IF(C19=4,6500)+IF(C19=5,5500)+IF(C19=6,4500)+IF(C19=7,3500)+IF(C19=8,2500)+IF(C19=9,1500)","v":0},null,null,null,null,null,null,null,"2.",null,{"$f":"IF(M19=\"n\",10500)+IF(M19=1,9500)+IF(M19=2,8500)+IF(M19=3,7500)+IF(M19=4,6500)+IF(M19=5,5500)+IF(M19=6,4500)+IF(M19=7,3500)+IF(M19=8,2500)+IF(M19=9,1500)","v":0}]
[null,"3.",null,{"$f":"IF(C20=\"n\",10500)+IF(C20=1,9500)+IF(C20=2,8500)+IF(C20=3,7500)+IF(C20=4,6500)+IF(C20=5,5500)+IF(C20=6,4500)+IF(C20=7,3500)+IF(C20=8,2500)+IF(C20=9,1500)","v":0},null,null,null,null,null,null,null,"3.",null,{"$f":"IF(M20=\"n\",10500)+IF(M20=1,9500)+IF(M20=2,8500)+IF(M20=3,7500)+IF(M20=4,6500)+IF(M20=5,5500)+IF(M20=6,4500)+IF(M20=7,3500)+IF(M20=8,2500)+IF(M20=9,1500)","v":0}]
[null,"4.",null,{"$f":"IF(C21=\"n\",10500)+IF(C21=1,9500)+IF(C21=2,8500)+IF(C21=3,7500)+IF(C21=4,6500)+IF(C21=5,5500)+IF(C21=6,4500)+IF(C21=7,3500)+IF(C21=8,2500)+IF(C21=9,1500)","v":0},null,null,null,null,null,null,null,"4.",null,{"$f":"IF(M21=\"n\",10500)+IF(M21=1,9500)+IF(M21=2,8500)+IF(M21=3,7500)+IF(M21=4,6500)+IF(M21=5,5500)+IF(M21=6,4500)+IF(M21=7,3500)+IF(M21=8,2500)+IF(M21=9,1500)","v":0}]
[null,"5.",null,{"$f":"IF(C22=\"n\",10500)+IF(C22=1,9500)+IF(C22=2,8500)+IF(C22=3,7500)+IF(C22=4,6500)+IF(C22=5,5500)+IF(C22=6,4500)+IF(C22=7,3500)+IF(C22=8,2500)+IF(C22=9,1500)","v":0},null,null,null,null,null,null,null,"5.",null,{"$f":"IF(M22=\"n\",10500)+IF(M22=1,9500)+IF(M22=2,8500)+IF(M22=3,7500)+IF(M22=4,6500)+IF(M22=5,5500)+IF(M22=6,4500)+IF(M22=7,3500)+IF(M22=8,2500)+IF(M22=9,1500)","v":0}]
[null,null,"Punkte:",{"$f":"IF(SUM(C18:C22)=\"\",\"\",SUM(D18:E22))","v":0},null,null,"* = Ersatzschütze",null,null,null,null,null,"Punkte:",{"$f":"IF(SUM(M18:M22)=\"\",\"\",SUM(N18:O22))","v":0}]

{"sheet":"2","index":2,"n_rows":23,"n_cols":26,"rows_kept":23,"cut":false,"hidden":false,"merged":[[14,12,14,14],[22,3,22,4],[22,13,22,14],[17,7,17,9],[18,7,18,9],[14,7,16,9],[22,6,23,9],[19,7,19,9],[20,7,20,9],[14,2,14,4],[21,7,21,9],[0,1,1,15],[2,12,2,14],[3,12,3,14],[11,13,11,14],[13,2,13,4],[13,7,13,9],[13,12,13,14],[2,7,2,9],[3,7,3,9],[11,8,11,9],[11,3,11,4],[2,2,2,4],[3,2,3,4]]}
[null,{"$f":"IF(HM!E11=\"\",\"Welcher Verein ?\",HM!E11)","v":"SV-Verein 02"}]
[null,null,null,null,null,null,null,null,null,null,null,null,null,null,null,null,{"$f":"IF(C4=\"\",\"\",IF(C7=\"\",\"\",IF(C8=\"\",\"\",IF(C9=\"\",\"\",IF(C10=\"\",\"\",IF(C11=\"\",\"\",1))))))","v":""},{"$f":"IF(H4=\"\",\"\",IF(H7=\"\",\"\",IF(H8=\"\",\"\",IF(H9=\"\",\"\",IF(H10=\"\",\"\",IF(H11=\"\",\"\",1))))))","v":""},{"$f":"IF(M4=\"\",\"\",IF(M7=\"\",\"\",IF(M8=\"\",\"\",IF(M9=\"\",\"\",IF(M10=\"\",\"\",IF(M11=\"\",\"\",1))))))","v":""},null,null,null,null,null,null,"N"]
[null,"Info","König:",null,null,null,null,"Adjutant:",null,null,null,null,"Präsident:",null,null,null,{"$f":"IF(C15=\"\",\"\",IF(C18=\"\",\"\",IF(C19=\"\",\"\",IF(C20=\"\",\"\",IF(C21=\"\",\"\",IF(C22=\"\",\"\",1))))))","v":""},{"$f":"IF(SUM(Q2:S2,Q3,S3)=5,1,0)","v":0},{"$f":"IF(M15=\"\",\"\",IF(M18=\"\",\"\",IF(M19=\"\",\"\",IF(M20=\"\",\"\",IF(M21=\"\",\"\",IF(M22=\"\",\"\",1))))))","v":""},null,null,null,null,null,null,1]
[null,null,null,null,null,null,null,null,null,null,null,null,null,null,null,null,null,null,null,null,null,null,null,null,null,2]
[null,null,null,null,null,null,null,null,null,null,null,null,null,null,null,null,null,null,null,null,null,null,null,null,null,3]
[null,null,"Ringe:","Punkte:","Teiler:",null,null,"Ringe:","Punkte:","Teiler:",null,null,"Ringe:","Punkte:","Teiler:",null,null,null,null,null,null,null,null,null,null,4]
[null,"1.",null,{"$f":"IF(C7=\"n\",10500)+IF(C7=1,9500)+IF(C7=2,8500)+IF(C7=3,7500)+IF(C7=4,6500)+IF(C7=5,5500)+IF(C7=6,4500)+IF(C7=7,3500)+IF(C7=8,2500)+IF(C7=9,1500)","v":0},null,null,"1.",null,{"$f":"IF(H7=\"n\",10500)+IF(H7=1,9500)+IF(H7=2,8500)+IF(H7=3,7500)+IF(H7=4,6500)+IF(H7=5,5500)+IF(H7=6,4500)+IF(H7=7,3500)+IF(H7=8,2500)+IF(H7=9,1500)","v":0},null,null,"1.",null,{"$f":"IF(M7=\"n\",10500)+IF(M7=1,9500)+IF(M7=2,8500)+IF(M7=3,7500)+IF(M7=4,6500)+IF(M7=5,5500)+IF(M7=6,4500)+IF(M7=7,3500)+IF(M7=8,2500)+IF(M7=9,1500)","v":0},null,null,null,null,null,null,null,null,null,null,null,5]
[null,"2.",null,{"$f":"IF(C8=\"n\",10500)+IF(C8=1,9500)+IF(C8=2,8500)+IF(C8=3,7500)+IF(C8=4,6500)+IF(C8=5,5500)+IF(C8=6,4500)+IF(C8=7,3500)+IF(C8=8,2500)+IF(C8=9,1500)","v":0},null,null,"2.",null,{"$f":"IF(H8=\"n\",10500)+IF(H8=1,9500)+IF(H8=2,8500)+IF(H8=3,7500)+IF(H8=4,6500)+IF(H8=5,5500)+IF(H8=6,4500)+IF(H8=7,3500)+IF(H8=8,2500)+IF(H8=9,1500)","v":0},null,null,"2.",null,{"$f":"IF(M8=\"n\",10500)+IF(M8=1,9500)+IF(M8=2,8500)+IF(M8=3,7500)+IF(M8=4,6500)+IF(M8=5,5500)+IF(M8=6,4500)+IF(M8=7,3500)+IF(M8=8,2500)+IF(M8=9,1500)","v":0},null,null,null,null,null,null,null,null,null,null,null,6]
[null,"3.",null,{"$f":"IF(C9=\"n\",10500)+IF(C9=1,9500)+IF(C9=2,8500)+IF(C9=3,7500)+IF(C9=4,6500)+IF(C9=5,5500)+IF(C9=6,4500)+IF(C9=7,3500)+IF(C9=8,2500)+IF(C9=9,1500)","v":0},null,null,"3.",null,{"$f":"IF(H9=\"n\",10500)+IF(H9=1,9500)+IF(H9=2,8500)+IF(H9=3,7500)+IF(H9=4,6500)+IF(H9=5,5500)+IF(H9=6,4500)+IF(H9=7,3500)+IF(H9=8,2500)+IF(H9=9,1500)","v":0},null,null,"3.",null,{"$f":"IF(M9=\"n\",10500)+IF(M9=1,9500)+IF(M9=2,8500)+IF(M9=3,7500)+IF(M9=4,6500)+IF(M9=5,5500)+IF(M9=6,4500)+IF(M9=7,3500)+IF(M9=8,2500)+IF(M9=9,1500)","v":0},null,null,null,null,null,null,null,null,null,null,null,7]
[null,"4.",null,{"$f":"IF(C10=\"n\",10500)+IF(C10=1,9500)+IF(C10=2,8500)+IF(C10=3,7500)+IF(C10=4,6500)+IF(C10=5,5500)+IF(C10=6,4500)+IF(C10=7,3500)+IF(C10=8,2500)+IF(C10=9,1500)","v":0},null,null,"4.",null,{"$f":"IF(H10=\"n\",10500)+IF(H10=1,9500)+IF(H10=2,8500)+IF(H10=3,7500)+IF(H10=4,6500)+IF(H10=5,5500)+IF(H10=6,4500)+IF(H10=7,3500)+IF(H10=8,2500)+IF(H10=9,1500)","v":0},null,null,"4.",null,{"$f":"IF(M10=\"n\",10500)+IF(M10=1,9500)+IF(M10=2,8500)+IF(M10=3,7500)+IF(M10=4,6500)+IF(M10=5,5500)+IF(M10=6,4500)+IF(M10=7,3500)+IF(M10=8,2500)+IF(M10=9,1500)","v":0},null,null,null,null,null,null,null,null,null,null,null,8]
[null,"5.",null,{"$f":"IF(C11=\"n\",10500)+IF(C11=1,9500)+IF(C11=2,8500)+IF(C11=3,7500)+IF(C11=4,6500)+IF(C11=5,5500)+IF(C11=6,4500)+IF(C11=7,3500)+IF(C11=8,2500)+IF(C11=9,1500)","v":0},null,null,"5.",null,{"$f":"IF(H11=\"n\",10500)+IF(H11=1,9500)+IF(H11=2,8500)+IF(H11=3,7500)+IF(H11=4,6500)+IF(H11=5,5500)+IF(H11=6,4500)+IF(H11=7,3500)+IF(H11=8,2500)+IF(H11=9,1500)","v":0},null,null,"5.",null,{"$f":"IF(M11=\"n\",10500)+IF(M11=1,9500)+IF(M11=2,8500)+IF(M11=3,7500)+IF(M11=4,6500)+IF(M11=5,5500)+IF(M11=6,4500)+IF(M11=7,3500)+IF(M11=8,2500)+IF(M11=9,1500)","v":0},null,null,null,null,null,null,null,null,null,null,null,9]
[null,null,"Punkte:",{"$f":"IF(SUM(C7:C11)=\"\",\"\",SUM(D7:E11))","v":0},null,null,null,"Punkte:",{"$f":"IF(SUM(H7:H11)=\"\",\"\",SUM(I7:J11))","v":0},null,null,null,"Punkte:",{"$f":"IF(SUM(M7:M11)=\"\",\"\",SUM(N7:O11))","v":0},null,null,null,null,null,null,null,null,null,null,null,10]
[]
[null,null,"Schütze - 1",null,null,null,null,"gesamt Punkte:",null,null,null,null,"Schütze - 2"]
[null,null,null,null,null,null,null,{"$f":"SUM(D12,I12,N12,D23,N23)","v":0}]
[]
[null,null,"Ringe:","Punkte:","Teiler:",null,null,null,null,null,null,null,"Ringe:","Punkte:","Teiler:"]
[null,"1.",null,{"$f":"IF(C18=\"n\",10500)+IF(C18=1,9500)+IF(C18=2,8500)+IF(C18=3,7500)+IF(C18=4,6500)+IF(C18=5,5500)+IF(C18=6,4500)+IF(C18=7,3500)+IF(C18=8,2500)+IF(C18=9,1500)","v":0},null,null,null,null,null,null,null,"1.",null,{"$f":"IF(M18=\"n\",10500)+IF(M18=1,9500)+IF(M18=2,8500)+IF(M18=3,7500)+IF(M18=4,6500)+IF(M18=5,5500)+IF(M18=6,4500)+IF(M18=7,3500)+IF(M18=8,2500)+IF(M18=9,1500)","v":0}]
[null,"2.",null,{"$f":"IF(C19=\"n\",10500)+IF(C19=1,9500)+IF(C19=2,8500)+IF(C19=3,7500)+IF(C19=4,6500)+IF(C19=5,5500)+IF(C19=6,4500)+IF(C19=7,3500)+IF(C19=8,2500)+IF(C19=9,1500)","v":0},null,null,null,null,null,null,null,"2.",null,{"$f":"IF(M19=\"n\",10500)+IF(M19=1,9500)+IF(M19=2,8500)+IF(M19=3,7500)+IF(M19=4,6500)+IF(M19=5,5500)+IF(M19=6,4500)+IF(M19=7,3500)+IF(M19=8,2500)+IF(M19=9,1500)","v":0}]
[null,"3.",null,{"$f":"IF(C20=\"n\",10500)+IF(C20=1,9500)+IF(C20=2,8500)+IF(C20=3,7500)+IF(C20=4,6500)+IF(C20=5,5500)+IF(C20=6,4500)+IF(C20=7,3500)+IF(C20=8,2500)+IF(C20=9,1500)","v":0},null,null,null,null,null,null,null,"3.",null,{"$f":"IF(M20=\"n\",10500)+IF(M20=1,9500)+IF(M20=2,8500)+IF(M20=3,7500)+IF(M20=4,6500)+IF(M20=5,5500)+IF(M20=6,4500)+IF(M20=7,3500)+IF(M20=8,2500)+IF(M20=9,1500)","v":0}]
[null,"4.",null,{"$f":"IF(C21=\"n\",10500)+IF(C21=1,9500)+IF(C21=2,8500)+IF(C21=3,7500)+IF(C21=4,6500)+IF(C21=5,5500)+IF(C21=6,4500)+IF(C21=7,3500)+IF(C21=8,2500)+IF(C21=9,1500)","v":0},null,null,null,null,null,null,null,"4.",null,{"$f":"IF(M21=\"n\",10500)+IF(M21=1,9500)+IF(M21=2,8500)+IF(M21=3,7500)+IF(M21=4,6500)+IF(M21=5,5500)+IF(M21=6,4500)+IF(M21=7,3500)+IF(M21=8,2500)+IF(M21=9,1500)","v":0}]
[null,"5.",null,{"$f":"IF(C22=\"n\",10500)+IF(C22=1,9500)+IF(C22=2,8500)+IF(C22=3,7500)+IF(C22=4,6500)+IF(C22=5,5500)+IF(C22=6,4500)+IF(C22=7,3500)+IF(C22=8,2500)+IF(C22=9,1500)","v":0},null,null,null,null,null,null,null,"5.",null,{"$f":"IF(M22=\"n\",10500)+IF(M22=1,9500)+IF(M22=2,8500)+IF(M22=3,7500)+IF(M22=4,6500)+IF(M22=5,5500)+IF(M22=6,4500)+IF(M22=7,3500)+IF(M22=8,2500)+IF(M22=9,1500)","v":0}]
[null,null,"Punkte:",{"$f":"IF(SUM(C18:C22)=\"\",\"\",SUM(D18:E22))","v":0},null,null,"* = Ersatzschütze",null,null,null,null,null,"Punkte:",{"$f":"IF(SUM(M18:M22)=\"\",\"\",SUM(N18:O22))","v":0}]

{"sheet":"3","index":3,"n_rows":23,"n_cols":26,"rows_kept":23,"cut":false,"hidden":false,"merged":[[0,1,1,15],[2,12,2,14],[3,12,3,14],[11,13,11,14],[13,2,13,4],[13,7,13,9],[13,12,13,14],[3,2,3,4],[2,7,2,9],[3,7,3,9],[11,8,11,9],[14,7,16,9],[11,3,11,4],[2,2,2,4],[14,12,14,14],[22,3,22,4],[22,13,22,14],[17,7,17,9],[18,7,18,9],[19,7,19,9],[20,7,20,9],[14,2,14,4],[21,7,21,9],[22,6,23,9]]}
[null,{"$f":"IF(HM!E14=\"\",\"Welcher Verein ?\",HM!E14)","v":"SV-Verein 03"}]
[null,null,null,null,null,null,null,null,null,null,null,null,null,null,null,null,{"$f":"IF(C4=\"\",\"\",IF(C7=\"\",\"\",IF(C8=\"\",\"\",IF(C9=\"\",\"\",IF(C10=\"\",\"\",IF(C11=\"\",\"\",1))))))","v":""},{"$f":"IF(H4=\"\",\"\",IF(H7=\"\",\"\",IF(H8=\"\",\"\",IF(H9=\"\",\"\",IF(H10=\"\",\"\",IF(H11=\"\",\"\",1))))))","v":""},{"$f":"IF(M4=\"\",\"\",IF(M7=\"\",\"\",IF(M8=\"\",\"\",IF(M9=\"\",\"\",IF(M10=\"\",\"\",IF(M11=\"\",\"\",1))))))","v":""},null,null,null,null,null,null,"N"]
[null,"Info","König:",null,null,null,null,"Adjutant:",null,null,null,null,"Präsident:",null,null,null,{"$f":"IF(C15=\"\",\"\",IF(C18=\"\",\"\",IF(C19=\"\",\"\",IF(C20=\"\",\"\",IF(C21=\"\",\"\",IF(C22=\"\",\"\",1))))))","v":""},{"$f":"IF(SUM(Q2:S2,Q3,S3)=5,1,0)","v":0},{"$f":"IF(M15=\"\",\"\",IF(M18=\"\",\"\",IF(M19=\"\",\"\",IF(M20=\"\",\"\",IF(M21=\"\",\"\",IF(M22=\"\",\"\",1))))))","v":""},null,null,null,null,null,null,1]
[null,null,null,null,null,null,null,null,null,null,null,null,null,null,null,null,null,null,null,null,null,null,null,null,null,2]
[null,null,null,null,null,null,null,null,null,null,null,null,null,null,null,null,null,null,null,null,null,null,null,null,null,3]
[null,null,"Ringe:","Punkte:","Teiler:",null,null,"Ringe:","Punkte:","Teiler:",null,null,"Ringe:","Punkte:","Teiler:",null,null,null,null,null,null,null,null,null,null,4]
[null,"1.",null,{"$f":"IF(C7=\"n\",10500)+IF(C7=1,9500)+IF(C7=2,8500)+IF(C7=3,7500)+IF(C7=4,6500)+IF(C7=5,5500)+IF(C7=6,4500)+IF(C7=7,3500)+IF(C7=8,2500)+IF(C7=9,1500)","v":0},null,null,"1.",null,{"$f":"IF(H7=\"n\",10500)+IF(H7=1,9500)+IF(H7=2,8500)+IF(H7=3,7500)+IF(H7=4,6500)+IF(H7=5,5500)+IF(H7=6,4500)+IF(H7=7,3500)+IF(H7=8,2500)+IF(H7=9,1500)","v":0},null,null,"1.",null,{"$f":"IF(M7=\"n\",10500)+IF(M7=1,9500)+IF(M7=2,8500)+IF(M7=3,7500)+IF(M7=4,6500)+IF(M7=5,5500)+IF(M7=6,4500)+IF(M7=7,3500)+IF(M7=8,2500)+IF(M7=9,1500)","v":0},null,null,null,null,null,null,null,null,null,null,null,5]
[null,"2.",null,{"$f":"IF(C8=\"n\",10500)+IF(C8=1,9500)+IF(C8=2,8500)+IF(C8=3,7500)+IF(C8=4,6500)+IF(C8=5,5500)+IF(C8=6,4500)+IF(C8=7,3500)+IF(C8=8,2500)+IF(C8=9,1500)","v":0},null,null,"2.",null,{"$f":"IF(H8=\"n\",10500)+IF(H8=1,9500)+IF(H8=2,8500)+IF(H8=3,7500)+IF(H8=4,6500)+IF(H8=5,5500)+IF(H8=6,4500)+IF(H8=7,3500)+IF(H8=8,2500)+IF(H8=9,1500)","v":0},null,null,"2.",null,{"$f":"IF(M8=\"n\",10500)+IF(M8=1,9500)+IF(M8=2,8500)+IF(M8=3,7500)+IF(M8=4,6500)+IF(M8=5,5500)+IF(M8=6,4500)+IF(M8=7,3500)+IF(M8=8,2500)+IF(M8=9,1500)","v":0},null,null,null,null,null,null,null,null,null,null,null,6]
[null,"3.",null,{"$f":"IF(C9=\"n\",10500)+IF(C9=1,9500)+IF(C9=2,8500)+IF(C9=3,7500)+IF(C9=4,6500)+IF(C9=5,5500)+IF(C9=6,4500)+IF(C9=7,3500)+IF(C9=8,2500)+IF(C9=9,1500)","v":0},null,null,"3.",null,{"$f":"IF(H9=\"n\",10500)+IF(H9=1,9500)+IF(H9=2,8500)+IF(H9=3,7500)+IF(H9=4,6500)+IF(H9=5,5500)+IF(H9=6,4500)+IF(H9=7,3500)+IF(H9=8,2500)+IF(H9=9,1500)","v":0},null,null,"3.",null,{"$f":"IF(M9=\"n\",10500)+IF(M9=1,9500)+IF(M9=2,8500)+IF(M9=3,7500)+IF(M9=4,6500)+IF(M9=5,5500)+IF(M9=6,4500)+IF(M9=7,3500)+IF(M9=8,2500)+IF(M9=9,1500)","v":0},null,null,null,null,null,null,null,null,null,null,null,7]
[null,"4.",null,{"$f":"IF(C10=\"n\",10500)+IF(C10=1,9500)+IF(C10=2,8500)+IF(C10=3,7500)+IF(C10=4,6500)+IF(C10=5,5500)+IF(C10=6,4500)+IF(C10=7,3500)+IF(C10=8,2500)+IF(C10=9,1500)","v":0},null,null,"4.",null,{"$f":"IF(H10=\"n\",10500)+IF(H10=1,9500)+IF(H10=2,8500)+IF(H10=3,7500)+IF(H10=4,6500)+IF(H10=5,5500)+IF(H10=6,4500)+IF(H10=7,3500)+IF(H10=8,2500)+IF(H10=9,1500)","v":0},null,null,"4.",null,{"$f":"IF(M10=\"n\",10500)+IF(M10=1,9500)+IF(M10=2,8500)+IF(M10=3,7500)+IF(M10=4,6500)+IF(M10=5,5500)+IF(M10=6,4500)+IF(M10=7,3500)+IF(M10=8,2500)+IF(M10=9,1500)","v":0},null,null,null,null,null,null,null,null,null,null,null,8]
[null,"5.",null,{"$f":"IF(C11=\"n\",10500)+IF(C11=1,9500)+IF(C11=2,8500)+IF(C11=3,7500)+IF(C11=4,6500)+IF(C11=5,5500)+IF(C11=6,4500)+IF(C11=7,3500)+IF(C11=8,2500)+IF(C11=9,1500)","v":0},null,null,"5.",null,{"$f":"IF(H11=\"n\",10500)+IF(H11=1,9500)+IF(H11=2,8500)+IF(H11=3,7500)+IF(H11=4,6500)+IF(H11=5,5500)+IF(H11=6,4500)+IF(H11=7,3500)+IF(H11=8,2500)+IF(H11=9,1500)","v":0},null,null,"5.",null,{"$f":"IF(M11=\"n\",10500)+IF(M11=1,9500)+IF(M11=2,8500)+IF(M11=3,7500)+IF(M11=4,6500)+IF(M11=5,5500)+IF(M11=6,4500)+IF(M11=7,3500)+IF(M11=8,2500)+IF(M11=9,1500)","v":0},null,null,null,null,null,null,null,null,null,null,null,9]
[null,null,"Punkte:",{"$f":"IF(SUM(C7:C11)=\"\",\"\",SUM(D7:E11))","v":0},null,null,null,"Punkte:",{"$f":"IF(SUM(H7:H11)=\"\",\"\",SUM(I7:J11))","v":0},null,null,null,"Punkte:",{"$f":"IF(SUM(M7:M11)=\"\",\"\",SUM(N7:O11))","v":0},null,null,null,null,null,null,null,null,null,null,null,10]
[]
[null,null,"Schütze - 1",null,null,null,null,"gesamt Punkte:",null,null,null,null,"Schütze - 2"]
[null,null,null,null,null,null,null,{"$f":"SUM(D12,I12,N12,D23,N23)","v":0}]
[]
[null,null,"Ringe:","Punkte:","Teiler:",null,null,null,null,null,null,null,"Ringe:","Punkte:","Teiler:"]
[null,"1.",null,{"$f":"IF(C18=\"n\",10500)+IF(C18=1,9500)+IF(C18=2,8500)+IF(C18=3,7500)+IF(C18=4,6500)+IF(C18=5,5500)+IF(C18=6,4500)+IF(C18=7,3500)+IF(C18=8,2500)+IF(C18=9,1500)","v":0},null,null,null,null,null,null,null,"1.",null,{"$f":"IF(M18=\"n\",10500)+IF(M18=1,9500)+IF(M18=2,8500)+IF(M18=3,7500)+IF(M18=4,6500)+IF(M18=5,5500)+IF(M18=6,4500)+IF(M18=7,3500)+IF(M18=8,2500)+IF(M18=9,1500)","v":0}]
[null,"2.",null,{"$f":"IF(C19=\"n\",10500)+IF(C19=1,9500)+IF(C19=2,8500)+IF(C19=3,7500)+IF(C19=4,6500)+IF(C19=5,5500)+IF(C19=6,4500)+IF(C19=7,3500)+IF(C19=8,2500)+IF(C19=9,1500)","v":0},null,null,null,null,null,null,null,"2.",null,{"$f":"IF(M19=\"n\",10500)+IF(M19=1,9500)+IF(M19=2,8500)+IF(M19=3,7500)+IF(M19=4,6500)+IF(M19=5,5500)+IF(M19=6,4500)+IF(M19=7,3500)+IF(M19=8,2500)+IF(M19=9,1500)","v":0}]
[null,"3.",null,{"$f":"IF(C20=\"n\",10500)+IF(C20=1,9500)+IF(C20=2,8500)+IF(C20=3,7500)+IF(C20=4,6500)+IF(C20=5,5500)+IF(C20=6,4500)+IF(C20=7,3500)+IF(C20=8,2500)+IF(C20=9,1500)","v":0},null,null,null,null,null,null,null,"3.",null,{"$f":"IF(M20=\"n\",10500)+IF(M20=1,9500)+IF(M20=2,8500)+IF(M20=3,7500)+IF(M20=4,6500)+IF(M20=5,5500)+IF(M20=6,4500)+IF(M20=7,3500)+IF(M20=8,2500)+IF(M20=9,1500)","v":0}]
[null,"4.",null,{"$f":"IF(C21=\"n\",10500)+IF(C21=1,9500)+IF(C21=2,8500)+IF(C21=3,7500)+IF(C21=4,6500)+IF(C21=5,5500)+IF(C21=6,4500)+IF(C21=7,3500)+IF(C21=8,2500)+IF(C21=9,1500)","v":0},null,null,null,null,null,null,null,"4.",null,{"$f":"IF(M21=\"n\",10500)+IF(M21=1,9500)+IF(M21=2,8500)+IF(M21=3,7500)+IF(M21=4,6500)+IF(M21=5,5500)+IF(M21=6,4500)+IF(M21=7,3500)+IF(M21=8,2500)+IF(M21=9,1500)","v":0}]
[null,"5.",null,{"$f":"IF(C22=\"n\",10500)+IF(C22=1,9500)+IF(C22=2,8500)+IF(C22=3,7500)+IF(C22=4,6500)+IF(C22=5,5500)+IF(C22=6,4500)+IF(C22=7,3500)+IF(C22=8,2500)+IF(C22=9,1500)","v":0},null,null,null,null,null,null,null,"5.",null,{"$f":"IF(M22=\"n\",10500)+IF(M22=1,9500)+IF(M22=2,8500)+IF(M22=3,7500)+IF(M22=4,6500)+IF(M22=5,5500)+IF(M22=6,4500)+IF(M22=7,3500)+IF(M22=8,2500)+IF(M22=9,1500)","v":0}]
[null,null,"Punkte:",{"$f":"IF(SUM(C18:C22)=\"\",\"\",SUM(D18:E22))","v":0},null,null,"* = Ersatzschütze",null,null,null,null,null,"Punkte:",{"$f":"IF(SUM(M18:M22)=\"\",\"\",SUM(N18:O22))","v":0}]

{"sheet":"4","index":4,"n_rows":23,"n_cols":26,"rows_kept":23,"cut":false,"hidden":false,"merged":[[14,12,14,14],[22,3,22,4],[22,13,22,14],[17,7,17,9],[18,7,18,9],[14,7,16,9],[22,6,23,9],[19,7,19,9],[20,7,20,9],[14,2,14,4],[21,7,21,9],[0,1,1,15],[2,12,2,14],[3,12,3,14],[11,13,11,14],[13,2,13,4],[13,7,13,9],[13,12,13,14],[2,7,2,9],[3,7,3,9],[11,8,11,9],[11,3,11,4],[2,2,2,4],[3,2,3,4]]}
[null,{"$f":"IF(HM!E17=\"\",\"Welcher Verein ?\",HM!E17)","v":"SV-Verein 04"}]
[null,null,null,null,null,null,null,null,null,null,null,null,null,null,null,null,{"$f":"IF(C4=\"\",\"\",IF(C7=\"\",\"\",IF(C8=\"\",\"\",IF(C9=\"\",\"\",IF(C10=\"\",\"\",IF(C11=\"\",\"\",1))))))","v":""},{"$f":"IF(H4=\"\",\"\",IF(H7=\"\",\"\",IF(H8=\"\",\"\",IF(H9=\"\",\"\",IF(H10=\"\",\"\",IF(H11=\"\",\"\",1))))))","v":""},{"$f":"IF(M4=\"\",\"\",IF(M7=\"\",\"\",IF(M8=\"\",\"\",IF(M9=\"\",\"\",IF(M10=\"\",\"\",IF(M11=\"\",\"\",1))))))","v":""},null,null,null,null,null,null,"N"]
[null,"Info","König:",null,null,null,null,"Adjutant:",null,null,null,null,"Präsident:",null,null,null,{"$f":"IF(C15=\"\",\"\",IF(C18=\"\",\"\",IF(C19=\"\",\"\",IF(C20=\"\",\"\",IF(C21=\"\",\"\",IF(C22=\"\",\"\",1))))))","v":""},{"$f":"IF(SUM(Q2:S2,Q3,S3)=5,1,0)","v":0},{"$f":"IF(M15=\"\",\"\",IF(M18=\"\",\"\",IF(M19=\"\",\"\",IF(M20=\"\",\"\",IF(M21=\"\",\"\",IF(M22=\"\",\"\",1))))))","v":""},null,null,null,null,null,null,1]
[null,null,null,null,null,null,null,null,null,null,null,null,null,null,null,null,null,null,null,null,null,null,null,null,null,2]
[null,null,null,null,null,null,null,null,null,null,null,null,null,null,null,null,null,null,null,null,null,null,null,null,null,3]
[null,null,"Ringe:","Punkte:","Teiler:",null,null,"Ringe:","Punkte:","Teiler:",null,null,"Ringe:","Punkte:","Teiler:",null,null,null,null,null,null,null,null,null,null,4]
[null,"1.",null,{"$f":"IF(C7=\"n\",10500)+IF(C7=1,9500)+IF(C7=2,8500)+IF(C7=3,7500)+IF(C7=4,6500)+IF(C7=5,5500)+IF(C7=6,4500)+IF(C7=7,3500)+IF(C7=8,2500)+IF(C7=9,1500)","v":0},null,null,"1.",null,{"$f":"IF(H7=\"n\",10500)+IF(H7=1,9500)+IF(H7=2,8500)+IF(H7=3,7500)+IF(H7=4,6500)+IF(H7=5,5500)+IF(H7=6,4500)+IF(H7=7,3500)+IF(H7=8,2500)+IF(H7=9,1500)","v":0},null,null,"1.",null,{"$f":"IF(M7=\"n\",10500)+IF(M7=1,9500)+IF(M7=2,8500)+IF(M7=3,7500)+IF(M7=4,6500)+IF(M7=5,5500)+IF(M7=6,4500)+IF(M7=7,3500)+IF(M7=8,2500)+IF(M7=9,1500)","v":0},null,null,null,null,null,null,null,null,null,null,null,5]
[null,"2.",null,{"$f":"IF(C8=\"n\",10500)+IF(C8=1,9500)+IF(C8=2,8500)+IF(C8=3,7500)+IF(C8=4,6500)+IF(C8=5,5500)+IF(C8=6,4500)+IF(C8=7,3500)+IF(C8=8,2500)+IF(C8=9,1500)","v":0},null,null,"2.",null,{"$f":"IF(H8=\"n\",10500)+IF(H8=1,9500)+IF(H8=2,8500)+IF(H8=3,7500)+IF(H8=4,6500)+IF(H8=5,5500)+IF(H8=6,4500)+IF(H8=7,3500)+IF(H8=8,2500)+IF(H8=9,1500)","v":0},null,null,"2.",null,{"$f":"IF(M8=\"n\",10500)+IF(M8=1,9500)+IF(M8=2,8500)+IF(M8=3,7500)+IF(M8=4,6500)+IF(M8=5,5500)+IF(M8=6,4500)+IF(M8=7,3500)+IF(M8=8,2500)+IF(M8=9,1500)","v":0},null,null,null,null,null,null,null,null,null,null,null,6]
[null,"3.",null,{"$f":"IF(C9=\"n\",10500)+IF(C9=1,9500)+IF(C9=2,8500)+IF(C9=3,7500)+IF(C9=4,6500)+IF(C9=5,5500)+IF(C9=6,4500)+IF(C9=7,3500)+IF(C9=8,2500)+IF(C9=9,1500)","v":0},null,null,"3.",null,{"$f":"IF(H9=\"n\",10500)+IF(H9=1,9500)+IF(H9=2,8500)+IF(H9=3,7500)+IF(H9=4,6500)+IF(H9=5,5500)+IF(H9=6,4500)+IF(H9=7,3500)+IF(H9=8,2500)+IF(H9=9,1500)","v":0},null,null,"3.",null,{"$f":"IF(M9=\"n\",10500)+IF(M9=1,9500)+IF(M9=2,8500)+IF(M9=3,7500)+IF(M9=4,6500)+IF(M9=5,5500)+IF(M9=6,4500)+IF(M9=7,3500)+IF(M9=8,2500)+IF(M9=9,1500)","v":0},null,null,null,null,null,null,null,null,null,null,null,7]
[null,"4.",null,{"$f":"IF(C10=\"n\",10500)+IF(C10=1,9500)+IF(C10=2,8500)+IF(C10=3,7500)+IF(C10=4,6500)+IF(C10=5,5500)+IF(C10=6,4500)+IF(C10=7,3500)+IF(C10=8,2500)+IF(C10=9,1500)","v":0},null,null,"4.",null,{"$f":"IF(H10=\"n\",10500)+IF(H10=1,9500)+IF(H10=2,8500)+IF(H10=3,7500)+IF(H10=4,6500)+IF(H10=5,5500)+IF(H10=6,4500)+IF(H10=7,3500)+IF(H10=8,2500)+IF(H10=9,1500)","v":0},null,null,"4.",null,{"$f":"IF(M10=\"n\",10500)+IF(M10=1,9500)+IF(M10=2,8500)+IF(M10=3,7500)+IF(M10=4,6500)+IF(M10=5,5500)+IF(M10=6,4500)+IF(M10=7,3500)+IF(M10=8,2500)+IF(M10=9,1500)","v":0},null,null,null,null,null,null,null,null,null,null,null,8]
[null,"5.",null,{"$f":"IF(C11=\"n\",10500)+IF(C11=1,9500)+IF(C11=2,8500)+IF(C11=3,7500)+IF(C11=4,6500)+IF(C11=5,5500)+IF(C11=6,4500)+IF(C11=7,3500)+IF(C11=8,2500)+IF(C11=9,1500)","v":0},null,null,"5.",null,{"$f":"IF(H11=\"n\",10500)+IF(H11=1,9500)+IF(H11=2,8500)+IF(H11=3,7500)+IF(H11=4,6500)+IF(H11=5,5500)+IF(H11=6,4500)+IF(H11=7,3500)+IF(H11=8,2500)+IF(H11=9,1500)","v":0},null,null,"5.",null,{"$f":"IF(M11=\"n\",10500)+IF(M11=1,9500)+IF(M11=2,8500)+IF(M11=3,7500)+IF(M11=4,6500)+IF(M11=5,5500)+IF(M11=6,4500)+IF(M11=7,3500)+IF(M11=8,2500)+IF(M11=9,1500)","v":0},null,null,null,null,null,null,null,null,null,null,null,9]
[null,null,"Punkte:",{"$f":"IF(SUM(C7:C11)=\"\",\"\",SUM(D7:E11))","v":0},null,null,null,"Punkte:",{"$f":"IF(SUM(H7:H11)=\"\",\"\",SUM(I7:J11))","v":0},null,null,null,"Punkte:",{"$f":"IF(SUM(M7:M11)=\"\",\"\",SUM(N7:O11))","v":0},null,null,null,null,null,null,null,null,null,null,null,10]
[]
[null,null,"Schütze - 1",null,null,null,null,"gesamt Punkte:",null,null,null,null,"Schütze - 2"]
[null,null,null,null,null,null,null,{"$f":"SUM(D12,I12,N12,D23,N23)","v":0}]
[]
[null,null,"Ringe:","Punkte:","Teiler:",null,null,null,null,null,null,null,"Ringe:","Punkte:","Teiler:"]
[null,"1.",null,{"$f":"IF(C18=\"n\",10500)+IF(C18=1,9500)+IF(C18=2,8500)+IF(C18=3,7500)+IF(C18=4,6500)+IF(C18=5,5500)+IF(C18=6,4500)+IF(C18=7,3500)+IF(C18=8,2500)+IF(C18=9,1500)","v":0},null,null,null,null,null,null,null,"1.",null,{"$f":"IF(M18=\"n\",10500)+IF(M18=1,9500)+IF(M18=2,8500)+IF(M18=3,7500)+IF(M18=4,6500)+IF(M18=5,5500)+IF(M18=6,4500)+IF(M18=7,3500)+IF(M18=8,2500)+IF(M18=9,1500)","v":0}]
[null,"2.",null,{"$f":"IF(C19=\"n\",10500)+IF(C19=1,9500)+IF(C19=2,8500)+IF(C19=3,7500)+IF(C19=4,6500)+IF(C19=5,5500)+IF(C19=6,4500)+IF(C19=7,3500)+IF(C19=8,2500)+IF(C19=9,1500)","v":0},null,null,null,null,null,null,null,"2.",null,{"$f":"IF(M19=\"n\",10500)+IF(M19=1,9500)+IF(M19=2,8500)+IF(M19=3,7500)+IF(M19=4,6500)+IF(M19=5,5500)+IF(M19=6,4500)+IF(M19=7,3500)+IF(M19=8,2500)+IF(M19=9,1500)","v":0}]
[null,"3.",null,{"$f":"IF(C20=\"n\",10500)+IF(C20=1,9500)+IF(C20=2,8500)+IF(C20=3,7500)+IF(C20=4,6500)+IF(C20=5,5500)+IF(C20=6,4500)+IF(C20=7,3500)+IF(C20=8,2500)+IF(C20=9,1500)","v":0},null,null,null,null,null,null,null,"3.",null,{"$f":"IF(M20=\"n\",10500)+IF(M20=1,9500)+IF(M20=2,8500)+IF(M20=3,7500)+IF(M20=4,6500)+IF(M20=5,5500)+IF(M20=6,4500)+IF(M20=7,3500)+IF(M20=8,2500)+IF(M20=9,1500)","v":0}]
[null,"4.",null,{"$f":"IF(C21=\"n\",10500)+IF(C21=1,9500)+IF(C21=2,8500)+IF(C21=3,7500)+IF(C21=4,6500)+IF(C21=5,5500)+IF(C21=6,4500)+IF(C21=7,3500)+IF(C21=8,2500)+IF(C21=9,1500)","v":0},null,null,null,null,null,null,null,"4.",null,{"$f":"IF(M21=\"n\",10500)+IF(M21=1,9500)+IF(M21=2,8500)+IF(M21=3,7500)+IF(M21=4,6500)+IF(M21=5,5500)+IF(M21=6,4500)+IF(M21=7,3500)+IF(M21=8,2500)+IF(M21=9,1500)","v":0}]
[null,"5.",null,{"$f":"IF(C22=\"n\",10500)+IF(C22=1,9500)+IF(C22=2,8500)+IF(C22=3,7500)+IF(C22=4,6500)+IF(C22=5,5500)+IF(C22=6,4500)+IF(C22=7,3500)+IF(C22=8,2500)+IF(C22=9,1500)","v":0},null,null,null,null,null,null,null,"5.",null,{"$f":"IF(M22=\"n\",10500)+IF(M22=1,9500)+IF(M22=2,8500)+IF(M22=3,7500)+IF(M22=4,6500)+IF(M22=5,5500)+IF(M22=6,4500)+IF(M22=7,3500)+IF(M22=8,2500)+IF(M22=9,1500)","v":0}]
[null,null,"Punkte:",{"$f":"IF(SUM(C18:C22)=\"\",\"\",SUM(D18:E22))","v":0},null,null,"* = Ersatzschütze",null,null,null,null,null,"Punkte:",{"$f":"IF(SUM(M18:M22)=\"\",\"\",SUM(N18:O22))","v":0}]

{"sheet":"5","index":5,"n_rows":23,"n_cols":26,"rows_kept":23,"cut":false,"hidden":false,"merged":[[0,1,1,15],[2,12,2,14],[3,12,3,14],[11,13,11,14],[13,2,13,4],[13,7,13,9],[13,12,13,14],[3,2,3,4],[2,7,2,9],[3,7,3,9],[11,8,11,9],[14,7,16,9],[11,3,11,4],[2,2,2,4],[14,12,14,14],[22,3,22,4],[22,13,22,14],[17,7,17,9],[18,7,18,9],[19,7,19,9],[20,7,20,9],[14,2,14,4],[21,7,21,9],[22,6,23,9]]}
[null,{"$f":"IF(HM!E20=\"\",\"Welcher Verein ?\",HM!E20)","v":"SV-Verein 05"}]
[null,null,null,null,null,null,null,null,null,null,null,null,null,null,null,null,{"$f":"IF(C4=\"\",\"\",IF(C7=\"\",\"\",IF(C8=\"\",\"\",IF(C9=\"\",\"\",IF(C10=\"\",\"\",IF(C11=\"\",\"\",1))))))","v":""},{"$f":"IF(H4=\"\",\"\",IF(H7=\"\",\"\",IF(H8=\"\",\"\",IF(H9=\"\",\"\",IF(H10=\"\",\"\",IF(H11=\"\",\"\",1))))))","v":""},{"$f":"IF(M4=\"\",\"\",IF(M7=\"\",\"\",IF(M8=\"\",\"\",IF(M9=\"\",\"\",IF(M10=\"\",\"\",IF(M11=\"\",\"\",1))))))","v":""},null,null,null,null,null,null,"N"]
[null,"Info","König:",null,null,null,null,"Adjutant:",null,null,null,null,"Präsident:",null,null,null,{"$f":"IF(C15=\"\",\"\",IF(C18=\"\",\"\",IF(C19=\"\",\"\",IF(C20=\"\",\"\",IF(C21=\"\",\"\",IF(C22=\"\",\"\",1))))))","v":""},{"$f":"IF(SUM(Q2:S2,Q3,S3)=5,1,0)","v":0},{"$f":"IF(M15=\"\",\"\",IF(M18=\"\",\"\",IF(M19=\"\",\"\",IF(M20=\"\",\"\",IF(M21=\"\",\"\",IF(M22=\"\",\"\",1))))))","v":""},null,null,null,null,null,null,1]
[null,null,null,null,null,null,null,null,null,null,null,null,null,null,null,null,null,null,null,null,null,null,null,null,null,2]
[null,null,null,null,null,null,null,null,null,null,null,null,null,null,null,null,null,null,null,null,null,null,null,null,null,3]
[null,null,"Ringe:","Punkte:","Teiler:",null,null,"Ringe:","Punkte:","Teiler:",null,null,"Ringe:","Punkte:","Teiler:",null,null,null,null,null,null,null,null,null,null,4]
[null,"1.",null,{"$f":"IF(C7=\"n\",10500)+IF(C7=1,9500)+IF(C7=2,8500)+IF(C7=3,7500)+IF(C7=4,6500)+IF(C7=5,5500)+IF(C7=6,4500)+IF(C7=7,3500)+IF(C7=8,2500)+IF(C7=9,1500)","v":0},null,null,"1.",null,{"$f":"IF(H7=\"n\",10500)+IF(H7=1,9500)+IF(H7=2,8500)+IF(H7=3,7500)+IF(H7=4,6500)+IF(H7=5,5500)+IF(H7=6,4500)+IF(H7=7,3500)+IF(H7=8,2500)+IF(H7=9,1500)","v":0},null,null,"1.",null,{"$f":"IF(M7=\"n\",10500)+IF(M7=1,9500)+IF(M7=2,8500)+IF(M7=3,7500)+IF(M7=4,6500)+IF(M7=5,5500)+IF(M7=6,4500)+IF(M7=7,3500)+IF(M7=8,2500)+IF(M7=9,1500)","v":0},null,null,null,null,null,null,null,null,null,null,null,5]
[null,"2.",null,{"$f":"IF(C8=\"n\",10500)+IF(C8=1,9500)+IF(C8=2,8500)+IF(C8=3,7500)+IF(C8=4,6500)+IF(C8=5,5500)+IF(C8=6,4500)+IF(C8=7,3500)+IF(C8=8,2500)+IF(C8=9,1500)","v":0},null,null,"2.",null,{"$f":"IF(H8=\"n\",10500)+IF(H8=1,9500)+IF(H8=2,8500)+IF(H8=3,7500)+IF(H8=4,6500)+IF(H8=5,5500)+IF(H8=6,4500)+IF(H8=7,3500)+IF(H8=8,2500)+IF(H8=9,1500)","v":0},null,null,"2.",null,{"$f":"IF(M8=\"n\",10500)+IF(M8=1,9500)+IF(M8=2,8500)+IF(M8=3,7500)+IF(M8=4,6500)+IF(M8=5,5500)+IF(M8=6,4500)+IF(M8=7,3500)+IF(M8=8,2500)+IF(M8=9,1500)","v":0},null,null,null,null,null,null,null,null,null,null,null,6]
[null,"3.",null,{"$f":"IF(C9=\"n\",10500)+IF(C9=1,9500)+IF(C9=2,8500)+IF(C9=3,7500)+IF(C9=4,6500)+IF(C9=5,5500)+IF(C9=6,4500)+IF(C9=7,3500)+IF(C9=8,2500)+IF(C9=9,1500)","v":0},null,null,"3.",null,{"$f":"IF(H9=\"n\",10500)+IF(H9=1,9500)+IF(H9=2,8500)+IF(H9=3,7500)+IF(H9=4,6500)+IF(H9=5,5500)+IF(H9=6,4500)+IF(H9=7,3500)+IF(H9=8,2500)+IF(H9=9,1500)","v":0},null,null,"3.",null,{"$f":"IF(M9=\"n\",10500)+IF(M9=1,9500)+IF(M9=2,8500)+IF(M9=3,7500)+IF(M9=4,6500)+IF(M9=5,5500)+IF(M9=6,4500)+IF(M9=7,3500)+IF(M9=8,2500)+IF(M9=9,1500)","v":0},null,null,null,null,null,null,null,null,null,null,null,7]
[null,"4.",null,{"$f":"IF(C10=\"n\",10500)+IF(C10=1,9500)+IF(C10=2,8500)+IF(C10=3,7500)+IF(C10=4,6500)+IF(C10=5,5500)+IF(C10=6,4500)+IF(C10=7,3500)+IF(C10=8,2500)+IF(C10=9,1500)","v":0},null,null,"4.",null,{"$f":"IF(H10=\"n\",10500)+IF(H10=1,9500)+IF(H10=2,8500)+IF(H10=3,7500)+IF(H10=4,6500)+IF(H10=5,5500)+IF(H10=6,4500)+IF(H10=7,3500)+IF(H10=8,2500)+IF(H10=9,1500)","v":0},null,null,"4.",null,{"$f":"IF(M10=\"n\",10500)+IF(M10=1,9500)+IF(M10=2,8500)+IF(M10=3,7500)+IF(M10=4,6500)+IF(M10=5,5500)+IF(M10=6,4500)+IF(M10=7,3500)+IF(M10=8,2500)+IF(M10=9,1500)","v":0},null,null,null,null,null,null,null,null,null,null,null,8]
[null,"5.",null,{"$f":"IF(C11=\"n\",10500)+IF(C11=1,9500)+IF(C11=2,8500)+IF(C11=3,7500)+IF(C11=4,6500)+IF(C11=5,5500)+IF(C11=6,4500)+IF(C11=7,3500)+IF(C11=8,2500)+IF(C11=9,1500)","v":0},null,null,"5.",null,{"$f":"IF(H11=\"n\",10500)+IF(H11=1,9500)+IF(H11=2,8500)+IF(H11=3,7500)+IF(H11=4,6500)+IF(H11=5,5500)+IF(H11=6,4500)+IF(H11=7,3500)+IF(H11=8,2500)+IF(H11=9,1500)","v":0},null,null,"5.",null,{"$f":"IF(M11=\"n\",10500)+IF(M11=1,9500)+IF(M11=2,8500)+IF(M11=3,7500)+IF(M11=4,6500)+IF(M11=5,5500)+IF(M11=6,4500)+IF(M11=7,3500)+IF(M11=8,2500)+IF(M11=9,1500)","v":0},null,null,null,null,null,null,null,null,null,null,null,9]
[null,null,"Punkte:",{"$f":"IF(SUM(C7:C11)=\"\",\"\",SUM(D7:E11))","v":0},null,null,null,"Punkte:",{"$f":"IF(SUM(H7:H11)=\"\",\"\",SUM(I7:J11))","v":0},null,null,null,"Punkte:",{"$f":"IF(SUM(M7:M11)=\"\",\"\",SUM(N7:O11))","v":0},null,null,null,null,null,null,null,null,null,null,null,10]
[]
[null,null,"Schütze - 1",null,null,null,null,"gesamt Punkte:",null,null,null,null,"Schütze - 2"]
[null,null,null,null,null,null,null,{"$f":"SUM(D12,I12,N12,D23,N23)","v":0}]
[]
[null,null,"Ringe:","Punkte:","Teiler:",null,null,null,null,null,null,null,"Ringe:","Punkte:","Teiler:"]
[null,"1.",null,{"$f":"IF(C18=\"n\",10500)+IF(C18=1,9500)+IF(C18=2,8500)+IF(C18=3,7500)+IF(C18=4,6500)+IF(C18=5,5500)+IF(C18=6,4500)+IF(C18=7,3500)+IF(C18=8,2500)+IF(C18=9,1500)","v":0},null,null,null,null,null,null,null,"1.",null,{"$f":"IF(M18=\"n\",10500)+IF(M18=1,9500)+IF(M18=2,8500)+IF(M18=3,7500)+IF(M18=4,6500)+IF(M18=5,5500)+IF(M18=6,4500)+IF(M18=7,3500)+IF(M18=8,2500)+IF(M18=9,1500)","v":0}]
[null,"2.",null,{"$f":"IF(C19=\"n\",10500)+IF(C19=1,9500)+IF(C19=2,8500)+IF(C19=3,7500)+IF(C19=4,6500)+IF(C19=5,5500)+IF(C19=6,4500)+IF(C19=7,3500)+IF(C19=8,2500)+IF(C19=9,1500)","v":0},null,null,null,null,null,null,null,"2.",null,{"$f":"IF(M19=\"n\",10500)+IF(M19=1,9500)+IF(M19=2,8500)+IF(M19=3,7500)+IF(M19=4,6500)+IF(M19=5,5500)+IF(M19=6,4500)+IF(M19=7,3500)+IF(M19=8,2500)+IF(M19=9,1500)","v":0}]
[null,"3.",null,{"$f":"IF(C20=\"n\",10500)+IF(C20=1,9500)+IF(C20=2,8500)+IF(C20=3,7500)+IF(C20=4,6500)+IF(C20=5,5500)+IF(C20=6,4500)+IF(C20=7,3500)+IF(C20=8,2500)+IF(C20=9,1500)","v":0},null,null,null,null,null,null,null,"3.",null,{"$f":"IF(M20=\"n\",10500)+IF(M20=1,9500)+IF(M20=2,8500)+IF(M20=3,7500)+IF(M20=4,6500)+IF(M20=5,5500)+IF(M20=6,4500)+IF(M20=7,3500)+IF(M20=8,2500)+IF(M20=9,1500)","v":0}]
[null,"4.",null,{"$f":"IF(C21=\"n\",10500)+IF(C21=1,9500)+IF(C21=2,8500)+IF(C21=3,7500)+IF(C21=4,6500)+IF(C21=5,5500)+IF(C21=6,4500)+IF(C21=7,3500)+IF(C21=8,2500)+IF(C21=9,1500)","v":0},null,null,null,null,null,null,null,"4.",null,{"$f":"IF(M21=\"n\",10500)+IF(M21=1,9500)+IF(M21=2,8500)+IF(M21=3,7500)+IF(M21=4,6500)+IF(M21=5,5500)+IF(M21=6,4500)+IF(M21=7,3500)+IF(M21=8,2500)+IF(M21=9,1500)","v":0}]
[null,"5.",null,{"$f":"IF(C22=\"n\",10500)+IF(C22=1,9500)+IF(C22=2,8500)+IF(C22=3,7500)+IF(C22=4,6500)+IF(C22=5,5500)+IF(C22=6,4500)+IF(C22=7,3500)+IF(C22=8,2500)+IF(C22=9,1500)","v":0},null,null,null,null,null,null,null,"5.",null,{"$f":"IF(M22=\"n\",10500)+IF(M22=1,9500)+IF(M22=2,8500)+IF(M22=3,7500)+IF(M22=4,6500)+IF(M22=5,5500)+IF(M22=6,4500)+IF(M22=7,3500)+IF(M22=8,2500)+IF(M22=9,1500)","v":0}]
[null,null,"Punkte:",{"$f":"IF(SUM(C18:C22)=\"\",\"\",SUM(D18:E22))","v":0},null,null,"* = Ersatzschütze",null,null,null,null,null,"Punkte:",{"$f":"IF(SUM(M18:M22)=\"\",\"\",SUM(N18:O22))","v":0}]

{"sheet":"6","index":6,"n_rows":23,"n_cols":26,"rows_kept":23,"cut":false,"hidden":false,"merged":[[14,12,14,14],[22,3,22,4],[22,13,22,14],[17,7,17,9],[18,7,18,9],[14,7,16,9],[22,6,23,9],[19,7,19,9],[20,7,20,9],[14,2,14,4],[21,7,21,9],[0,1,1,15],[2,12,2,14],[3,12,3,14],[11,13,11,14],[13,2,13,4],[13,7,13,9],[13,12,13,14],[2,7,2,9],[3,7,3,9],[11,8,11,9],[11,3,11,4],[2,2,2,4],[3,2,3,4]]}
[null,{"$f":"IF(HM!E23=\"\",\"Welcher Verein ?\",HM!E23)","v":"SV-Verein 06"}]
[null,null,null,null,null,null,null,null,null,null,null,null,null,null,null,null,{"$f":"IF(C4=\"\",\"\",IF(C7=\"\",\"\",IF(C8=\"\",\"\",IF(C9=\"\",\"\",IF(C10=\"\",\"\",IF(C11=\"\",\"\",1))))))","v":""},{"$f":"IF(H4=\"\",\"\",IF(H7=\"\",\"\",IF(H8=\"\",\"\",IF(H9=\"\",\"\",IF(H10=\"\",\"\",IF(H11=\"\",\"\",1))))))","v":""},{"$f":"IF(M4=\"\",\"\",IF(M7=\"\",\"\",IF(M8=\"\",\"\",IF(M9=\"\",\"\",IF(M10=\"\",\"\",IF(M11=\"\",\"\",1))))))","v":""},null,null,null,null,null,null,"N"]
[null,"Info","König:",null,null,null,null,"Adjutant:",null,null,null,null,"Präsident:",null,null,null,{"$f":"IF(C15=\"\",\"\",IF(C18=\"\",\"\",IF(C19=\"\",\"\",IF(C20=\"\",\"\",IF(C21=\"\",\"\",IF(C22=\"\",\"\",1))))))","v":""},{"$f":"IF(SUM(Q2:S2,Q3,S3)=5,1,0)","v":0},{"$f":"IF(M15=\"\",\"\",IF(M18=\"\",\"\",IF(M19=\"\",\"\",IF(M20=\"\",\"\",IF(M21=\"\",\"\",IF(M22=\"\",\"\",1))))))","v":""},null,null,null,null,null,null,1]
[null,null,null,null,null,null,null,null,null,null,null,null,null,null,null,null,null,null,null,null,null,null,null,null,null,2]
[null,null,null,null,null,null,null,null,null,null,null,null,null,null,null,null,null,null,null,null,null,null,null,null,null,3]
[null,null,"Ringe:","Punkte:","Teiler:",null,null,"Ringe:","Punkte:","Teiler:",null,null,"Ringe:","Punkte:","Teiler:",null,null,null,null,null,null,null,null,null,null,4]
[null,"1.",null,{"$f":"IF(C7=\"n\",10500)+IF(C7=1,9500)+IF(C7=2,8500)+IF(C7=3,7500)+IF(C7=4,6500)+IF(C7=5,5500)+IF(C7=6,4500)+IF(C7=7,3500)+IF(C7=8,2500)+IF(C7=9,1500)","v":0},null,null,"1.",null,{"$f":"IF(H7=\"n\",10500)+IF(H7=1,9500)+IF(H7=2,8500)+IF(H7=3,7500)+IF(H7=4,6500)+IF(H7=5,5500)+IF(H7=6,4500)+IF(H7=7,3500)+IF(H7=8,2500)+IF(H7=9,1500)","v":0},null,null,"1.",null,{"$f":"IF(M7=\"n\",10500)+IF(M7=1,9500)+IF(M7=2,8500)+IF(M7=3,7500)+IF(M7=4,6500)+IF(M7=5,5500)+IF(M7=6,4500)+IF(M7=7,3500)+IF(M7=8,2500)+IF(M7=9,1500)","v":0},null,null,null,null,null,null,null,null,null,null,null,5]
[null,"2.",null,{"$f":"IF(C8=\"n\",10500)+IF(C8=1,9500)+IF(C8=2,8500)+IF(C8=3,7500)+IF(C8=4,6500)+IF(C8=5,5500)+IF(C8=6,4500)+IF(C8=7,3500)+IF(C8=8,2500)+IF(C8=9,1500)","v":0},null,null,"2.",null,{"$f":"IF(H8=\"n\",10500)+IF(H8=1,9500)+IF(H8=2,8500)+IF(H8=3,7500)+IF(H8=4,6500)+IF(H8=5,5500)+IF(H8=6,4500)+IF(H8=7,3500)+IF(H8=8,2500)+IF(H8=9,1500)","v":0},null,null,"2.",null,{"$f":"IF(M8=\"n\",10500)+IF(M8=1,9500)+IF(M8=2,8500)+IF(M8=3,7500)+IF(M8=4,6500)+IF(M8=5,5500)+IF(M8=6,4500)+IF(M8=7,3500)+IF(M8=8,2500)+IF(M8=9,1500)","v":0},null,null,null,null,null,null,null,null,null,null,null,6]
[null,"3.",null,{"$f":"IF(C9=\"n\",10500)+IF(C9=1,9500)+IF(C9=2,8500)+IF(C9=3,7500)+IF(C9=4,6500)+IF(C9=5,5500)+IF(C9=6,4500)+IF(C9=7,3500)+IF(C9=8,2500)+IF(C9=9,1500)","v":0},null,null,"3.",null,{"$f":"IF(H9=\"n\",10500)+IF(H9=1,9500)+IF(H9=2,8500)+IF(H9=3,7500)+IF(H9=4,6500)+IF(H9=5,5500)+IF(H9=6,4500)+IF(H9=7,3500)+IF(H9=8,2500)+IF(H9=9,1500)","v":0},null,null,"3.",null,{"$f":"IF(M9=\"n\",10500)+IF(M9=1,9500)+IF(M9=2,8500)+IF(M9=3,7500)+IF(M9=4,6500)+IF(M9=5,5500)+IF(M9=6,4500)+IF(M9=7,3500)+IF(M9=8,2500)+IF(M9=9,1500)","v":0},null,null,null,null,null,null,null,null,null,null,null,7]
[null,"4.",null,{"$f":"IF(C10=\"n\",10500)+IF(C10=1,9500)+IF(C10=2,8500)+IF(C10=3,7500)+IF(C10=4,6500)+IF(C10=5,5500)+IF(C10=6,4500)+IF(C10=7,3500)+IF(C10=8,2500)+IF(C10=9,1500)","v":0},null,null,"4.",null,{"$f":"IF(H10=\"n\",10500)+IF(H10=1,9500)+IF(H10=2,8500)+IF(H10=3,7500)+IF(H10=4,6500)+IF(H10=5,5500)+IF(H10=6,4500)+IF(H10=7,3500)+IF(H10=8,2500)+IF(H10=9,1500)","v":0},null,null,"4.",null,{"$f":"IF(M10=\"n\",10500)+IF(M10=1,9500)+IF(M10=2,8500)+IF(M10=3,7500)+IF(M10=4,6500)+IF(M10=5,5500)+IF(M10=6,4500)+IF(M10=7,3500)+IF(M10=8,2500)+IF(M10=9,1500)","v":0},null,null,null,null,null,null,null,null,null,null,null,8]
[null,"5.",null,{"$f":"IF(C11=\"n\",10500)+IF(C11=1,9500)+IF(C11=2,8500)+IF(C11=3,7500)+IF(C11=4,6500)+IF(C11=5,5500)+IF(C11=6,4500)+IF(C11=7,3500)+IF(C11=8,2500)+IF(C11=9,1500)","v":0},null,null,"5.",null,{"$f":"IF(H11=\"n\",10500)+IF(H11=1,9500)+IF(H11=2,8500)+IF(H11=3,7500)+IF(H11=4,6500)+IF(H11=5,5500)+IF(H11=6,4500)+IF(H11=7,3500)+IF(H11=8,2500)+IF(H11=9,1500)","v":0},null,null,"5.",null,{"$f":"IF(M11=\"n\",10500)+IF(M11=1,9500)+IF(M11=2,8500)+IF(M11=3,7500)+IF(M11=4,6500)+IF(M11=5,5500)+IF(M11=6,4500)+IF(M11=7,3500)+IF(M11=8,2500)+IF(M11=9,1500)","v":0},null,null,null,null,null,null,null,null,null,null,null,9]
[null,null,"Punkte:",{"$f":"IF(SUM(C7:C11)=\"\",\"\",SUM(D7:E11))","v":0},null,null,null,"Punkte:",{"$f":"IF(SUM(H7:H11)=\"\",\"\",SUM(I7:J11))","v":0},null,null,null,"Punkte:",{"$f":"IF(SUM(M7:M11)=\"\",\"\",SUM(N7:O11))","v":0},null,null,null,null,null,null,null,null,null,null,null,10]
[]
[null,null,"Schütze - 1",null,null,null,null,"gesamt Punkte:",null,null,null,null,"Schütze - 2"]
[null,null,null,null,null,null,null,{"$f":"SUM(D12,I12,N12,D23,N23)","v":0}]
[]
[null,null,"Ringe:","Punkte:","Teiler:",null,null,null,null,null,null,null,"Ringe:","Punkte:","Teiler:"]
[null,"1.",null,{"$f":"IF(C18=\"n\",10500)+IF(C18=1,9500)+IF(C18=2,8500)+IF(C18=3,7500)+IF(C18=4,6500)+IF(C18=5,5500)+IF(C18=6,4500)+IF(C18=7,3500)+IF(C18=8,2500)+IF(C18=9,1500)","v":0},null,null,null,null,null,null,null,"1.",null,{"$f":"IF(M18=\"n\",10500)+IF(M18=1,9500)+IF(M18=2,8500)+IF(M18=3,7500)+IF(M18=4,6500)+IF(M18=5,5500)+IF(M18=6,4500)+IF(M18=7,3500)+IF(M18=8,2500)+IF(M18=9,1500)","v":0}]
[null,"2.",null,{"$f":"IF(C19=\"n\",10500)+IF(C19=1,9500)+IF(C19=2,8500)+IF(C19=3,7500)+IF(C19=4,6500)+IF(C19=5,5500)+IF(C19=6,4500)+IF(C19=7,3500)+IF(C19=8,2500)+IF(C19=9,1500)","v":0},null,null,null,null,null,null,null,"2.",null,{"$f":"IF(M19=\"n\",10500)+IF(M19=1,9500)+IF(M19=2,8500)+IF(M19=3,7500)+IF(M19=4,6500)+IF(M19=5,5500)+IF(M19=6,4500)+IF(M19=7,3500)+IF(M19=8,2500)+IF(M19=9,1500)","v":0}]
[null,"3.",null,{"$f":"IF(C20=\"n\",10500)+IF(C20=1,9500)+IF(C20=2,8500)+IF(C20=3,7500)+IF(C20=4,6500)+IF(C20=5,5500)+IF(C20=6,4500)+IF(C20=7,3500)+IF(C20=8,2500)+IF(C20=9,1500)","v":0},null,null,null,null,null,null,null,"3.",null,{"$f":"IF(M20=\"n\",10500)+IF(M20=1,9500)+IF(M20=2,8500)+IF(M20=3,7500)+IF(M20=4,6500)+IF(M20=5,5500)+IF(M20=6,4500)+IF(M20=7,3500)+IF(M20=8,2500)+IF(M20=9,1500)","v":0}]
[null,"4.",null,{"$f":"IF(C21=\"n\",10500)+IF(C21=1,9500)+IF(C21=2,8500)+IF(C21=3,7500)+IF(C21=4,6500)+IF(C21=5,5500)+IF(C21=6,4500)+IF(C21=7,3500)+IF(C21=8,2500)+IF(C21=9,1500)","v":0},null,null,null,null,null,null,null,"4.",null,{"$f":"IF(M21=\"n\",10500)+IF(M21=1,9500)+IF(M21=2,8500)+IF(M21=3,7500)+IF(M21=4,6500)+IF(M21=5,5500)+IF(M21=6,4500)+IF(M21=7,3500)+IF(M21=8,2500)+IF(M21=9,1500)","v":0}]
[null,"5.",null,{"$f":"IF(C22=\"n\",10500)+IF(C22=1,9500)+IF(C22=2,8500)+IF(C22=3,7500)+IF(C22=4,6500)+IF(C22=5,5500)+IF(C22=6,4500)+IF(C22=7,3500)+IF(C22=8,2500)+IF(C22=9,1500)","v":0},null,null,null,null,null,null,null,"5.",null,{"$f":"IF(M22=\"n\",10500)+IF(M22=1,9500)+IF(M22=2,8500)+IF(M22=3,7500)+IF(M22=4,6500)+IF(M22=5,5500)+IF(M22=6,4500)+IF(M22=7,3500)+IF(M22=8,2500)+IF(M22=9,1500)","v":0}]
[null,null,"Punkte:",{"$f":"IF(SUM(C18:C22)=\"\",\"\",SUM(D18:E22))","v":0},null,null,"* = Ersatzschütze",null,null,null,null,null,"Punkte:",{"$f":"IF(SUM(M18:M22)=\"\",\"\",SUM(N18:O22))","v":0}]

{"sheet":"7","index":7,"n_rows":23,"n_cols":26,"rows_kept":23,"cut":false,"hidden":false,"merged":[[0,1,1,15],[2,12,2,14],[3,12,3,14],[11,13,11,14],[13,2,13,4],[13,7,13,9],[13,12,13,14],[3,2,3,4],[2,7,2,9],[3,7,3,9],[11,8,11,9],[14,7,16,9],[11,3,11,4],[2,2,2,4],[14,12,14,14],[22,3,22,4],[22,13,22,14],[17,7,17,9],[18,7,18,9],[19,7,19,9],[20,7,20,9],[14,2,14,4],[21,7,21,9],[22,6,23,9]]}
[null,{"$f":"IF(HM!E26=\"\",\"Welcher Verein ?\",HM!E26)","v":"SV-Verein 07"}]
[null,null,null,null,null,null,null,null,null,null,null,null,null,null,null,null,{"$f":"IF(C4=\"\",\"\",IF(C7=\"\",\"\",IF(C8=\"\",\"\",IF(C9=\"\",\"\",IF(C10=\"\",\"\",IF(C11=\"\",\"\",1))))))","v":""},{"$f":"IF(H4=\"\",\"\",IF(H7=\"\",\"\",IF(H8=\"\",\"\",IF(H9=\"\",\"\",IF(H10=\"\",\"\",IF(H11=\"\",\"\",1))))))","v":""},{"$f":"IF(M4=\"\",\"\",IF(M7=\"\",\"\",IF(M8=\"\",\"\",IF(M9=\"\",\"\",IF(M10=\"\",\"\",IF(M11=\"\",\"\",1))))))","v":""},null,null,null,null,null,null,"N"]
[null,"Info","König:",null,null,null,null,"Adjutant:",null,null,null,null,"Präsident:",null,null,null,{"$f":"IF(C15=\"\",\"\",IF(C18=\"\",\"\",IF(C19=\"\",\"\",IF(C20=\"\",\"\",IF(C21=\"\",\"\",IF(C22=\"\",\"\",1))))))","v":""},{"$f":"IF(SUM(Q2:S2,Q3,S3)=5,1,0)","v":0},{"$f":"IF(M15=\"\",\"\",IF(M18=\"\",\"\",IF(M19=\"\",\"\",IF(M20=\"\",\"\",IF(M21=\"\",\"\",IF(M22=\"\",\"\",1))))))","v":""},null,null,null,null,null,null,1]
[null,null,null,null,null,null,null,null,null,null,null,null,null,null,null,null,null,null,null,null,null,null,null,null,null,2]
[null,null,null,null,null,null,null,null,null,null,null,null,null,null,null,null,null,null,null,null,null,null,null,null,null,3]
[null,null,"Ringe:","Punkte:","Teiler:",null,null,"Ringe:","Punkte:","Teiler:",null,null,"Ringe:","Punkte:","Teiler:",null,null,null,null,null,null,null,null,null,null,4]
[null,"1.",null,{"$f":"IF(C7=\"n\",10500)+IF(C7=1,9500)+IF(C7=2,8500)+IF(C7=3,7500)+IF(C7=4,6500)+IF(C7=5,5500)+IF(C7=6,4500)+IF(C7=7,3500)+IF(C7=8,2500)+IF(C7=9,1500)","v":0},null,null,"1.",null,{"$f":"IF(H7=\"n\",10500)+IF(H7=1,9500)+IF(H7=2,8500)+IF(H7=3,7500)+IF(H7=4,6500)+IF(H7=5,5500)+IF(H7=6,4500)+IF(H7=7,3500)+IF(H7=8,2500)+IF(H7=9,1500)","v":0},null,null,"1.",null,{"$f":"IF(M7=\"n\",10500)+IF(M7=1,9500)+IF(M7=2,8500)+IF(M7=3,7500)+IF(M7=4,6500)+IF(M7=5,5500)+IF(M7=6,4500)+IF(M7=7,3500)+IF(M7=8,2500)+IF(M7=9,1500)","v":0},null,null,null,null,null,null,null,null,null,null,null,5]
[null,"2.",null,{"$f":"IF(C8=\"n\",10500)+IF(C8=1,9500)+IF(C8=2,8500)+IF(C8=3,7500)+IF(C8=4,6500)+IF(C8=5,5500)+IF(C8=6,4500)+IF(C8=7,3500)+IF(C8=8,2500)+IF(C8=9,1500)","v":0},null,null,"2.",null,{"$f":"IF(H8=\"n\",10500)+IF(H8=1,9500)+IF(H8=2,8500)+IF(H8=3,7500)+IF(H8=4,6500)+IF(H8=5,5500)+IF(H8=6,4500)+IF(H8=7,3500)+IF(H8=8,2500)+IF(H8=9,1500)","v":0},null,null,"2.",null,{"$f":"IF(M8=\"n\",10500)+IF(M8=1,9500)+IF(M8=2,8500)+IF(M8=3,7500)+IF(M8=4,6500)+IF(M8=5,5500)+IF(M8=6,4500)+IF(M8=7,3500)+IF(M8=8,2500)+IF(M8=9,1500)","v":0},null,null,null,null,null,null,null,null,null,null,null,6]
[null,"3.",null,{"$f":"IF(C9=\"n\",10500)+IF(C9=1,9500)+IF(C9=2,8500)+IF(C9=3,7500)+IF(C9=4,6500)+IF(C9=5,5500)+IF(C9=6,4500)+IF(C9=7,3500)+IF(C9=8,2500)+IF(C9=9,1500)","v":0},null,null,"3.",null,{"$f":"IF(H9=\"n\",10500)+IF(H9=1,9500)+IF(H9=2,8500)+IF(H9=3,7500)+IF(H9=4,6500)+IF(H9=5,5500)+IF(H9=6,4500)+IF(H9=7,3500)+IF(H9=8,2500)+IF(H9=9,1500)","v":0},null,null,"3.",null,{"$f":"IF(M9=\"n\",10500)+IF(M9=1,9500)+IF(M9=2,8500)+IF(M9=3,7500)+IF(M9=4,6500)+IF(M9=5,5500)+IF(M9=6,4500)+IF(M9=7,3500)+IF(M9=8,2500)+IF(M9=9,1500)","v":0},null,null,null,null,null,null,null,null,null,null,null,7]
[null,"4.",null,{"$f":"IF(C10=\"n\",10500)+IF(C10=1,9500)+IF(C10=2,8500)+IF(C10=3,7500)+IF(C10=4,6500)+IF(C10=5,5500)+IF(C10=6,4500)+IF(C10=7,3500)+IF(C10=8,2500)+IF(C10=9,1500)","v":0},null,null,"4.",null,{"$f":"IF(H10=\"n\",10500)+IF(H10=1,9500)+IF(H10=2,8500)+IF(H10=3,7500)+IF(H10=4,6500)+IF(H10=5,5500)+IF(H10=6,4500)+IF(H10=7,3500)+IF(H10=8,2500)+IF(H10=9,1500)","v":0},null,null,"4.",null,{"$f":"IF(M10=\"n\",10500)+IF(M10=1,9500)+IF(M10=2,8500)+IF(M10=3,7500)+IF(M10=4,6500)+IF(M10=5,5500)+IF(M10=6,4500)+IF(M10=7,3500)+IF(M10=8,2500)+IF(M10=9,1500)","v":0},null,null,null,null,null,null,null,null,null,null,null,8]
[null,"5.",null,{"$f":"IF(C11=\"n\",10500)+IF(C11=1,9500)+IF(C11=2,8500)+IF(C11=3,7500)+IF(C11=4,6500)+IF(C11=5,5500)+IF(C11=6,4500)+IF(C11=7,3500)+IF(C11=8,2500)+IF(C11=9,1500)","v":0},null,null,"5.",null,{"$f":"IF(H11=\"n\",10500)+IF(H11=1,9500)+IF(H11=2,8500)+IF(H11=3,7500)+IF(H11=4,6500)+IF(H11=5,5500)+IF(H11=6,4500)+IF(H11=7,3500)+IF(H11=8,2500)+IF(H11=9,1500)","v":0},null,null,"5.",null,{"$f":"IF(M11=\"n\",10500)+IF(M11=1,9500)+IF(M11=2,8500)+IF(M11=3,7500)+IF(M11=4,6500)+IF(M11=5,5500)+IF(M11=6,4500)+IF(M11=7,3500)+IF(M11=8,2500)+IF(M11=9,1500)","v":0},null,null,null,null,null,null,null,null,null,null,null,9]
[null,null,"Punkte:",{"$f":"IF(SUM(C7:C11)=\"\",\"\",SUM(D7:E11))","v":0},null,null,null,"Punkte:",{"$f":"IF(SUM(H7:H11)=\"\",\"\",SUM(I7:J11))","v":0},null,null,null,"Punkte:",{"$f":"IF(SUM(M7:M11)=\"\",\"\",SUM(N7:O11))","v":0},null,null,null,null,null,null,null,null,null,null,null,10]
[]
[null,null,"Schütze - 1",null,null,null,null,"gesamt Punkte:",null,null,null,null,"Schütze - 2"]
[null,null,null,null,null,null,null,{"$f":"SUM(D12,I12,N12,D23,N23)","v":0}]
[]
[null,null,"Ringe:","Punkte:","Teiler:",null,null,null,null,null,null,null,"Ringe:","Punkte:","Teiler:"]
[null,"1.",null,{"$f":"IF(C18=\"n\",10500)+IF(C18=1,9500)+IF(C18=2,8500)+IF(C18=3,7500)+IF(C18=4,6500)+IF(C18=5,5500)+IF(C18=6,4500)+IF(C18=7,3500)+IF(C18=8,2500)+IF(C18=9,1500)","v":0},null,null,null,null,null,null,null,"1.",null,{"$f":"IF(M18=\"n\",10500)+IF(M18=1,9500)+IF(M18=2,8500)+IF(M18=3,7500)+IF(M18=4,6500)+IF(M18=5,5500)+IF(M18=6,4500)+IF(M18=7,3500)+IF(M18=8,2500)+IF(M18=9,1500)","v":0}]
[null,"2.",null,{"$f":"IF(C19=\"n\",10500)+IF(C19=1,9500)+IF(C19=2,8500)+IF(C19=3,7500)+IF(C19=4,6500)+IF(C19=5,5500)+IF(C19=6,4500)+IF(C19=7,3500)+IF(C19=8,2500)+IF(C19=9,1500)","v":0},null,null,null,null,null,null,null,"2.",null,{"$f":"IF(M19=\"n\",10500)+IF(M19=1,9500)+IF(M19=2,8500)+IF(M19=3,7500)+IF(M19=4,6500)+IF(M19=5,5500)+IF(M19=6,4500)+IF(M19=7,3500)+IF(M19=8,2500)+IF(M19=9,1500)","v":0}]
[null,"3.",null,{"$f":"IF(C20=\"n\",10500)+IF(C20=1,9500)+IF(C20=2,8500)+IF(C20=3,7500)+IF(C20=4,6500)+IF(C20=5,5500)+IF(C20=6,4500)+IF(C20=7,3500)+IF(C20=8,2500)+IF(C20=9,1500)","v":0},null,null,null,null,null,null,null,"3.",null,{"$f":"IF(M20=\"n\",10500)+IF(M20=1,9500)+IF(M20=2,8500)+IF(M20=3,7500)+IF(M20=4,6500)+IF(M20=5,5500)+IF(M20=6,4500)+IF(M20=7,3500)+IF(M20=8,2500)+IF(M20=9,1500)","v":0}]
[null,"4.",null,{"$f":"IF(C21=\"n\",10500)+IF(C21=1,9500)+IF(C21=2,8500)+IF(C21=3,7500)+IF(C21=4,6500)+IF(C21=5,5500)+IF(C21=6,4500)+IF(C21=7,3500)+IF(C21=8,2500)+IF(C21=9,1500)","v":0},null,null,null,null,null,null,null,"4.",null,{"$f":"IF(M21=\"n\",10500)+IF(M21=1,9500)+IF(M21=2,8500)+IF(M21=3,7500)+IF(M21=4,6500)+IF(M21=5,5500)+IF(M21=6,4500)+IF(M21=7,3500)+IF(M21=8,2500)+IF(M21=9,1500)","v":0}]
[null,"5.",null,{"$f":"IF(C22=\"n\",10500)+IF(C22=1,9500)+IF(C22=2,8500)+IF(C22=3,7500)+IF(C22=4,6500)+IF(C22=5,5500)+IF(C22=6,4500)+IF(C22=7,3500)+IF(C22=8,2500)+IF(C22=9,1500)","v":0},null,null,null,null,null,null,null,"5.",null,{"$f":"IF(M22=\"n\",10500)+IF(M22=1,9500)+IF(M22=2,8500)+IF(M22=3,7500)+IF(M22=4,6500)+IF(M22=5,5500)+IF(M22=6,4500)+IF(M22=7,3500)+IF(M22=8,2500)+IF(M22=9,1500)","v":0}]
[null,null,"Punkte:",{"$f":"IF(SUM(C18:C22)=\"\",\"\",SUM(D18:E22))","v":0},null,null,"* = Ersatzschütze",null,null,null,null,null,"Punkte:",{"$f":"IF(SUM(M18:M22)=\"\",\"\",SUM(N18:O22))","v":0}]

{"sheet":"8","index":8,"n_rows":23,"n_cols":26,"rows_kept":23,"cut":false,"hidden":false,"merged":[[14,12,14,14],[22,3,22,4],[22,13,22,14],[17,7,17,9],[18,7,18,9],[14,7,16,9],[22,6,23,9],[19,7,19,9],[20,7,20,9],[14,2,14,4],[21,7,21,9],[0,1,1,15],[2,12,2,14],[3,12,3,14],[11,13,11,14],[13,2,13,4],[13,7,13,9],[13,12,13,14],[2,7,2,9],[3,7,3,9],[11,8,11,9],[11,3,11,4],[2,2,2,4],[3,2,3,4]]}
[null,{"$f":"IF(HM!E29=\"\",\"Welcher Verein ?\",HM!E29)","v":"SV-Verein 08"}]
[null,null,null,null,null,null,null,null,null,null,null,null,null,null,null,null,{"$f":"IF(C4=\"\",\"\",IF(C7=\"\",\"\",IF(C8=\"\",\"\",IF(C9=\"\",\"\",IF(C10=\"\",\"\",IF(C11=\"\",\"\",1))))))","v":""},{"$f":"IF(H4=\"\",\"\",IF(H7=\"\",\"\",IF(H8=\"\",\"\",IF(H9=\"\",\"\",IF(H10=\"\",\"\",IF(H11=\"\",\"\",1))))))","v":""},{"$f":"IF(M4=\"\",\"\",IF(M7=\"\",\"\",IF(M8=\"\",\"\",IF(M9=\"\",\"\",IF(M10=\"\",\"\",IF(M11=\"\",\"\",1))))))","v":""},null,null,null,null,null,null,"N"]
[null,"Info","König:",null,null,null,null,"Adjutant:",null,null,null,null,"Präsident:",null,null,null,{"$f":"IF(C15=\"\",\"\",IF(C18=\"\",\"\",IF(C19=\"\",\"\",IF(C20=\"\",\"\",IF(C21=\"\",\"\",IF(C22=\"\",\"\",1))))))","v":""},{"$f":"IF(SUM(Q2:S2,Q3,S3)=5,1,0)","v":0},{"$f":"IF(M15=\"\",\"\",IF(M18=\"\",\"\",IF(M19=\"\",\"\",IF(M20=\"\",\"\",IF(M21=\"\",\"\",IF(M22=\"\",\"\",1))))))","v":""},null,null,null,null,null,null,1]
[null,null,null,null,null,null,null,null,null,null,null,null,null,null,null,null,null,null,null,null,null,null,null,null,null,2]
[null,null,null,null,null,null,null,null,null,null,null,null,null,null,null,null,null,null,null,null,null,null,null,null,null,3]
[null,null,"Ringe:","Punkte:","Teiler:",null,null,"Ringe:","Punkte:","Teiler:",null,null,"Ringe:","Punkte:","Teiler:",null,null,null,null,null,null,null,null,null,null,4]
[null,"1.",null,{"$f":"IF(C7=\"n\",10500)+IF(C7=1,9500)+IF(C7=2,8500)+IF(C7=3,7500)+IF(C7=4,6500)+IF(C7=5,5500)+IF(C7=6,4500)+IF(C7=7,3500)+IF(C7=8,2500)+IF(C7=9,1500)","v":0},null,null,"1.",null,{"$f":"IF(H7=\"n\",10500)+IF(H7=1,9500)+IF(H7=2,8500)+IF(H7=3,7500)+IF(H7=4,6500)+IF(H7=5,5500)+IF(H7=6,4500)+IF(H7=7,3500)+IF(H7=8,2500)+IF(H7=9,1500)","v":0},null,null,"1.",null,{"$f":"IF(M7=\"n\",10500)+IF(M7=1,9500)+IF(M7=2,8500)+IF(M7=3,7500)+IF(M7=4,6500)+IF(M7=5,5500)+IF(M7=6,4500)+IF(M7=7,3500)+IF(M7=8,2500)+IF(M7=9,1500)","v":0},null,null,null,null,null,null,null,null,null,null,null,5]
[null,"2.",null,{"$f":"IF(C8=\"n\",10500)+IF(C8=1,9500)+IF(C8=2,8500)+IF(C8=3,7500)+IF(C8=4,6500)+IF(C8=5,5500)+IF(C8=6,4500)+IF(C8=7,3500)+IF(C8=8,2500)+IF(C8=9,1500)","v":0},null,null,"2.",null,{"$f":"IF(H8=\"n\",10500)+IF(H8=1,9500)+IF(H8=2,8500)+IF(H8=3,7500)+IF(H8=4,6500)+IF(H8=5,5500)+IF(H8=6,4500)+IF(H8=7,3500)+IF(H8=8,2500)+IF(H8=9,1500)","v":0},null,null,"2.",null,{"$f":"IF(M8=\"n\",10500)+IF(M8=1,9500)+IF(M8=2,8500)+IF(M8=3,7500)+IF(M8=4,6500)+IF(M8=5,5500)+IF(M8=6,4500)+IF(M8=7,3500)+IF(M8=8,2500)+IF(M8=9,1500)","v":0},null,null,null,null,null,null,null,null,null,null,null,6]
[null,"3.",null,{"$f":"IF(C9=\"n\",10500)+IF(C9=1,9500)+IF(C9=2,8500)+IF(C9=3,7500)+IF(C9=4,6500)+IF(C9=5,5500)+IF(C9=6,4500)+IF(C9=7,3500)+IF(C9=8,2500)+IF(C9=9,1500)","v":0},null,null,"3.",null,{"$f":"IF(H9=\"n\",10500)+IF(H9=1,9500)+IF(H9=2,8500)+IF(H9=3,7500)+IF(H9=4,6500)+IF(H9=5,5500)+IF(H9=6,4500)+IF(H9=7,3500)+IF(H9=8,2500)+IF(H9=9,1500)","v":0},null,null,"3.",null,{"$f":"IF(M9=\"n\",10500)+IF(M9=1,9500)+IF(M9=2,8500)+IF(M9=3,7500)+IF(M9=4,6500)+IF(M9=5,5500)+IF(M9=6,4500)+IF(M9=7,3500)+IF(M9=8,2500)+IF(M9=9,1500)","v":0},null,null,null,null,null,null,null,null,null,null,null,7]
[null,"4.",null,{"$f":"IF(C10=\"n\",10500)+IF(C10=1,9500)+IF(C10=2,8500)+IF(C10=3,7500)+IF(C10=4,6500)+IF(C10=5,5500)+IF(C10=6,4500)+IF(C10=7,3500)+IF(C10=8,2500)+IF(C10=9,1500)","v":0},null,null,"4.",null,{"$f":"IF(H10=\"n\",10500)+IF(H10=1,9500)+IF(H10=2,8500)+IF(H10=3,7500)+IF(H10=4,6500)+IF(H10=5,5500)+IF(H10=6,4500)+IF(H10=7,3500)+IF(H10=8,2500)+IF(H10=9,1500)","v":0},null,null,"4.",null,{"$f":"IF(M10=\"n\",10500)+IF(M10=1,9500)+IF(M10=2,8500)+IF(M10=3,7500)+IF(M10=4,6500)+IF(M10=5,5500)+IF(M10=6,4500)+IF(M10=7,3500)+IF(M10=8,2500)+IF(M10=9,1500)","v":0},null,null,null,null,null,null,null,null,null,null,null,8]
[null,"5.",null,{"$f":"IF(C11=\"n\",10500)+IF(C11=1,9500)+IF(C11=2,8500)+IF(C11=3,7500)+IF(C11=4,6500)+IF(C11=5,5500)+IF(C11=6,4500)+IF(C11=7,3500)+IF(C11=8,2500)+IF(C11=9,1500)","v":0},null,null,"5.",null,{"$f":"IF(H11=\"n\",10500)+IF(H11=1,9500)+IF(H11=2,8500)+IF(H11=3,7500)+IF(H11=4,6500)+IF(H11=5,5500)+IF(H11=6,4500)+IF(H11=7,3500)+IF(H11=8,2500)+IF(H11=9,1500)","v":0},null,null,"5.",null,{"$f":"IF(M11=\"n\",10500)+IF(M11=1,9500)+IF(M11=2,8500)+IF(M11=3,7500)+IF(M11=4,6500)+IF(M11=5,5500)+IF(M11=6,4500)+IF(M11=7,3500)+IF(M11=8,2500)+IF(M11=9,1500)","v":0},null,null,null,null,null,null,null,null,null,null,null,9]
[null,null,"Punkte:",{"$f":"IF(SUM(C7:C11)=\"\",\"\",SUM(D7:E11))","v":0},null,null,null,"Punkte:",{"$f":"IF(SUM(H7:H11)=\"\",\"\",SUM(I7:J11))","v":0},null,null,null,"Punkte:",{"$f":"IF(SUM(M7:M11)=\"\",\"\",SUM(N7:O11))","v":0},null,null,null,null,null,null,null,null,null,null,null,10]
[]
[null,null,"Schütze - 1",null,null,null,null,"gesamt Punkte:",null,null,null,null,"Schütze - 2"]
[null,null,null,null,null,null,null,{"$f":"SUM(D12,I12,N12,D23,N23)","v":0}]
[]
[null,null,"Ringe:","Punkte:","Teiler:",null,null,null,null,null,null,null,"Ringe:","Punkte:","Teiler:"]
[null,"1.",null,{"$f":"IF(C18=\"n\",10500)+IF(C18=1,9500)+IF(C18=2,8500)+IF(C18=3,7500)+IF(C18=4,6500)+IF(C18=5,5500)+IF(C18=6,4500)+IF(C18=7,3500)+IF(C18=8,2500)+IF(C18=9,1500)","v":0},null,null,null,null,null,null,null,"1.",null,{"$f":"IF(M18=\"n\",10500)+IF(M18=1,9500)+IF(M18=2,8500)+IF(M18=3,7500)+IF(M18=4,6500)+IF(M18=5,5500)+IF(M18=6,4500)+IF(M18=7,3500)+IF(M18=8,2500)+IF(M18=9,1500)","v":0}]
[null,"2.",null,{"$f":"IF(C19=\"n\",10500)+IF(C19=1,9500)+IF(C19=2,8500)+IF(C19=3,7500)+IF(C19=4,6500)+IF(C19=5,5500)+IF(C19=6,4500)+IF(C19=7,3500)+IF(C19=8,2500)+IF(C19=9,1500)","v":0},null,null,null,null,null,null,null,"2.",null,{"$f":"IF(M19=\"n\",10500)+IF(M19=1,9500)+IF(M19=2,8500)+IF(M19=3,7500)+IF(M19=4,6500)+IF(M19=5,5500)+IF(M19=6,4500)+IF(M19=7,3500)+IF(M19=8,2500)+IF(M19=9,1500)","v":0}]
[null,"3.",null,{"$f":"IF(C20=\"n\",10500)+IF(C20=1,9500)+IF(C20=2,8500)+IF(C20=3,7500)+IF(C20=4,6500)+IF(C20=5,5500)+IF(C20=6,4500)+IF(C20=7,3500)+IF(C20=8,2500)+IF(C20=9,1500)","v":0},null,null,null,null,null,null,null,"3.",null,{"$f":"IF(M20=\"n\",10500)+IF(M20=1,9500)+IF(M20=2,8500)+IF(M20=3,7500)+IF(M20=4,6500)+IF(M20=5,5500)+IF(M20=6,4500)+IF(M20=7,3500)+IF(M20=8,2500)+IF(M20=9,1500)","v":0}]
[null,"4.",null,{"$f":"IF(C21=\"n\",10500)+IF(C21=1,9500)+IF(C21=2,8500)+IF(C21=3,7500)+IF(C21=4,6500)+IF(C21=5,5500)+IF(C21=6,4500)+IF(C21=7,3500)+IF(C21=8,2500)+IF(C21=9,1500)","v":0},null,null,null,null,null,null,null,"4.",null,{"$f":"IF(M21=\"n\",10500)+IF(M21=1,9500)+IF(M21=2,8500)+IF(M21=3,7500)+IF(M21=4,6500)+IF(M21=5,5500)+IF(M21=6,4500)+IF(M21=7,3500)+IF(M21=8,2500)+IF(M21=9,1500)","v":0}]
[null,"5.",null,{"$f":"IF(C22=\"n\",10500)+IF(C22=1,9500)+IF(C22=2,8500)+IF(C22=3,7500)+IF(C22=4,6500)+IF(C22=5,5500)+IF(C22=6,4500)+IF(C22=7,3500)+IF(C22=8,2500)+IF(C22=9,1500)","v":0},null,null,null,null,null,null,null,"5.",null,{"$f":"IF(M22=\"n\",10500)+IF(M22=1,9500)+IF(M22=2,8500)+IF(M22=3,7500)+IF(M22=4,6500)+IF(M22=5,5500)+IF(M22=6,4500)+IF(M22=7,3500)+IF(M22=8,2500)+IF(M22=9,1500)","v":0}]
[null,null,"Punkte:",{"$f":"IF(SUM(C18:C22)=\"\",\"\",SUM(D18:E22))","v":0},null,null,"* = Ersatzschütze",null,null,null,null,null,"Punkte:",{"$f":"IF(SUM(M18:M22)=\"\",\"\",SUM(N18:O22))","v":0}]

{"sheet":"9","index":9,"n_rows":23,"n_cols":26,"rows_kept":23,"cut":false,"hidden":false,"merged":[[0,1,1,15],[2,12,2,14],[3,12,3,14],[11,13,11,14],[13,2,13,4],[13,7,13,9],[13,12,13,14],[3,2,3,4],[2,7,2,9],[3,7,3,9],[11,8,11,9],[14,7,16,9],[11,3,11,4],[2,2,2,4],[14,12,14,14],[22,3,22,4],[22,13,22,14],[17,7,17,9],[18,7,18,9],[19,7,19,9],[20,7,20,9],[14,2,14,4],[21,7,21,9],[22,6,23,9]]}
[null,{"$f":"IF(HM!E32=\"\",\"Welcher Verein ?\",HM!E32)","v":"SV-Verein 09"}]
[null,null,null,null,null,null,null,null,null,null,null,null,null,null,null,null,{"$f":"IF(C4=\"\",\"\",IF(C7=\"\",\"\",IF(C8=\"\",\"\",IF(C9=\"\",\"\",IF(C10=\"\",\"\",IF(C11=\"\",\"\",1))))))","v":""},{"$f":"IF(H4=\"\",\"\",IF(H7=\"\",\"\",IF(H8=\"\",\"\",IF(H9=\"\",\"\",IF(H10=\"\",\"\",IF(H11=\"\",\"\",1))))))","v":""},{"$f":"IF(M4=\"\",\"\",IF(M7=\"\",\"\",IF(M8=\"\",\"\",IF(M9=\"\",\"\",IF(M10=\"\",\"\",IF(M11=\"\",\"\",1))))))","v":""},null,null,null,null,null,null,"N"]
[null,"Info","König:",null,null,null,null,"Adjudant:",null,null,null,null,"Präsident:",null,null,null,{"$f":"IF(C15=\"\",\"\",IF(C18=\"\",\"\",IF(C19=\"\",\"\",IF(C20=\"\",\"\",IF(C21=\"\",\"\",IF(C22=\"\",\"\",1))))))","v":""},{"$f":"IF(SUM(Q2:S2,Q3,S3)=5,1,0)","v":0},{"$f":"IF(M15=\"\",\"\",IF(M18=\"\",\"\",IF(M19=\"\",\"\",IF(M20=\"\",\"\",IF(M21=\"\",\"\",IF(M22=\"\",\"\",1))))))","v":""},null,null,null,null,null,null,1]
[null,null,null,null,null,null,null,null,null,null,null,null,null,null,null,null,null,null,null,null,null,null,null,null,null,2]
[null,null,null,null,null,null,null,null,null,null,null,null,null,null,null,null,null,null,null,null,null,null,null,null,null,3]
[null,null,"Ringe:","Punkte:","Teiler:",null,null,"Ringe:","Punkte:","Teiler:",null,null,"Ringe:","Punkte:","Teiler:",null,null,null,null,null,null,null,null,null,null,4]
[null,"1.",null,{"$f":"IF(C7=\"n\",10500)+IF(C7=1,9500)+IF(C7=2,8500)+IF(C7=3,7500)+IF(C7=4,6500)+IF(C7=5,5500)+IF(C7=6,4500)+IF(C7=7,3500)+IF(C7=8,2500)+IF(C7=9,1500)","v":0},null,null,"1.",null,{"$f":"IF(H7=\"n\",10500)+IF(H7=1,9500)+IF(H7=2,8500)+IF(H7=3,7500)+IF(H7=4,6500)+IF(H7=5,5500)+IF(H7=6,4500)+IF(H7=7,3500)+IF(H7=8,2500)+IF(H7=9,1500)","v":0},null,null,"1.",null,{"$f":"IF(M7=\"n\",10500)+IF(M7=1,9500)+IF(M7=2,8500)+IF(M7=3,7500)+IF(M7=4,6500)+IF(M7=5,5500)+IF(M7=6,4500)+IF(M7=7,3500)+IF(M7=8,2500)+IF(M7=9,1500)","v":0},null,null,null,null,null,null,null,null,null,null,null,5]
[null,"2.",null,{"$f":"IF(C8=\"n\",10500)+IF(C8=1,9500)+IF(C8=2,8500)+IF(C8=3,7500)+IF(C8=4,6500)+IF(C8=5,5500)+IF(C8=6,4500)+IF(C8=7,3500)+IF(C8=8,2500)+IF(C8=9,1500)","v":0},null,null,"2.",null,{"$f":"IF(H8=\"n\",10500)+IF(H8=1,9500)+IF(H8=2,8500)+IF(H8=3,7500)+IF(H8=4,6500)+IF(H8=5,5500)+IF(H8=6,4500)+IF(H8=7,3500)+IF(H8=8,2500)+IF(H8=9,1500)","v":0},null,null,"2.",null,{"$f":"IF(M8=\"n\",10500)+IF(M8=1,9500)+IF(M8=2,8500)+IF(M8=3,7500)+IF(M8=4,6500)+IF(M8=5,5500)+IF(M8=6,4500)+IF(M8=7,3500)+IF(M8=8,2500)+IF(M8=9,1500)","v":0},null,null,null,null,null,null,null,null,null,null,null,6]
[null,"3.",null,{"$f":"IF(C9=\"n\",10500)+IF(C9=1,9500)+IF(C9=2,8500)+IF(C9=3,7500)+IF(C9=4,6500)+IF(C9=5,5500)+IF(C9=6,4500)+IF(C9=7,3500)+IF(C9=8,2500)+IF(C9=9,1500)","v":0},null,null,"3.",null,{"$f":"IF(H9=\"n\",10500)+IF(H9=1,9500)+IF(H9=2,8500)+IF(H9=3,7500)+IF(H9=4,6500)+IF(H9=5,5500)+IF(H9=6,4500)+IF(H9=7,3500)+IF(H9=8,2500)+IF(H9=9,1500)","v":0},null,null,"3.",null,{"$f":"IF(M9=\"n\",10500)+IF(M9=1,9500)+IF(M9=2,8500)+IF(M9=3,7500)+IF(M9=4,6500)+IF(M9=5,5500)+IF(M9=6,4500)+IF(M9=7,3500)+IF(M9=8,2500)+IF(M9=9,1500)","v":0},null,null,null,null,null,null,null,null,null,null,null,7]
[null,"4.",null,{"$f":"IF(C10=\"n\",10500)+IF(C10=1,9500)+IF(C10=2,8500)+IF(C10=3,7500)+IF(C10=4,6500)+IF(C10=5,5500)+IF(C10=6,4500)+IF(C10=7,3500)+IF(C10=8,2500)+IF(C10=9,1500)","v":0},null,null,"4.",null,{"$f":"IF(H10=\"n\",10500)+IF(H10=1,9500)+IF(H10=2,8500)+IF(H10=3,7500)+IF(H10=4,6500)+IF(H10=5,5500)+IF(H10=6,4500)+IF(H10=7,3500)+IF(H10=8,2500)+IF(H10=9,1500)","v":0},null,null,"4.",null,{"$f":"IF(M10=\"n\",10500)+IF(M10=1,9500)+IF(M10=2,8500)+IF(M10=3,7500)+IF(M10=4,6500)+IF(M10=5,5500)+IF(M10=6,4500)+IF(M10=7,3500)+IF(M10=8,2500)+IF(M10=9,1500)","v":0},null,null,null,null,null,null,null,null,null,null,null,8]
[null,"5.",null,{"$f":"IF(C11=\"n\",10500)+IF(C11=1,9500)+IF(C11=2,8500)+IF(C11=3,7500)+IF(C11=4,6500)+IF(C11=5,5500)+IF(C11=6,4500)+IF(C11=7,3500)+IF(C11=8,2500)+IF(C11=9,1500)","v":0},null,null,"5.",null,{"$f":"IF(H11=\"n\",10500)+IF(H11=1,9500)+IF(H11=2,8500)+IF(H11=3,7500)+IF(H11=4,6500)+IF(H11=5,5500)+IF(H11=6,4500)+IF(H11=7,3500)+IF(H11=8,2500)+IF(H11=9,1500)","v":0},null,null,"5.",null,{"$f":"IF(M11=\"n\",10500)+IF(M11=1,9500)+IF(M11=2,8500)+IF(M11=3,7500)+IF(M11=4,6500)+IF(M11=5,5500)+IF(M11=6,4500)+IF(M11=7,3500)+IF(M11=8,2500)+IF(M11=9,1500)","v":0},null,null,null,null,null,null,null,null,null,null,null,9]
[null,null,"Punkte:",{"$f":"IF(SUM(C7:C11)=\"\",\"\",SUM(D7:E11))","v":0},null,null,null,"Punkte:",{"$f":"IF(SUM(H7:H11)=\"\",\"\",SUM(I7:J11))","v":0},null,null,null,"Punkte:",{"$f":"IF(SUM(M7:M11)=\"\",\"\",SUM(N7:O11))","v":0},null,null,null,null,null,null,null,null,null,null,null,10]
[]
[null,null,"Schütze - 1",null,null,null,null,"gesamt Punkte:",null,null,null,null,"Schütze - 2"]
[null,null,null,null,null,null,null,{"$f":"SUM(D12,I12,N12,D23,N23)","v":0}]
[]
[null,null,"Ringe:","Punkte:","Teiler:",null,null,null,null,null,null,null,"Ringe:","Punkte:","Teiler:"]
[null,"1.",null,{"$f":"IF(C18=\"n\",10500)+IF(C18=1,9500)+IF(C18=2,8500)+IF(C18=3,7500)+IF(C18=4,6500)+IF(C18=5,5500)+IF(C18=6,4500)+IF(C18=7,3500)+IF(C18=8,2500)+IF(C18=9,1500)","v":0},null,null,null,null,null,null,null,"1.",null,{"$f":"IF(M18=\"n\",10500)+IF(M18=1,9500)+IF(M18=2,8500)+IF(M18=3,7500)+IF(M18=4,6500)+IF(M18=5,5500)+IF(M18=6,4500)+IF(M18=7,3500)+IF(M18=8,2500)+IF(M18=9,1500)","v":0}]
[null,"2.",null,{"$f":"IF(C19=\"n\",10500)+IF(C19=1,9500)+IF(C19=2,8500)+IF(C19=3,7500)+IF(C19=4,6500)+IF(C19=5,5500)+IF(C19=6,4500)+IF(C19=7,3500)+IF(C19=8,2500)+IF(C19=9,1500)","v":0},null,null,null,null,null,null,null,"2.",null,{"$f":"IF(M19=\"n\",10500)+IF(M19=1,9500)+IF(M19=2,8500)+IF(M19=3,7500)+IF(M19=4,6500)+IF(M19=5,5500)+IF(M19=6,4500)+IF(M19=7,3500)+IF(M19=8,2500)+IF(M19=9,1500)","v":0}]
[null,"3.",null,{"$f":"IF(C20=\"n\",10500)+IF(C20=1,9500)+IF(C20=2,8500)+IF(C20=3,7500)+IF(C20=4,6500)+IF(C20=5,5500)+IF(C20=6,4500)+IF(C20=7,3500)+IF(C20=8,2500)+IF(C20=9,1500)","v":0},null,null,null,null,null,null,null,"3.",null,{"$f":"IF(M20=\"n\",10500)+IF(M20=1,9500)+IF(M20=2,8500)+IF(M20=3,7500)+IF(M20=4,6500)+IF(M20=5,5500)+IF(M20=6,4500)+IF(M20=7,3500)+IF(M20=8,2500)+IF(M20=9,1500)","v":0}]
[null,"4.",null,{"$f":"IF(C21=\"n\",10500)+IF(C21=1,9500)+IF(C21=2,8500)+IF(C21=3,7500)+IF(C21=4,6500)+IF(C21=5,5500)+IF(C21=6,4500)+IF(C21=7,3500)+IF(C21=8,2500)+IF(C21=9,1500)","v":0},null,null,null,null,null,null,null,"4.",null,{"$f":"IF(M21=\"n\",10500)+IF(M21=1,9500)+IF(M21=2,8500)+IF(M21=3,7500)+IF(M21=4,6500)+IF(M21=5,5500)+IF(M21=6,4500)+IF(M21=7,3500)+IF(M21=8,2500)+IF(M21=9,1500)","v":0}]
[null,"5.",null,{"$f":"IF(C22=\"n\",10500)+IF(C22=1,9500)+IF(C22=2,8500)+IF(C22=3,7500)+IF(C22=4,6500)+IF(C22=5,5500)+IF(C22=6,4500)+IF(C22=7,3500)+IF(C22=8,2500)+IF(C22=9,1500)","v":0},null,null,null,null,null,null,null,"5.",null,{"$f":"IF(M22=\"n\",10500)+IF(M22=1,9500)+IF(M22=2,8500)+IF(M22=3,7500)+IF(M22=4,6500)+IF(M22=5,5500)+IF(M22=6,4500)+IF(M22=7,3500)+IF(M22=8,2500)+IF(M22=9,1500)","v":0}]
[null,null,"Punkte:",{"$f":"IF(SUM(C18:C22)=\"\",\"\",SUM(D18:E22))","v":0},null,null,"* = Ersatzschütze",null,null,null,null,null,"Punkte:",{"$f":"IF(SUM(M18:M22)=\"\",\"\",SUM(N18:O22))","v":0}]

{"sheet":"10","index":10,"n_rows":23,"n_cols":26,"rows_kept":23,"cut":false,"hidden":false,"merged":[[14,12,14,14],[22,3,22,4],[22,13,22,14],[17,7,17,9],[18,7,18,9],[14,7,16,9],[22,6,23,9],[19,7,19,9],[20,7,20,9],[14,2,14,4],[21,7,21,9],[0,1,1,15],[2,12,2,14],[3,12,3,14],[11,13,11,14],[13,2,13,4],[13,7,13,9],[13,12,13,14],[2,7,2,9],[3,7,3,9],[11,8,11,9],[11,3,11,4],[2,2,2,4],[3,2,3,4]]}
[null,{"$f":"IF(HM!M8=\"\",\"Welcher Verein ?\",HM!M8)","v":"SV-Verein 10"}]
[null,null,null,null,null,null,null,null,null,null,null,null,null,null,null,null,{"$f":"IF(C4=\"\",\"\",IF(C7=\"\",\"\",IF(C8=\"\",\"\",IF(C9=\"\",\"\",IF(C10=\"\",\"\",IF(C11=\"\",\"\",1))))))","v":""},{"$f":"IF(H4=\"\",\"\",IF(H7=\"\",\"\",IF(H8=\"\",\"\",IF(H9=\"\",\"\",IF(H10=\"\",\"\",IF(H11=\"\",\"\",1))))))","v":""},{"$f":"IF(M4=\"\",\"\",IF(M7=\"\",\"\",IF(M8=\"\",\"\",IF(M9=\"\",\"\",IF(M10=\"\",\"\",IF(M11=\"\",\"\",1))))))","v":""},null,null,null,null,null,null,"N"]
[null,"Info","König:",null,null,null,null,"Adjutant:",null,null,null,null,"Präsident:",null,null,null,{"$f":"IF(C15=\"\",\"\",IF(C18=\"\",\"\",IF(C19=\"\",\"\",IF(C20=\"\",\"\",IF(C21=\"\",\"\",IF(C22=\"\",\"\",1))))))","v":""},{"$f":"IF(SUM(Q2:S2,Q3,S3)=5,1,0)","v":0},{"$f":"IF(M15=\"\",\"\",IF(M18=\"\",\"\",IF(M19=\"\",\"\",IF(M20=\"\",\"\",IF(M21=\"\",\"\",IF(M22=\"\",\"\",1))))))","v":""},null,null,null,null,null,null,1]
[null,null,null,null,null,null,null,null,null,null,null,null,null,null,null,null,null,null,null,null,null,null,null,null,null,2]
[null,null,null,null,null,null,null,null,null,null,null,null,null,null,null,null,null,null,null,null,null,null,null,null,null,3]
[null,null,"Ringe:","Punkte:","Teiler:",null,null,"Ringe:","Punkte:","Teiler:",null,null,"Ringe:","Punkte:","Teiler:",null,null,null,null,null,null,null,null,null,null,4]
[null,"1.",null,{"$f":"IF(C7=\"n\",10500)+IF(C7=1,9500)+IF(C7=2,8500)+IF(C7=3,7500)+IF(C7=4,6500)+IF(C7=5,5500)+IF(C7=6,4500)+IF(C7=7,3500)+IF(C7=8,2500)+IF(C7=9,1500)","v":0},null,null,"1.",null,{"$f":"IF(H7=\"n\",10500)+IF(H7=1,9500)+IF(H7=2,8500)+IF(H7=3,7500)+IF(H7=4,6500)+IF(H7=5,5500)+IF(H7=6,4500)+IF(H7=7,3500)+IF(H7=8,2500)+IF(H7=9,1500)","v":0},null,null,"1.",null,{"$f":"IF(M7=\"n\",10500)+IF(M7=1,9500)+IF(M7=2,8500)+IF(M7=3,7500)+IF(M7=4,6500)+IF(M7=5,5500)+IF(M7=6,4500)+IF(M7=7,3500)+IF(M7=8,2500)+IF(M7=9,1500)","v":0},null,null,null,null,null,null,null,null,null,null,null,5]
[null,"2.",null,{"$f":"IF(C8=\"n\",10500)+IF(C8=1,9500)+IF(C8=2,8500)+IF(C8=3,7500)+IF(C8=4,6500)+IF(C8=5,5500)+IF(C8=6,4500)+IF(C8=7,3500)+IF(C8=8,2500)+IF(C8=9,1500)","v":0},null,null,"2.",null,{"$f":"IF(H8=\"n\",10500)+IF(H8=1,9500)+IF(H8=2,8500)+IF(H8=3,7500)+IF(H8=4,6500)+IF(H8=5,5500)+IF(H8=6,4500)+IF(H8=7,3500)+IF(H8=8,2500)+IF(H8=9,1500)","v":0},null,null,"2.",null,{"$f":"IF(M8=\"n\",10500)+IF(M8=1,9500)+IF(M8=2,8500)+IF(M8=3,7500)+IF(M8=4,6500)+IF(M8=5,5500)+IF(M8=6,4500)+IF(M8=7,3500)+IF(M8=8,2500)+IF(M8=9,1500)","v":0},null,null,null,null,null,null,null,null,null,null,null,6]
[null,"3.",null,{"$f":"IF(C9=\"n\",10500)+IF(C9=1,9500)+IF(C9=2,8500)+IF(C9=3,7500)+IF(C9=4,6500)+IF(C9=5,5500)+IF(C9=6,4500)+IF(C9=7,3500)+IF(C9=8,2500)+IF(C9=9,1500)","v":0},null,null,"3.",null,{"$f":"IF(H9=\"n\",10500)+IF(H9=1,9500)+IF(H9=2,8500)+IF(H9=3,7500)+IF(H9=4,6500)+IF(H9=5,5500)+IF(H9=6,4500)+IF(H9=7,3500)+IF(H9=8,2500)+IF(H9=9,1500)","v":0},null,null,"3.",null,{"$f":"IF(M9=\"n\",10500)+IF(M9=1,9500)+IF(M9=2,8500)+IF(M9=3,7500)+IF(M9=4,6500)+IF(M9=5,5500)+IF(M9=6,4500)+IF(M9=7,3500)+IF(M9=8,2500)+IF(M9=9,1500)","v":0},null,null,null,null,null,null,null,null,null,null,null,7]
[null,"4.",null,{"$f":"IF(C10=\"n\",10500)+IF(C10=1,9500)+IF(C10=2,8500)+IF(C10=3,7500)+IF(C10=4,6500)+IF(C10=5,5500)+IF(C10=6,4500)+IF(C10=7,3500)+IF(C10=8,2500)+IF(C10=9,1500)","v":0},null,null,"4.",null,{"$f":"IF(H10=\"n\",10500)+IF(H10=1,9500)+IF(H10=2,8500)+IF(H10=3,7500)+IF(H10=4,6500)+IF(H10=5,5500)+IF(H10=6,4500)+IF(H10=7,3500)+IF(H10=8,2500)+IF(H10=9,1500)","v":0},null,null,"4.",null,{"$f":"IF(M10=\"n\",10500)+IF(M10=1,9500)+IF(M10=2,8500)+IF(M10=3,7500)+IF(M10=4,6500)+IF(M10=5,5500)+IF(M10=6,4500)+IF(M10=7,3500)+IF(M10=8,2500)+IF(M10=9,1500)","v":0},null,null,null,null,null,null,null,null,null,null,null,8]
[null,"5.",null,{"$f":"IF(C11=\"n\",10500)+IF(C11=1,9500)+IF(C11=2,8500)+IF(C11=3,7500)+IF(C11=4,6500)+IF(C11=5,5500)+IF(C11=6,4500)+IF(C11=7,3500)+IF(C11=8,2500)+IF(C11=9,1500)","v":0},null,null,"5.",null,{"$f":"IF(H11=\"n\",10500)+IF(H11=1,9500)+IF(H11=2,8500)+IF(H11=3,7500)+IF(H11=4,6500)+IF(H11=5,5500)+IF(H11=6,4500)+IF(H11=7,3500)+IF(H11=8,2500)+IF(H11=9,1500)","v":0},null,null,"5.",null,{"$f":"IF(M11=\"n\",10500)+IF(M11=1,9500)+IF(M11=2,8500)+IF(M11=3,7500)+IF(M11=4,6500)+IF(M11=5,5500)+IF(M11=6,4500)+IF(M11=7,3500)+IF(M11=8,2500)+IF(M11=9,1500)","v":0},null,null,null,null,null,null,null,null,null,null,null,9]
[null,null,"Punkte:",{"$f":"IF(SUM(C7:C11)=\"\",\"\",SUM(D7:E11))","v":0},null,null,null,"Punkte:",{"$f":"IF(SUM(H7:H11)=\"\",\"\",SUM(I7:J11))","v":0},null,null,null,"Punkte:",{"$f":"IF(SUM(M7:M11)=\"\",\"\",SUM(N7:O11))","v":0},null,null,null,null,null,null,null,null,null,null,null,10]
[]
[null,null,"Schütze - 1",null,null,null,null,"gesamt Punkte:",null,null,null,null,"Schütze - 2"]
[null,null,null,null,null,null,null,{"$f":"SUM(D12,I12,N12,D23,N23)","v":0}]
[]
[null,null,"Ringe:","Punkte:","Teiler:",null,null,null,null,null,null,null,"Ringe:","Punkte:","Teiler:"]
[null,"1.",null,{"$f":"IF(C18=\"n\",10500)+IF(C18=1,9500)+IF(C18=2,8500)+IF(C18=3,7500)+IF(C18=4,6500)+IF(C18=5,5500)+IF(C18=6,4500)+IF(C18=7,3500)+IF(C18=8,2500)+IF(C18=9,1500)","v":0},null,null,null,null,null,null,null,"1.",null,{"$f":"IF(M18=\"n\",10500)+IF(M18=1,9500)+IF(M18=2,8500)+IF(M18=3,7500)+IF(M18=4,6500)+IF(M18=5,5500)+IF(M18=6,4500)+IF(M18=7,3500)+IF(M18=8,2500)+IF(M18=9,1500)","v":0}]
[null,"2.",null,{"$f":"IF(C19=\"n\",10500)+IF(C19=1,9500)+IF(C19=2,8500)+IF(C19=3,7500)+IF(C19=4,6500)+IF(C19=5,5500)+IF(C19=6,4500)+IF(C19=7,3500)+IF(C19=8,2500)+IF(C19=9,1500)","v":0},null,null,null,null,null,null,null,"2.",null,{"$f":"IF(M19=\"n\",10500)+IF(M19=1,9500)+IF(M19=2,8500)+IF(M19=3,7500)+IF(M19=4,6500)+IF(M19=5,5500)+IF(M19=6,4500)+IF(M19=7,3500)+IF(M19=8,2500)+IF(M19=9,1500)","v":0}]
[null,"3.",null,{"$f":"IF(C20=\"n\",10500)+IF(C20=1,9500)+IF(C20=2,8500)+IF(C20=3,7500)+IF(C20=4,6500)+IF(C20=5,5500)+IF(C20=6,4500)+IF(C20=7,3500)+IF(C20=8,2500)+IF(C20=9,1500)","v":0},null,null,null,null,null,null,null,"3.",null,{"$f":"IF(M20=\"n\",10500)+IF(M20=1,9500)+IF(M20=2,8500)+IF(M20=3,7500)+IF(M20=4,6500)+IF(M20=5,5500)+IF(M20=6,4500)+IF(M20=7,3500)+IF(M20=8,2500)+IF(M20=9,1500)","v":0}]
[null,"4.",null,{"$f":"IF(C21=\"n\",10500)+IF(C21=1,9500)+IF(C21=2,8500)+IF(C21=3,7500)+IF(C21=4,6500)+IF(C21=5,5500)+IF(C21=6,4500)+IF(C21=7,3500)+IF(C21=8,2500)+IF(C21=9,1500)","v":0},null,null,null,null,null,null,null,"4.",null,{"$f":"IF(M21=\"n\",10500)+IF(M21=1,9500)+IF(M21=2,8500)+IF(M21=3,7500)+IF(M21=4,6500)+IF(M21=5,5500)+IF(M21=6,4500)+IF(M21=7,3500)+IF(M21=8,2500)+IF(M21=9,1500)","v":0}]
[null,"5.",null,{"$f":"IF(C22=\"n\",10500)+IF(C22=1,9500)+IF(C22=2,8500)+IF(C22=3,7500)+IF(C22=4,6500)+IF(C22=5,5500)+IF(C22=6,4500)+IF(C22=7,3500)+IF(C22=8,2500)+IF(C22=9,1500)","v":0},null,null,null,null,null,null,null,"5.",null,{"$f":"IF(M22=\"n\",10500)+IF(M22=1,9500)+IF(M22=2,8500)+IF(M22=3,7500)+IF(M22=4,6500)+IF(M22=5,5500)+IF(M22=6,4500)+IF(M22=7,3500)+IF(M22=8,2500)+IF(M22=9,1500)","v":0}]
[null,null,"Punkte:",{"$f":"IF(SUM(C18:C22)=\"\",\"\",SUM(D18:E22))","v":0},null,null,"* = Ersatzschütze",null,null,null,null,null,"Punkte:",{"$f":"IF(SUM(M18:M22)=\"\",\"\",SUM(N18:O22))","v":0}]

{"sheet":"11","index":11,"n_rows":23,"n_cols":26,"rows_kept":23,"cut":false,"hidden":false,"merged":[[0,1,1,15],[2,12,2,14],[3,12,3,14],[11,13,11,14],[13,2,13,4],[13,7,13,9],[13,12,13,14],[3,2,3,4],[2,7,2,9],[3,7,3,9],[11,8,11,9],[14,7,16,9],[11,3,11,4],[2,2,2,4],[14,12,14,14],[22,3,22,4],[22,13,22,14],[17,7,17,9],[18,7,18,9],[19,7,19,9],[20,7,20,9],[14,2,14,4],[21,7,21,9],[22,6,23,9]]}
[null,{"$f":"IF(HM!M11=\"\",\"Welcher Verein ?\",HM!M11)","v":"SV-Verein 11"}]
[null,null,null,null,null,null,null,null,null,null,null,null,null,null,null,null,{"$f":"IF(C4=\"\",\"\",IF(C7=\"\",\"\",IF(C8=\"\",\"\",IF(C9=\"\",\"\",IF(C10=\"\",\"\",IF(C11=\"\",\"\",1))))))","v":""},{"$f":"IF(H4=\"\",\"\",IF(H7=\"\",\"\",IF(H8=\"\",\"\",IF(H9=\"\",\"\",IF(H10=\"\",\"\",IF(H11=\"\",\"\",1))))))","v":""},{"$f":"IF(M4=\"\",\"\",IF(M7=\"\",\"\",IF(M8=\"\",\"\",IF(M9=\"\",\"\",IF(M10=\"\",\"\",IF(M11=\"\",\"\",1))))))","v":""},null,null,null,null,null,null,"N"]
[null,"Info","König:",null,null,null,null,"Adjutant:",null,null,null,null,"Präsident:",null,null,null,{"$f":"IF(C15=\"\",\"\",IF(C18=\"\",\"\",IF(C19=\"\",\"\",IF(C20=\"\",\"\",IF(C21=\"\",\"\",IF(C22=\"\",\"\",1))))))","v":""},{"$f":"IF(SUM(Q2:S2,Q3,S3)=5,1,0)","v":0},{"$f":"IF(M15=\"\",\"\",IF(M18=\"\",\"\",IF(M19=\"\",\"\",IF(M20=\"\",\"\",IF(M21=\"\",\"\",IF(M22=\"\",\"\",1))))))","v":""},null,null,null,null,null,null,1]
[null,null,null,null,null,null,null,null,null,null,null,null,null,null,null,null,null,null,null,null,null,null,null,null,null,2]
[null,null,null,null,null,null,null,null,null,null,null,null,null,null,null,null,null,null,null,null,null,null,null,null,null,3]
[null,null,"Ringe:","Punkte:","Teiler:",null,null,"Ringe:","Punkte:","Teiler:",null,null,"Ringe:","Punkte:","Teiler:",null,null,null,null,null,null,null,null,null,null,4]
[null,"1.",null,{"$f":"IF(C7=\"n\",10500)+IF(C7=1,9500)+IF(C7=2,8500)+IF(C7=3,7500)+IF(C7=4,6500)+IF(C7=5,5500)+IF(C7=6,4500)+IF(C7=7,3500)+IF(C7=8,2500)+IF(C7=9,1500)","v":0},null,null,"1.",null,{"$f":"IF(H7=\"n\",10500)+IF(H7=1,9500)+IF(H7=2,8500)+IF(H7=3,7500)+IF(H7=4,6500)+IF(H7=5,5500)+IF(H7=6,4500)+IF(H7=7,3500)+IF(H7=8,2500)+IF(H7=9,1500)","v":0},null,null,"1.",null,{"$f":"IF(M7=\"n\",10500)+IF(M7=1,9500)+IF(M7=2,8500)+IF(M7=3,7500)+IF(M7=4,6500)+IF(M7=5,5500)+IF(M7=6,4500)+IF(M7=7,3500)+IF(M7=8,2500)+IF(M7=9,1500)","v":0},null,null,null,null,null,null,null,null,null,null,null,5]
[null,"2.",null,{"$f":"IF(C8=\"n\",10500)+IF(C8=1,9500)+IF(C8=2,8500)+IF(C8=3,7500)+IF(C8=4,6500)+IF(C8=5,5500)+IF(C8=6,4500)+IF(C8=7,3500)+IF(C8=8,2500)+IF(C8=9,1500)","v":0},null,null,"2.",null,{"$f":"IF(H8=\"n\",10500)+IF(H8=1,9500)+IF(H8=2,8500)+IF(H8=3,7500)+IF(H8=4,6500)+IF(H8=5,5500)+IF(H8=6,4500)+IF(H8=7,3500)+IF(H8=8,2500)+IF(H8=9,1500)","v":0},null,null,"2.",null,{"$f":"IF(M8=\"n\",10500)+IF(M8=1,9500)+IF(M8=2,8500)+IF(M8=3,7500)+IF(M8=4,6500)+IF(M8=5,5500)+IF(M8=6,4500)+IF(M8=7,3500)+IF(M8=8,2500)+IF(M8=9,1500)","v":0},null,null,null,null,null,null,null,null,null,null,null,6]
[null,"3.",null,{"$f":"IF(C9=\"n\",10500)+IF(C9=1,9500)+IF(C9=2,8500)+IF(C9=3,7500)+IF(C9=4,6500)+IF(C9=5,5500)+IF(C9=6,4500)+IF(C9=7,3500)+IF(C9=8,2500)+IF(C9=9,1500)","v":0},null,null,"3.",null,{"$f":"IF(H9=\"n\",10500)+IF(H9=1,9500)+IF(H9=2,8500)+IF(H9=3,7500)+IF(H9=4,6500)+IF(H9=5,5500)+IF(H9=6,4500)+IF(H9=7,3500)+IF(H9=8,2500)+IF(H9=9,1500)","v":0},null,null,"3.",null,{"$f":"IF(M9=\"n\",10500)+IF(M9=1,9500)+IF(M9=2,8500)+IF(M9=3,7500)+IF(M9=4,6500)+IF(M9=5,5500)+IF(M9=6,4500)+IF(M9=7,3500)+IF(M9=8,2500)+IF(M9=9,1500)","v":0},null,null,null,null,null,null,null,null,null,null,null,7]
[null,"4.",null,{"$f":"IF(C10=\"n\",10500)+IF(C10=1,9500)+IF(C10=2,8500)+IF(C10=3,7500)+IF(C10=4,6500)+IF(C10=5,5500)+IF(C10=6,4500)+IF(C10=7,3500)+IF(C10=8,2500)+IF(C10=9,1500)","v":0},null,null,"4.",null,{"$f":"IF(H10=\"n\",10500)+IF(H10=1,9500)+IF(H10=2,8500)+IF(H10=3,7500)+IF(H10=4,6500)+IF(H10=5,5500)+IF(H10=6,4500)+IF(H10=7,3500)+IF(H10=8,2500)+IF(H10=9,1500)","v":0},null,null,"4.",null,{"$f":"IF(M10=\"n\",10500)+IF(M10=1,9500)+IF(M10=2,8500)+IF(M10=3,7500)+IF(M10=4,6500)+IF(M10=5,5500)+IF(M10=6,4500)+IF(M10=7,3500)+IF(M10=8,2500)+IF(M10=9,1500)","v":0},null,null,null,null,null,null,null,null,null,null,null,8]
[null,"5.",null,{"$f":"IF(C11=\"n\",10500)+IF(C11=1,9500)+IF(C11=2,8500)+IF(C11=3,7500)+IF(C11=4,6500)+IF(C11=5,5500)+IF(C11=6,4500)+IF(C11=7,3500)+IF(C11=8,2500)+IF(C11=9,1500)","v":0},null,null,"5.",null,{"$f":"IF(H11=\"n\",10500)+IF(H11=1,9500)+IF(H11=2,8500)+IF(H11=3,7500)+IF(H11=4,6500)+IF(H11=5,5500)+IF(H11=6,4500)+IF(H11=7,3500)+IF(H11=8,2500)+IF(H11=9,1500)","v":0},null,null,"5.",null,{"$f":"IF(M11=\"n\",10500)+IF(M11=1,9500)+IF(M11=2,8500)+IF(M11=3,7500)+IF(M11=4,6500)+IF(M11=5,5500)+IF(M11=6,4500)+IF(M11=7,3500)+IF(M11=8,2500)+IF(M11=9,1500)","v":0},null,null,null,null,null,null,null,null,null,null,null,9]
[null,null,"Punkte:",{"$f":"IF(SUM(C7:C11)=\"\",\"\",SUM(D7:E11))","v":0},null,null,null,"Punkte:",{"$f":"IF(SUM(H7:H11)=\"\",\"\",SUM(I7:J11))","v":0},null,null,null,"Punkte:",{"$f":"IF(SUM(M7:M11)=\"\",\"\",SUM(N7:O11))","v":0},null,null,null,null,null,null,null,null,null,null,null,10]
[]
[null,null,"Schütze - 1",null,null,null,null,"gesamt Punkte:",null,null,null,null,"Schütze - 2"]
[null,null,null,null,null,null,null,{"$f":"SUM(D12,I12,N12,D23,N23)","v":0}]
[]
[null,null,"Ringe:","Punkte:","Teiler:",null,null,null,null,null,null,null,"Ringe:","Punkte:","Teiler:"]
[null,"1.",null,{"$f":"IF(C18=\"n\",10500)+IF(C18=1,9500)+IF(C18=2,8500)+IF(C18=3,7500)+IF(C18=4,6500)+IF(C18=5,5500)+IF(C18=6,4500)+IF(C18=7,3500)+IF(C18=8,2500)+IF(C18=9,1500)","v":0},null,null,null,null,null,null,null,"1.",null,{"$f":"IF(M18=\"n\",10500)+IF(M18=1,9500)+IF(M18=2,8500)+IF(M18=3,7500)+IF(M18=4,6500)+IF(M18=5,5500)+IF(M18=6,4500)+IF(M18=7,3500)+IF(M18=8,2500)+IF(M18=9,1500)","v":0}]
[null,"2.",null,{"$f":"IF(C19=\"n\",10500)+IF(C19=1,9500)+IF(C19=2,8500)+IF(C19=3,7500)+IF(C19=4,6500)+IF(C19=5,5500)+IF(C19=6,4500)+IF(C19=7,3500)+IF(C19=8,2500)+IF(C19=9,1500)","v":0},null,null,null,null,null,null,null,"2.",null,{"$f":"IF(M19=\"n\",10500)+IF(M19=1,9500)+IF(M19=2,8500)+IF(M19=3,7500)+IF(M19=4,6500)+IF(M19=5,5500)+IF(M19=6,4500)+IF(M19=7,3500)+IF(M19=8,2500)+IF(M19=9,1500)","v":0}]
[null,"3.",null,{"$f":"IF(C20=\"n\",10500)+IF(C20=1,9500)+IF(C20=2,8500)+IF(C20=3,7500)+IF(C20=4,6500)+IF(C20=5,5500)+IF(C20=6,4500)+IF(C20=7,3500)+IF(C20=8,2500)+IF(C20=9,1500)","v":0},null,null,null,null,null,null,null,"3.",null,{"$f":"IF(M20=\"n\",10500)+IF(M20=1,9500)+IF(M20=2,8500)+IF(M20=3,7500)+IF(M20=4,6500)+IF(M20=5,5500)+IF(M20=6,4500)+IF(M20=7,3500)+IF(M20=8,2500)+IF(M20=9,1500)","v":0}]
[null,"4.",null,{"$f":"IF(C21=\"n\",10500)+IF(C21=1,9500)+IF(C21=2,8500)+IF(C21=3,7500)+IF(C21=4,6500)+IF(C21=5,5500)+IF(C21=6,4500)+IF(C21=7,3500)+IF(C21=8,2500)+IF(C21=9,1500)","v":0},null,null,null,null,null,null,null,"4.",null,{"$f":"IF(M21=\"n\",10500)+IF(M21=1,9500)+IF(M21=2,8500)+IF(M21=3,7500)+IF(M21=4,6500)+IF(M21=5,5500)+IF(M21=6,4500)+IF(M21=7,3500)+IF(M21=8,2500)+IF(M21=9,1500)","v":0}]
[null,"5.",null,{"$f":"IF(C22=\"n\",10500)+IF(C22=1,9500)+IF(C22=2,8500)+IF(C22=3,7500)+IF(C22=4,6500)+IF(C22=5,5500)+IF(C22=6,4500)+IF(C22=7,3500)+IF(C22=8,2500)+IF(C22=9,1500)","v":0},null,null,null,null,null,null,null,"5.",null,{"$f":"IF(M22=\"n\",10500)+IF(M22=1,9500)+IF(M22=2,8500)+IF(M22=3,7500)+IF(M22=4,6500)+IF(M22=5,5500)+IF(M22=6,4500)+IF(M22=7,3500)+IF(M22=8,2500)+IF(M22=9,1500)","v":0}]
[null,null,"Punkte:",{"$f":"IF(SUM(C18:C22)=\"\",\"\",SUM(D18:E22))","v":0},null,null,"* = Ersatzschütze",null,null,null,null,null,"Punkte:",{"$f":"IF(SUM(M18:M22)=\"\",\"\",SUM(N18:O22))","v":0}]

{"sheet":"12","index":12,"n_rows":23,"n_cols":26,"rows_kept":23,"cut":false,"hidden":false,"merged":[[14,12,14,14],[22,3,22,4],[22,13,22,14],[17,7,17,9],[18,7,18,9],[14,7,16,9],[22,6,23,9],[19,7,19,9],[20,7,20,9],[14,2,14,4],[21,7,21,9],[0,1,1,15],[2,12,2,14],[3,12,3,14],[11,13,11,14],[13,2,13,4],[13,7,13,9],[13,12,13,14],[2,7,2,9],[3,7,3,9],[11,8,11,9],[11,3,11,4],[2,2,2,4],[3,2,3,4]]}
[null,{"$f":"IF(HM!M14=\"\",\"Welcher Verein ?\",HM!M14)","v":"SV-Verein 12"}]
[null,null,null,null,null,null,null,null,null,null,null,null,null,null,null,null,{"$f":"IF(C4=\"\",\"\",IF(C7=\"\",\"\",IF(C8=\"\",\"\",IF(C9=\"\",\"\",IF(C10=\"\",\"\",IF(C11=\"\",\"\",1))))))","v":""},{"$f":"IF(H4=\"\",\"\",IF(H7=\"\",\"\",IF(H8=\"\",\"\",IF(H9=\"\",\"\",IF(H10=\"\",\"\",IF(H11=\"\",\"\",1))))))","v":""},{"$f":"IF(M4=\"\",\"\",IF(M7=\"\",\"\",IF(M8=\"\",\"\",IF(M9=\"\",\"\",IF(M10=\"\",\"\",IF(M11=\"\",\"\",1))))))","v":""},null,null,null,null,null,null,"N"]
[null,"Info","König:",null,null,null,null,"Adjutant:",null,null,null,null,"Präsident:",null,null,null,{"$f":"IF(C15=\"\",\"\",IF(C18=\"\",\"\",IF(C19=\"\",\"\",IF(C20=\"\",\"\",IF(C21=\"\",\"\",IF(C22=\"\",\"\",1))))))","v":""},{"$f":"IF(SUM(Q2:S2,Q3,S3)=5,1,0)","v":0},{"$f":"IF(M15=\"\",\"\",IF(M18=\"\",\"\",IF(M19=\"\",\"\",IF(M20=\"\",\"\",IF(M21=\"\",\"\",IF(M22=\"\",\"\",1))))))","v":""},null,null,null,null,null,null,1]
[null,null,null,null,null,null,null,null,null,null,null,null,null,null,null,null,null,null,null,null,null,null,null,null,null,2]
[null,null,null,null,null,null,null,null,null,null,null,null,null,null,null,null,null,null,null,null,null,null,null,null,null,3]
[null,null,"Ringe:","Punkte:","Teiler:",null,null,"Ringe:","Punkte:","Teiler:",null,null,"Ringe:","Punkte:","Teiler:",null,null,null,null,null,null,null,null,null,null,4]
[null,"1.",null,{"$f":"IF(C7=\"n\",10500)+IF(C7=1,9500)+IF(C7=2,8500)+IF(C7=3,7500)+IF(C7=4,6500)+IF(C7=5,5500)+IF(C7=6,4500)+IF(C7=7,3500)+IF(C7=8,2500)+IF(C7=9,1500)","v":0},null,null,"1.",null,{"$f":"IF(H7=\"n\",10500)+IF(H7=1,9500)+IF(H7=2,8500)+IF(H7=3,7500)+IF(H7=4,6500)+IF(H7=5,5500)+IF(H7=6,4500)+IF(H7=7,3500)+IF(H7=8,2500)+IF(H7=9,1500)","v":0},null,null,"1.",null,{"$f":"IF(M7=\"n\",10500)+IF(M7=1,9500)+IF(M7=2,8500)+IF(M7=3,7500)+IF(M7=4,6500)+IF(M7=5,5500)+IF(M7=6,4500)+IF(M7=7,3500)+IF(M7=8,2500)+IF(M7=9,1500)","v":0},null,null,null,null,null,null,null,null,null,null,null,5]
[null,"2.",null,{"$f":"IF(C8=\"n\",10500)+IF(C8=1,9500)+IF(C8=2,8500)+IF(C8=3,7500)+IF(C8=4,6500)+IF(C8=5,5500)+IF(C8=6,4500)+IF(C8=7,3500)+IF(C8=8,2500)+IF(C8=9,1500)","v":0},null,null,"2.",null,{"$f":"IF(H8=\"n\",10500)+IF(H8=1,9500)+IF(H8=2,8500)+IF(H8=3,7500)+IF(H8=4,6500)+IF(H8=5,5500)+IF(H8=6,4500)+IF(H8=7,3500)+IF(H8=8,2500)+IF(H8=9,1500)","v":0},null,null,"2.",null,{"$f":"IF(M8=\"n\",10500)+IF(M8=1,9500)+IF(M8=2,8500)+IF(M8=3,7500)+IF(M8=4,6500)+IF(M8=5,5500)+IF(M8=6,4500)+IF(M8=7,3500)+IF(M8=8,2500)+IF(M8=9,1500)","v":0},null,null,null,null,null,null,null,null,null,null,null,6]
[null,"3.",null,{"$f":"IF(C9=\"n\",10500)+IF(C9=1,9500)+IF(C9=2,8500)+IF(C9=3,7500)+IF(C9=4,6500)+IF(C9=5,5500)+IF(C9=6,4500)+IF(C9=7,3500)+IF(C9=8,2500)+IF(C9=9,1500)","v":0},null,null,"3.",null,{"$f":"IF(H9=\"n\",10500)+IF(H9=1,9500)+IF(H9=2,8500)+IF(H9=3,7500)+IF(H9=4,6500)+IF(H9=5,5500)+IF(H9=6,4500)+IF(H9=7,3500)+IF(H9=8,2500)+IF(H9=9,1500)","v":0},null,null,"3.",null,{"$f":"IF(M9=\"n\",10500)+IF(M9=1,9500)+IF(M9=2,8500)+IF(M9=3,7500)+IF(M9=4,6500)+IF(M9=5,5500)+IF(M9=6,4500)+IF(M9=7,3500)+IF(M9=8,2500)+IF(M9=9,1500)","v":0},null,null,null,null,null,null,null,null,null,null,null,7]
[null,"4.",null,{"$f":"IF(C10=\"n\",10500)+IF(C10=1,9500)+IF(C10=2,8500)+IF(C10=3,7500)+IF(C10=4,6500)+IF(C10=5,5500)+IF(C10=6,4500)+IF(C10=7,3500)+IF(C10=8,2500)+IF(C10=9,1500)","v":0},null,null,"4.",null,{"$f":"IF(H10=\"n\",10500)+IF(H10=1,9500)+IF(H10=2,8500)+IF(H10=3,7500)+IF(H10=4,6500)+IF(H10=5,5500)+IF(H10=6,4500)+IF(H10=7,3500)+IF(H10=8,2500)+IF(H10=9,1500)","v":0},null,null,"4.",null,{"$f":"IF(M10=\"n\",10500)+IF(M10=1,9500)+IF(M10=2,8500)+IF(M10=3,7500)+IF(M10=4,6500)+IF(M10=5,5500)+IF(M10=6,4500)+IF(M10=7,3500)+IF(M10=8,2500)+IF(M10=9,1500)","v":0},null,null,null,null,null,null,null,null,null,null,null,8]
[null,"5.",null,{"$f":"IF(C11=\"n\",10500)+IF(C11=1,9500)+IF(C11=2,8500)+IF(C11=3,7500)+IF(C11=4,6500)+IF(C11=5,5500)+IF(C11=6,4500)+IF(C11=7,3500)+IF(C11=8,2500)+IF(C11=9,1500)","v":0},null,null,"5.",null,{"$f":"IF(H11=\"n\",10500)+IF(H11=1,9500)+IF(H11=2,8500)+IF(H11=3,7500)+IF(H11=4,6500)+IF(H11=5,5500)+IF(H11=6,4500)+IF(H11=7,3500)+IF(H11=8,2500)+IF(H11=9,1500)","v":0},null,null,"5.",null,{"$f":"IF(M11=\"n\",10500)+IF(M11=1,9500)+IF(M11=2,8500)+IF(M11=3,7500)+IF(M11=4,6500)+IF(M11=5,5500)+IF(M11=6,4500)+IF(M11=7,3500)+IF(M11=8,2500)+IF(M11=9,1500)","v":0},null,null,null,null,null,null,null,null,null,null,null,9]
[null,null,"Punkte:",{"$f":"IF(SUM(C7:C11)=\"\",\"\",SUM(D7:E11))","v":0},null,null,null,"Punkte:",{"$f":"IF(SUM(H7:H11)=\"\",\"\",SUM(I7:J11))","v":0},null,null,null,"Punkte:",{"$f":"IF(SUM(M7:M11)=\"\",\"\",SUM(N7:O11))","v":0},null,null,null,null,null,null,null,null,null,null,null,10]
[]
[null,null,"Schütze - 1",null,null,null,null,"gesamt Punkte:",null,null,null,null,"Schütze - 2"]
[null,null,null,null,null,null,null,{"$f":"SUM(D12,I12,N12,D23,N23)","v":0}]
[]
[null,null,"Ringe:","Punkte:","Teiler:",null,null,null,null,null,null,null,"Ringe:","Punkte:","Teiler:"]
[null,"1.",null,{"$f":"IF(C18=\"n\",10500)+IF(C18=1,9500)+IF(C18=2,8500)+IF(C18=3,7500)+IF(C18=4,6500)+IF(C18=5,5500)+IF(C18=6,4500)+IF(C18=7,3500)+IF(C18=8,2500)+IF(C18=9,1500)","v":0},null,null,null,null,null,null,null,"1.",null,{"$f":"IF(M18=\"n\",10500)+IF(M18=1,9500)+IF(M18=2,8500)+IF(M18=3,7500)+IF(M18=4,6500)+IF(M18=5,5500)+IF(M18=6,4500)+IF(M18=7,3500)+IF(M18=8,2500)+IF(M18=9,1500)","v":0}]
[null,"2.",null,{"$f":"IF(C19=\"n\",10500)+IF(C19=1,9500)+IF(C19=2,8500)+IF(C19=3,7500)+IF(C19=4,6500)+IF(C19=5,5500)+IF(C19=6,4500)+IF(C19=7,3500)+IF(C19=8,2500)+IF(C19=9,1500)","v":0},null,null,null,null,null,null,null,"2.",null,{"$f":"IF(M19=\"n\",10500)+IF(M19=1,9500)+IF(M19=2,8500)+IF(M19=3,7500)+IF(M19=4,6500)+IF(M19=5,5500)+IF(M19=6,4500)+IF(M19=7,3500)+IF(M19=8,2500)+IF(M19=9,1500)","v":0}]
[null,"3.",null,{"$f":"IF(C20=\"n\",10500)+IF(C20=1,9500)+IF(C20=2,8500)+IF(C20=3,7500)+IF(C20=4,6500)+IF(C20=5,5500)+IF(C20=6,4500)+IF(C20=7,3500)+IF(C20=8,2500)+IF(C20=9,1500)","v":0},null,null,null,null,null,null,null,"3.",null,{"$f":"IF(M20=\"n\",10500)+IF(M20=1,9500)+IF(M20=2,8500)+IF(M20=3,7500)+IF(M20=4,6500)+IF(M20=5,5500)+IF(M20=6,4500)+IF(M20=7,3500)+IF(M20=8,2500)+IF(M20=9,1500)","v":0}]
[null,"4.",null,{"$f":"IF(C21=\"n\",10500)+IF(C21=1,9500)+IF(C21=2,8500)+IF(C21=3,7500)+IF(C21=4,6500)+IF(C21=5,5500)+IF(C21=6,4500)+IF(C21=7,3500)+IF(C21=8,2500)+IF(C21=9,1500)","v":0},null,null,null,null,null,null,null,"4.",null,{"$f":"IF(M21=\"n\",10500)+IF(M21=1,9500)+IF(M21=2,8500)+IF(M21=3,7500)+IF(M21=4,6500)+IF(M21=5,5500)+IF(M21=6,4500)+IF(M21=7,3500)+IF(M21=8,2500)+IF(M21=9,1500)","v":0}]
[null,"5.",null,{"$f":"IF(C22=\"n\",10500)+IF(C22=1,9500)+IF(C22=2,8500)+IF(C22=3,7500)+IF(C22=4,6500)+IF(C22=5,5500)+IF(C22=6,4500)+IF(C22=7,3500)+IF(C22=8,2500)+IF(C22=9,1500)","v":0},null,null,null,null,null,null,null,"5.",null,{"$f":"IF(M22=\"n\",10500)+IF(M22=1,9500)+IF(M22=2,8500)+IF(M22=3,7500)+IF(M22=4,6500)+IF(M22=5,5500)+IF(M22=6,4500)+IF(M22=7,3500)+IF(M22=8,2500)+IF(M22=9,1500)","v":0}]
[null,null,"Punkte:",{"$f":"IF(SUM(C18:C22)=\"\",\"\",SUM(D18:E22))","v":0},null,null,"* = Ersatzschütze",null,null,null,null,null,"Punkte:",{"$f":"IF(SUM(M18:M22)=\"\",\"\",SUM(N18:O22))","v":0}]

{"sheet":"13","index":13,"n_rows":23,"n_cols":26,"rows_kept":23,"cut":false,"hidden":false,"merged":[[0,1,1,15],[2,12,2,14],[3,12,3,14],[11,13,11,14],[13,2,13,4],[13,7,13,9],[13,12,13,14],[3,2,3,4],[2,7,2,9],[3,7,3,9],[11,8,11,9],[14,7,16,9],[11,3,11,4],[2,2,2,4],[14,12,14,14],[22,3,22,4],[22,13,22,14],[17,7,17,9],[18,7,18,9],[19,7,19,9],[20,7,20,9],[14,2,14,4],[21,7,21,9],[22,6,23,9]]}
[null,{"$f":"IF(HM!M17=\"\",\"Welcher Verein ?\",HM!M17)","v":"SV-Verein 13"}]
[null,null,null,null,null,null,null,null,null,null,null,null,null,null,null,null,{"$f":"IF(C4=\"\",\"\",IF(C7=\"\",\"\",IF(C8=\"\",\"\",IF(C9=\"\",\"\",IF(C10=\"\",\"\",IF(C11=\"\",\"\",1))))))","v":""},{"$f":"IF(H4=\"\",\"\",IF(H7=\"\",\"\",IF(H8=\"\",\"\",IF(H9=\"\",\"\",IF(H10=\"\",\"\",IF(H11=\"\",\"\",1))))))","v":""},{"$f":"IF(M4=\"\",\"\",IF(M7=\"\",\"\",IF(M8=\"\",\"\",IF(M9=\"\",\"\",IF(M10=\"\",\"\",IF(M11=\"\",\"\",1))))))","v":""},null,null,null,null,null,null,"N"]
[null,"Info","König:",null,null,null,null,"Adjutant:",null,null,null,null,"Präsident:",null,null,null,{"$f":"IF(C15=\"\",\"\",IF(C18=\"\",\"\",IF(C19=\"\",\"\",IF(C20=\"\",\"\",IF(C21=\"\",\"\",IF(C22=\"\",\"\",1))))))","v":""},{"$f":"IF(SUM(Q2:S2,Q3,S3)=5,1,0)","v":0},{"$f":"IF(M15=\"\",\"\",IF(M18=\"\",\"\",IF(M19=\"\",\"\",IF(M20=\"\",\"\",IF(M21=\"\",\"\",IF(M22=\"\",\"\",1))))))","v":""},null,null,null,null,null,null,1]
[null,null,null,null,null,null,null,null,null,null,null,null,null,null,null,null,null,null,null,null,null,null,null,null,null,2]
[null,null,null,null,null,null,null,null,null,null,null,null,null,null,null,null,null,null,null,null,null,null,null,null,null,3]
[null,null,"Ringe:","Punkte:","Teiler:",null,null,"Ringe:","Punkte:","Teiler:",null,null,"Ringe:","Punkte:","Teiler:",null,null,null,null,null,null,null,null,null,null,4]
[null,"1.",null,{"$f":"IF(C7=\"n\",10500)+IF(C7=1,9500)+IF(C7=2,8500)+IF(C7=3,7500)+IF(C7=4,6500)+IF(C7=5,5500)+IF(C7=6,4500)+IF(C7=7,3500)+IF(C7=8,2500)+IF(C7=9,1500)","v":0},null,null,"1.",null,{"$f":"IF(H7=\"n\",10500)+IF(H7=1,9500)+IF(H7=2,8500)+IF(H7=3,7500)+IF(H7=4,6500)+IF(H7=5,5500)+IF(H7=6,4500)+IF(H7=7,3500)+IF(H7=8,2500)+IF(H7=9,1500)","v":0},null,null,"1.",null,{"$f":"IF(M7=\"n\",10500)+IF(M7=1,9500)+IF(M7=2,8500)+IF(M7=3,7500)+IF(M7=4,6500)+IF(M7=5,5500)+IF(M7=6,4500)+IF(M7=7,3500)+IF(M7=8,2500)+IF(M7=9,1500)","v":0},null,null,null,null,null,null,null,null,null,null,null,5]
[null,"2.",null,{"$f":"IF(C8=\"n\",10500)+IF(C8=1,9500)+IF(C8=2,8500)+IF(C8=3,7500)+IF(C8=4,6500)+IF(C8=5,5500)+IF(C8=6,4500)+IF(C8=7,3500)+IF(C8=8,2500)+IF(C8=9,1500)","v":0},null,null,"2.",null,{"$f":"IF(H8=\"n\",10500)+IF(H8=1,9500)+IF(H8=2,8500)+IF(H8=3,7500)+IF(H8=4,6500)+IF(H8=5,5500)+IF(H8=6,4500)+IF(H8=7,3500)+IF(H8=8,2500)+IF(H8=9,1500)","v":0},null,null,"2.",null,{"$f":"IF(M8=\"n\",10500)+IF(M8=1,9500)+IF(M8=2,8500)+IF(M8=3,7500)+IF(M8=4,6500)+IF(M8=5,5500)+IF(M8=6,4500)+IF(M8=7,3500)+IF(M8=8,2500)+IF(M8=9,1500)","v":0},null,null,null,null,null,null,null,null,null,null,null,6]
[null,"3.",null,{"$f":"IF(C9=\"n\",10500)+IF(C9=1,9500)+IF(C9=2,8500)+IF(C9=3,7500)+IF(C9=4,6500)+IF(C9=5,5500)+IF(C9=6,4500)+IF(C9=7,3500)+IF(C9=8,2500)+IF(C9=9,1500)","v":0},null,null,"3.",null,{"$f":"IF(H9=\"n\",10500)+IF(H9=1,9500)+IF(H9=2,8500)+IF(H9=3,7500)+IF(H9=4,6500)+IF(H9=5,5500)+IF(H9=6,4500)+IF(H9=7,3500)+IF(H9=8,2500)+IF(H9=9,1500)","v":0},null,null,"3.",null,{"$f":"IF(M9=\"n\",10500)+IF(M9=1,9500)+IF(M9=2,8500)+IF(M9=3,7500)+IF(M9=4,6500)+IF(M9=5,5500)+IF(M9=6,4500)+IF(M9=7,3500)+IF(M9=8,2500)+IF(M9=9,1500)","v":0},null,null,null,null,null,null,null,null,null,null,null,7]
[null,"4.",null,{"$f":"IF(C10=\"n\",10500)+IF(C10=1,9500)+IF(C10=2,8500)+IF(C10=3,7500)+IF(C10=4,6500)+IF(C10=5,5500)+IF(C10=6,4500)+IF(C10=7,3500)+IF(C10=8,2500)+IF(C10=9,1500)","v":0},null,null,"4.",null,{"$f":"IF(H10=\"n\",10500)+IF(H10=1,9500)+IF(H10=2,8500)+IF(H10=3,7500)+IF(H10=4,6500)+IF(H10=5,5500)+IF(H10=6,4500)+IF(H10=7,3500)+IF(H10=8,2500)+IF(H10=9,1500)","v":0},null,null,"4.",null,{"$f":"IF(M10=\"n\",10500)+IF(M10=1,9500)+IF(M10=2,8500)+IF(M10=3,7500)+IF(M10=4,6500)+IF(M10=5,5500)+IF(M10=6,4500)+IF(M10=7,3500)+IF(M10=8,2500)+IF(M10=9,1500)","v":0},null,null,null,null,null,null,null,null,null,null,null,8]
[null,"5.",null,{"$f":"IF(C11=\"n\",10500)+IF(C11=1,9500)+IF(C11=2,8500)+IF(C11=3,7500)+IF(C11=4,6500)+IF(C11=5,5500)+IF(C11=6,4500)+IF(C11=7,3500)+IF(C11=8,2500)+IF(C11=9,1500)","v":0},null,null,"5.",null,{"$f":"IF(H11=\"n\",10500)+IF(H11=1,9500)+IF(H11=2,8500)+IF(H11=3,7500)+IF(H11=4,6500)+IF(H11=5,5500)+IF(H11=6,4500)+IF(H11=7,3500)+IF(H11=8,2500)+IF(H11=9,1500)","v":0},null,null,"5.",null,{"$f":"IF(M11=\"n\",10500)+IF(M11=1,9500)+IF(M11=2,8500)+IF(M11=3,7500)+IF(M11=4,6500)+IF(M11=5,5500)+IF(M11=6,4500)+IF(M11=7,3500)+IF(M11=8,2500)+IF(M11=9,1500)","v":0},null,null,null,null,null,null,null,null,null,null,null,9]
[null,null,"Punkte:",{"$f":"IF(SUM(C7:C11)=\"\",\"\",SUM(D7:E11))","v":0},null,null,null,"Punkte:",{"$f":"IF(SUM(H7:H11)=\"\",\"\",SUM(I7:J11))","v":0},null,null,null,"Punkte:",{"$f":"IF(SUM(M7:M11)=\"\",\"\",SUM(N7:O11))","v":0},null,null,null,null,null,null,null,null,null,null,null,10]
[]
[null,null,"Schütze - 1",null,null,null,null,"gesamt Punkte:",null,null,null,null,"Schütze - 2"]
[null,null,null,null,null,null,null,{"$f":"SUM(D12,I12,N12,D23,N23)","v":0}]
[]
[null,null,"Ringe:","Punkte:","Teiler:",null,null,null,null,null,null,null,"Ringe:","Punkte:","Teiler:"]
[null,"1.",null,{"$f":"IF(C18=\"n\",10500)+IF(C18=1,9500)+IF(C18=2,8500)+IF(C18=3,7500)+IF(C18=4,6500)+IF(C18=5,5500)+IF(C18=6,4500)+IF(C18=7,3500)+IF(C18=8,2500)+IF(C18=9,1500)","v":0},null,null,null,null,null,null,null,"1.",null,{"$f":"IF(M18=\"n\",10500)+IF(M18=1,9500)+IF(M18=2,8500)+IF(M18=3,7500)+IF(M18=4,6500)+IF(M18=5,5500)+IF(M18=6,4500)+IF(M18=7,3500)+IF(M18=8,2500)+IF(M18=9,1500)","v":0}]
[null,"2.",null,{"$f":"IF(C19=\"n\",10500)+IF(C19=1,9500)+IF(C19=2,8500)+IF(C19=3,7500)+IF(C19=4,6500)+IF(C19=5,5500)+IF(C19=6,4500)+IF(C19=7,3500)+IF(C19=8,2500)+IF(C19=9,1500)","v":0},null,null,null,null,null,null,null,"2.",null,{"$f":"IF(M19=\"n\",10500)+IF(M19=1,9500)+IF(M19=2,8500)+IF(M19=3,7500)+IF(M19=4,6500)+IF(M19=5,5500)+IF(M19=6,4500)+IF(M19=7,3500)+IF(M19=8,2500)+IF(M19=9,1500)","v":0}]
[null,"3.",null,{"$f":"IF(C20=\"n\",10500)+IF(C20=1,9500)+IF(C20=2,8500)+IF(C20=3,7500)+IF(C20=4,6500)+IF(C20=5,5500)+IF(C20=6,4500)+IF(C20=7,3500)+IF(C20=8,2500)+IF(C20=9,1500)","v":0},null,null,null,null,null,null,null,"3.",null,{"$f":"IF(M20=\"n\",10500)+IF(M20=1,9500)+IF(M20=2,8500)+IF(M20=3,7500)+IF(M20=4,6500)+IF(M20=5,5500)+IF(M20=6,4500)+IF(M20=7,3500)+IF(M20=8,2500)+IF(M20=9,1500)","v":0}]
[null,"4.",null,{"$f":"IF(C21=\"n\",10500)+IF(C21=1,9500)+IF(C21=2,8500)+IF(C21=3,7500)+IF(C21=4,6500)+IF(C21=5,5500)+IF(C21=6,4500)+IF(C21=7,3500)+IF(C21=8,2500)+IF(C21=9,1500)","v":0},null,null,null,null,null,null,null,"4.",null,{"$f":"IF(M21=\"n\",10500)+IF(M21=1,9500)+IF(M21=2,8500)+IF(M21=3,7500)+IF(M21=4,6500)+IF(M21=5,5500)+IF(M21=6,4500)+IF(M21=7,3500)+IF(M21=8,2500)+IF(M21=9,1500)","v":0}]
[null,"5.",null,{"$f":"IF(C22=\"n\",10500)+IF(C22=1,9500)+IF(C22=2,8500)+IF(C22=3,7500)+IF(C22=4,6500)+IF(C22=5,5500)+IF(C22=6,4500)+IF(C22=7,3500)+IF(C22=8,2500)+IF(C22=9,1500)","v":0},null,null,null,null,null,null,null,"5.",null,{"$f":"IF(M22=\"n\",10500)+IF(M22=1,9500)+IF(M22=2,8500)+IF(M22=3,7500)+IF(M22=4,6500)+IF(M22=5,5500)+IF(M22=6,4500)+IF(M22=7,3500)+IF(M22=8,2500)+IF(M22=9,1500)","v":0}]
[null,null,"Punkte:",{"$f":"IF(SUM(C18:C22)=\"\",\"\",SUM(D18:E22))","v":0},null,null,"* = Ersatzschütze",null,null,null,null,null,"Punkte:",{"$f":"IF(SUM(M18:M22)=\"\",\"\",SUM(N18:O22))","v":0}]

{"sheet":"14","index":14,"n_rows":23,"n_cols":26,"rows_kept":23,"cut":false,"hidden":false,"merged":[[14,12,14,14],[22,3,22,4],[22,13,22,14],[17,7,17,9],[18,7,18,9],[14,7,16,9],[22,6,23,9],[19,7,19,9],[20,7,20,9],[14,2,14,4],[21,7,21,9],[0,1,1,15],[2,12,2,14],[3,12,3,14],[11,13,11,14],[13,2,13,4],[13,7,13,9],[13,12,13,14],[2,7,2,9],[3,7,3,9],[11,8,11,9],[11,3,11,4],[2,2,2,4],[3,2,3,4]]}
[null,{"$f":"IF(HM!M20=\"\",\"Welcher Verein ?\",HM!M20)","v":"SV-Verein 14"}]
[null,null,null,null,null,null,null,null,null,null,null,null,null,null,null,null,{"$f":"IF(C4=\"\",\"\",IF(C7=\"\",\"\",IF(C8=\"\",\"\",IF(C9=\"\",\"\",IF(C10=\"\",\"\",IF(C11=\"\",\"\",1))))))","v":""},{"$f":"IF(H4=\"\",\"\",IF(H7=\"\",\"\",IF(H8=\"\",\"\",IF(H9=\"\",\"\",IF(H10=\"\",\"\",IF(H11=\"\",\"\",1))))))","v":""},{"$f":"IF(M4=\"\",\"\",IF(M7=\"\",\"\",IF(M8=\"\",\"\",IF(M9=\"\",\"\",IF(M10=\"\",\"\",IF(M11=\"\",\"\",1))))))","v":""},null,null,null,null,null,null,"N"]
[null,"Info","König:",null,null,null,null,"Adjutant:",null,null,null,null,"Präsident:",null,null,null,{"$f":"IF(C15=\"\",\"\",IF(C18=\"\",\"\",IF(C19=\"\",\"\",IF(C20=\"\",\"\",IF(C21=\"\",\"\",IF(C22=\"\",\"\",1))))))","v":""},{"$f":"IF(SUM(Q2:S2,Q3,S3)=5,1,0)","v":0},{"$f":"IF(M15=\"\",\"\",IF(M18=\"\",\"\",IF(M19=\"\",\"\",IF(M20=\"\",\"\",IF(M21=\"\",\"\",IF(M22=\"\",\"\",1))))))","v":""},null,null,null,null,null,null,1]
[null,null,null,null,null,null,null,null,null,null,null,null,null,null,null,null,null,null,null,null,null,null,null,null,null,2]
[null,null,null,null,null,null,null,null,null,null,null,null,null,null,null,null,null,null,null,null,null,null,null,null,null,3]
[null,null,"Ringe:","Punkte:","Teiler:",null,null,"Ringe:","Punkte:","Teiler:",null,null,"Ringe:","Punkte:","Teiler:",null,null,null,null,null,null,null,null,null,null,4]
[null,"1.",null,{"$f":"IF(C7=\"n\",10500)+IF(C7=1,9500)+IF(C7=2,8500)+IF(C7=3,7500)+IF(C7=4,6500)+IF(C7=5,5500)+IF(C7=6,4500)+IF(C7=7,3500)+IF(C7=8,2500)+IF(C7=9,1500)","v":0},null,null,"1.",null,{"$f":"IF(H7=\"n\",10500)+IF(H7=1,9500)+IF(H7=2,8500)+IF(H7=3,7500)+IF(H7=4,6500)+IF(H7=5,5500)+IF(H7=6,4500)+IF(H7=7,3500)+IF(H7=8,2500)+IF(H7=9,1500)","v":0},null,null,"1.",null,{"$f":"IF(M7=\"n\",10500)+IF(M7=1,9500)+IF(M7=2,8500)+IF(M7=3,7500)+IF(M7=4,6500)+IF(M7=5,5500)+IF(M7=6,4500)+IF(M7=7,3500)+IF(M7=8,2500)+IF(M7=9,1500)","v":0},null,null,null,null,null,null,null,null,null,null,null,5]
[null,"2.",null,{"$f":"IF(C8=\"n\",10500)+IF(C8=1,9500)+IF(C8=2,8500)+IF(C8=3,7500)+IF(C8=4,6500)+IF(C8=5,5500)+IF(C8=6,4500)+IF(C8=7,3500)+IF(C8=8,2500)+IF(C8=9,1500)","v":0},null,null,"2.",null,{"$f":"IF(H8=\"n\",10500)+IF(H8=1,9500)+IF(H8=2,8500)+IF(H8=3,7500)+IF(H8=4,6500)+IF(H8=5,5500)+IF(H8=6,4500)+IF(H8=7,3500)+IF(H8=8,2500)+IF(H8=9,1500)","v":0},null,null,"2.",null,{"$f":"IF(M8=\"n\",10500)+IF(M8=1,9500)+IF(M8=2,8500)+IF(M8=3,7500)+IF(M8=4,6500)+IF(M8=5,5500)+IF(M8=6,4500)+IF(M8=7,3500)+IF(M8=8,2500)+IF(M8=9,1500)","v":0},null,null,null,null,null,null,null,null,null,null,null,6]
[null,"3.",null,{"$f":"IF(C9=\"n\",10500)+IF(C9=1,9500)+IF(C9=2,8500)+IF(C9=3,7500)+IF(C9=4,6500)+IF(C9=5,5500)+IF(C9=6,4500)+IF(C9=7,3500)+IF(C9=8,2500)+IF(C9=9,1500)","v":0},null,null,"3.",null,{"$f":"IF(H9=\"n\",10500)+IF(H9=1,9500)+IF(H9=2,8500)+IF(H9=3,7500)+IF(H9=4,6500)+IF(H9=5,5500)+IF(H9=6,4500)+IF(H9=7,3500)+IF(H9=8,2500)+IF(H9=9,1500)","v":0},null,null,"3.",null,{"$f":"IF(M9=\"n\",10500)+IF(M9=1,9500)+IF(M9=2,8500)+IF(M9=3,7500)+IF(M9=4,6500)+IF(M9=5,5500)+IF(M9=6,4500)+IF(M9=7,3500)+IF(M9=8,2500)+IF(M9=9,1500)","v":0},null,null,null,null,null,null,null,null,null,null,null,7]
[null,"4.",null,{"$f":"IF(C10=\"n\",10500)+IF(C10=1,9500)+IF(C10=2,8500)+IF(C10=3,7500)+IF(C10=4,6500)+IF(C10=5,5500)+IF(C10=6,4500)+IF(C10=7,3500)+IF(C10=8,2500)+IF(C10=9,1500)","v":0},null,null,"4.",null,{"$f":"IF(H10=\"n\",10500)+IF(H10=1,9500)+IF(H10=2,8500)+IF(H10=3,7500)+IF(H10=4,6500)+IF(H10=5,5500)+IF(H10=6,4500)+IF(H10=7,3500)+IF(H10=8,2500)+IF(H10=9,1500)","v":0},null,null,"4.",null,{"$f":"IF(M10=\"n\",10500)+IF(M10=1,9500)+IF(M10=2,8500)+IF(M10=3,7500)+IF(M10=4,6500)+IF(M10=5,5500)+IF(M10=6,4500)+IF(M10=7,3500)+IF(M10=8,2500)+IF(M10=9,1500)","v":0},null,null,null,null,null,null,null,null,null,null,null,8]
[null,"5.",null,{"$f":"IF(C11=\"n\",10500)+IF(C11=1,9500)+IF(C11=2,8500)+IF(C11=3,7500)+IF(C11=4,6500)+IF(C11=5,5500)+IF(C11=6,4500)+IF(C11=7,3500)+IF(C11=8,2500)+IF(C11=9,1500)","v":0},null,null,"5.",null,{"$f":"IF(H11=\"n\",10500)+IF(H11=1,9500)+IF(H11=2,8500)+IF(H11=3,7500)+IF(H11=4,6500)+IF(H11=5,5500)+IF(H11=6,4500)+IF(H11=7,3500)+IF(H11=8,2500)+IF(H11=9,1500)","v":0},null,null,"5.",null,{"$f":"IF(M11=\"n\",10500)+IF(M11=1,9500)+IF(M11=2,8500)+IF(M11=3,7500)+IF(M11=4,6500)+IF(M11=5,5500)+IF(M11=6,4500)+IF(M11=7,3500)+IF(M11=8,2500)+IF(M11=9,1500)","v":0},null,null,null,null,null,null,null,null,null,null,null,9]
[null,null,"Punkte:",{"$f":"IF(SUM(C7:C11)=\"\",\"\",SUM(D7:E11))","v":0},null,null,null,"Punkte:",{"$f":"IF(SUM(H7:H11)=\"\",\"\",SUM(I7:J11))","v":0},null,null,null,"Punkte:",{"$f":"IF(SUM(M7:M11)=\"\",\"\",SUM(N7:O11))","v":0},null,null,null,null,null,null,null,null,null,null,null,10]
[]
[null,null,"Schütze - 1",null,null,null,null,"gesamt Punkte:",null,null,null,null,"Schütze - 2"]
[null,null,null,null,null,null,null,{"$f":"SUM(D12,I12,N12,D23,N23)","v":0}]
[]
[null,null,"Ringe:","Punkte:","Teiler:",null,null,null,null,null,null,null,"Ringe:","Punkte:","Teiler:"]
[null,"1.",null,{"$f":"IF(C18=\"n\",10500)+IF(C18=1,9500)+IF(C18=2,8500)+IF(C18=3,7500)+IF(C18=4,6500)+IF(C18=5,5500)+IF(C18=6,4500)+IF(C18=7,3500)+IF(C18=8,2500)+IF(C18=9,1500)","v":0},null,null,null,null,null,null,null,"1.",null,{"$f":"IF(M18=\"n\",10500)+IF(M18=1,9500)+IF(M18=2,8500)+IF(M18=3,7500)+IF(M18=4,6500)+IF(M18=5,5500)+IF(M18=6,4500)+IF(M18=7,3500)+IF(M18=8,2500)+IF(M18=9,1500)","v":0}]
[null,"2.",null,{"$f":"IF(C19=\"n\",10500)+IF(C19=1,9500)+IF(C19=2,8500)+IF(C19=3,7500)+IF(C19=4,6500)+IF(C19=5,5500)+IF(C19=6,4500)+IF(C19=7,3500)+IF(C19=8,2500)+IF(C19=9,1500)","v":0},null,null,null,null,null,null,null,"2.",null,{"$f":"IF(M19=\"n\",10500)+IF(M19=1,9500)+IF(M19=2,8500)+IF(M19=3,7500)+IF(M19=4,6500)+IF(M19=5,5500)+IF(M19=6,4500)+IF(M19=7,3500)+IF(M19=8,2500)+IF(M19=9,1500)","v":0}]
[null,"3.",null,{"$f":"IF(C20=\"n\",10500)+IF(C20=1,9500)+IF(C20=2,8500)+IF(C20=3,7500)+IF(C20=4,6500)+IF(C20=5,5500)+IF(C20=6,4500)+IF(C20=7,3500)+IF(C20=8,2500)+IF(C20=9,1500)","v":0},null,null,null,null,null,null,null,"3.",null,{"$f":"IF(M20=\"n\",10500)+IF(M20=1,9500)+IF(M20=2,8500)+IF(M20=3,7500)+IF(M20=4,6500)+IF(M20=5,5500)+IF(M20=6,4500)+IF(M20=7,3500)+IF(M20=8,2500)+IF(M20=9,1500)","v":0}]
[null,"4.",null,{"$f":"IF(C21=\"n\",10500)+IF(C21=1,9500)+IF(C21=2,8500)+IF(C21=3,7500)+IF(C21=4,6500)+IF(C21=5,5500)+IF(C21=6,4500)+IF(C21=7,3500)+IF(C21=8,2500)+IF(C21=9,1500)","v":0},null,null,null,null,null,null,null,"4.",null,{"$f":"IF(M21=\"n\",10500)+IF(M21=1,9500)+IF(M21=2,8500)+IF(M21=3,7500)+IF(M21=4,6500)+IF(M21=5,5500)+IF(M21=6,4500)+IF(M21=7,3500)+IF(M21=8,2500)+IF(M21=9,1500)","v":0}]
[null,"5.",null,{"$f":"IF(C22=\"n\",10500)+IF(C22=1,9500)+IF(C22=2,8500)+IF(C22=3,7500)+IF(C22=4,6500)+IF(C22=5,5500)+IF(C22=6,4500)+IF(C22=7,3500)+IF(C22=8,2500)+IF(C22=9,1500)","v":0},null,null,null,null,null,null,null,"5.",null,{"$f":"IF(M22=\"n\",10500)+IF(M22=1,9500)+IF(M22=2,8500)+IF(M22=3,7500)+IF(M22=4,6500)+IF(M22=5,5500)+IF(M22=6,4500)+IF(M22=7,3500)+IF(M22=8,2500)+IF(M22=9,1500)","v":0}]
[null,null,"Punkte:",{"$f":"IF(SUM(C18:C22)=\"\",\"\",SUM(D18:E22))","v":0},null,null,"* = Ersatzschütze",null,null,null,null,null,"Punkte:",{"$f":"IF(SUM(M18:M22)=\"\",\"\",SUM(N18:O22))","v":0}]

{"sheet":"15","index":15,"n_rows":23,"n_cols":26,"rows_kept":23,"cut":false,"hidden":false,"merged":[[0,1,1,15],[2,12,2,14],[3,12,3,14],[11,13,11,14],[13,2,13,4],[13,7,13,9],[13,12,13,14],[3,2,3,4],[2,7,2,9],[3,7,3,9],[11,8,11,9],[14,7,16,9],[11,3,11,4],[2,2,2,4],[14,12,14,14],[22,3,22,4],[22,13,22,14],[17,7,17,9],[18,7,18,9],[19,7,19,9],[20,7,20,9],[14,2,14,4],[21,7,21,9],[22,6,23,9]]}
[null,{"$f":"IF(HM!M23=\"\",\"Welcher Verein ?\",HM!M23)","v":"SV-Verein 15"}]
[null,null,null,null,null,null,null,null,null,null,null,null,null,null,null,null,{"$f":"IF(C4=\"\",\"\",IF(C7=\"\",\"\",IF(C8=\"\",\"\",IF(C9=\"\",\"\",IF(C10=\"\",\"\",IF(C11=\"\",\"\",1))))))","v":""},{"$f":"IF(H4=\"\",\"\",IF(H7=\"\",\"\",IF(H8=\"\",\"\",IF(H9=\"\",\"\",IF(H10=\"\",\"\",IF(H11=\"\",\"\",1))))))","v":""},{"$f":"IF(M4=\"\",\"\",IF(M7=\"\",\"\",IF(M8=\"\",\"\",IF(M9=\"\",\"\",IF(M10=\"\",\"\",IF(M11=\"\",\"\",1))))))","v":""},null,null,null,null,null,null,"N"]
[null,"Info","König:",null,null,null,null,"Adjutant:",null,null,null,null,"Präsident:",null,null,null,{"$f":"IF(C15=\"\",\"\",IF(C18=\"\",\"\",IF(C19=\"\",\"\",IF(C20=\"\",\"\",IF(C21=\"\",\"\",IF(C22=\"\",\"\",1))))))","v":""},{"$f":"IF(SUM(Q2:S2,Q3,S3)=5,1,0)","v":0},{"$f":"IF(M15=\"\",\"\",IF(M18=\"\",\"\",IF(M19=\"\",\"\",IF(M20=\"\",\"\",IF(M21=\"\",\"\",IF(M22=\"\",\"\",1))))))","v":""},null,null,null,null,null,null,1]
[null,null,null,null,null,null,null,null,null,null,null,null,null,null,null,null,null,null,null,null,null,null,null,null,null,2]
[null,null,null,null,null,null,null,null,null,null,null,null,null,null,null,null,null,null,null,null,null,null,null,null,null,3]
[null,null,"Ringe:","Punkte:","Teiler:",null,null,"Ringe:","Punkte:","Teiler:",null,null,"Ringe:","Punkte:","Teiler:",null,null,null,null,null,null,null,null,null,null,4]
[null,"1.",null,{"$f":"IF(C7=\"n\",10500)+IF(C7=1,9500)+IF(C7=2,8500)+IF(C7=3,7500)+IF(C7=4,6500)+IF(C7=5,5500)+IF(C7=6,4500)+IF(C7=7,3500)+IF(C7=8,2500)+IF(C7=9,1500)","v":0},null,null,"1.",null,{"$f":"IF(H7=\"n\",10500)+IF(H7=1,9500)+IF(H7=2,8500)+IF(H7=3,7500)+IF(H7=4,6500)+IF(H7=5,5500)+IF(H7=6,4500)+IF(H7=7,3500)+IF(H7=8,2500)+IF(H7=9,1500)","v":0},null,null,"1.",null,{"$f":"IF(M7=\"n\",10500)+IF(M7=1,9500)+IF(M7=2,8500)+IF(M7=3,7500)+IF(M7=4,6500)+IF(M7=5,5500)+IF(M7=6,4500)+IF(M7=7,3500)+IF(M7=8,2500)+IF(M7=9,1500)","v":0},null,null,null,null,null,null,null,null,null,null,null,5]
[null,"2.",null,{"$f":"IF(C8=\"n\",10500)+IF(C8=1,9500)+IF(C8=2,8500)+IF(C8=3,7500)+IF(C8=4,6500)+IF(C8=5,5500)+IF(C8=6,4500)+IF(C8=7,3500)+IF(C8=8,2500)+IF(C8=9,1500)","v":0},null,null,"2.",null,{"$f":"IF(H8=\"n\",10500)+IF(H8=1,9500)+IF(H8=2,8500)+IF(H8=3,7500)+IF(H8=4,6500)+IF(H8=5,5500)+IF(H8=6,4500)+IF(H8=7,3500)+IF(H8=8,2500)+IF(H8=9,1500)","v":0},null,null,"2.",null,{"$f":"IF(M8=\"n\",10500)+IF(M8=1,9500)+IF(M8=2,8500)+IF(M8=3,7500)+IF(M8=4,6500)+IF(M8=5,5500)+IF(M8=6,4500)+IF(M8=7,3500)+IF(M8=8,2500)+IF(M8=9,1500)","v":0},null,null,null,null,null,null,null,null,null,null,null,6]
[null,"3.",null,{"$f":"IF(C9=\"n\",10500)+IF(C9=1,9500)+IF(C9=2,8500)+IF(C9=3,7500)+IF(C9=4,6500)+IF(C9=5,5500)+IF(C9=6,4500)+IF(C9=7,3500)+IF(C9=8,2500)+IF(C9=9,1500)","v":0},null,null,"3.",null,{"$f":"IF(H9=\"n\",10500)+IF(H9=1,9500)+IF(H9=2,8500)+IF(H9=3,7500)+IF(H9=4,6500)+IF(H9=5,5500)+IF(H9=6,4500)+IF(H9=7,3500)+IF(H9=8,2500)+IF(H9=9,1500)","v":0},null,null,"3.",null,{"$f":"IF(M9=\"n\",10500)+IF(M9=1,9500)+IF(M9=2,8500)+IF(M9=3,7500)+IF(M9=4,6500)+IF(M9=5,5500)+IF(M9=6,4500)+IF(M9=7,3500)+IF(M9=8,2500)+IF(M9=9,1500)","v":0},null,null,null,null,null,null,null,null,null,null,null,7]
[null,"4.",null,{"$f":"IF(C10=\"n\",10500)+IF(C10=1,9500)+IF(C10=2,8500)+IF(C10=3,7500)+IF(C10=4,6500)+IF(C10=5,5500)+IF(C10=6,4500)+IF(C10=7,3500)+IF(C10=8,2500)+IF(C10=9,1500)","v":0},null,null,"4.",null,{"$f":"IF(H10=\"n\",10500)+IF(H10=1,9500)+IF(H10=2,8500)+IF(H10=3,7500)+IF(H10=4,6500)+IF(H10=5,5500)+IF(H10=6,4500)+IF(H10=7,3500)+IF(H10=8,2500)+IF(H10=9,1500)","v":0},null,null,"4.",null,{"$f":"IF(M10=\"n\",10500)+IF(M10=1,9500)+IF(M10=2,8500)+IF(M10=3,7500)+IF(M10=4,6500)+IF(M10=5,5500)+IF(M10=6,4500)+IF(M10=7,3500)+IF(M10=8,2500)+IF(M10=9,1500)","v":0},null,null,null,null,null,null,null,null,null,null,null,8]
[null,"5.",null,{"$f":"IF(C11=\"n\",10500)+IF(C11=1,9500)+IF(C11=2,8500)+IF(C11=3,7500)+IF(C11=4,6500)+IF(C11=5,5500)+IF(C11=6,4500)+IF(C11=7,3500)+IF(C11=8,2500)+IF(C11=9,1500)","v":0},null,null,"5.",null,{"$f":"IF(H11=\"n\",10500)+IF(H11=1,9500)+IF(H11=2,8500)+IF(H11=3,7500)+IF(H11=4,6500)+IF(H11=5,5500)+IF(H11=6,4500)+IF(H11=7,3500)+IF(H11=8,2500)+IF(H11=9,1500)","v":0},null,null,"5.",null,{"$f":"IF(M11=\"n\",10500)+IF(M11=1,9500)+IF(M11=2,8500)+IF(M11=3,7500)+IF(M11=4,6500)+IF(M11=5,5500)+IF(M11=6,4500)+IF(M11=7,3500)+IF(M11=8,2500)+IF(M11=9,1500)","v":0},null,null,null,null,null,null,null,null,null,null,null,9]
[null,null,"Punkte:",{"$f":"IF(SUM(C7:C11)=\"\",\"\",SUM(D7:E11))","v":0},null,null,null,"Punkte:",{"$f":"IF(SUM(H7:H11)=\"\",\"\",SUM(I7:J11))","v":0},null,null,null,"Punkte:",{"$f":"IF(SUM(M7:M11)=\"\",\"\",SUM(N7:O11))","v":0},null,null,null,null,null,null,null,null,null,null,null,10]
[]
[null,null,"Schütze - 1",null,null,null,null,"gesamt Punkte:",null,null,null,null,"Schütze - 2"]
[null,null,null,null,null,null,null,{"$f":"SUM(D12,I12,N12,D23,N23)","v":0}]
[]
[null,null,"Ringe:","Punkte:","Teiler:",null,null,null,null,null,null,null,"Ringe:","Punkte:","Teiler:"]
[null,"1.",null,{"$f":"IF(C18=\"n\",10500)+IF(C18=1,9500)+IF(C18=2,8500)+IF(C18=3,7500)+IF(C18=4,6500)+IF(C18=5,5500)+IF(C18=6,4500)+IF(C18=7,3500)+IF(C18=8,2500)+IF(C18=9,1500)","v":0},null,null,null,null,null,null,null,"1.",null,{"$f":"IF(M18=\"n\",10500)+IF(M18=1,9500)+IF(M18=2,8500)+IF(M18=3,7500)+IF(M18=4,6500)+IF(M18=5,5500)+IF(M18=6,4500)+IF(M18=7,3500)+IF(M18=8,2500)+IF(M18=9,1500)","v":0}]
[null,"2.",null,{"$f":"IF(C19=\"n\",10500)+IF(C19=1,9500)+IF(C19=2,8500)+IF(C19=3,7500)+IF(C19=4,6500)+IF(C19=5,5500)+IF(C19=6,4500)+IF(C19=7,3500)+IF(C19=8,2500)+IF(C19=9,1500)","v":0},null,null,null,null,null,null,null,"2.",null,{"$f":"IF(M19=\"n\",10500)+IF(M19=1,9500)+IF(M19=2,8500)+IF(M19=3,7500)+IF(M19=4,6500)+IF(M19=5,5500)+IF(M19=6,4500)+IF(M19=7,3500)+IF(M19=8,2500)+IF(M19=9,1500)","v":0}]
[null,"3.",null,{"$f":"IF(C20=\"n\",10500)+IF(C20=1,9500)+IF(C20=2,8500)+IF(C20=3,7500)+IF(C20=4,6500)+IF(C20=5,5500)+IF(C20=6,4500)+IF(C20=7,3500)+IF(C20=8,2500)+IF(C20=9,1500)","v":0},null,null,null,null,null,null,null,"3.",null,{"$f":"IF(M20=\"n\",10500)+IF(M20=1,9500)+IF(M20=2,8500)+IF(M20=3,7500)+IF(M20=4,6500)+IF(M20=5,5500)+IF(M20=6,4500)+IF(M20=7,3500)+IF(M20=8,2500)+IF(M20=9,1500)","v":0}]
[null,"4.",null,{"$f":"IF(C21=\"n\",10500)+IF(C21=1,9500)+IF(C21=2,8500)+IF(C21=3,7500)+IF(C21=4,6500)+IF(C21=5,5500)+IF(C21=6,4500)+IF(C21=7,3500)+IF(C21=8,2500)+IF(C21=9,1500)","v":0},null,null,null,null,null,null,null,"4.",null,{"$f":"IF(M21=\"n\",10500)+IF(M21=1,9500)+IF(M21=2,8500)+IF(M21=3,7500)+IF(M21=4,6500)+IF(M21=5,5500)+IF(M21=6,4500)+IF(M21=7,3500)+IF(M21=8,2500)+IF(M21=9,1500)","v":0}]
[null,"5.",null,{"$f":"IF(C22=\"n\",10500)+IF(C22=1,9500)+IF(C22=2,8500)+IF(C22=3,7500)+IF(C22=4,6500)+IF(C22=5,5500)+IF(C22=6,4500)+IF(C22=7,3500)+IF(C22=8,2500)+IF(C22=9,1500)","v":0},null,null,null,null,null,null,null,"5.",null,{"$f":"IF(M22=\"n\",10500)+IF(M22=1,9500)+IF(M22=2,8500)+IF(M22=3,7500)+IF(M22=4,6500)+IF(M22=5,5500)+IF(M22=6,4500)+IF(M22=7,3500)+IF(M22=8,2500)+IF(M22=9,1500)","v":0}]
[null,null,"Punkte:",{"$f":"IF(SUM(C18:C22)=\"\",\"\",SUM(D18:E22))","v":0},null,null,"* = Ersatzschütze",null,null,null,null,null,"Punkte:",{"$f":"IF(SUM(M18:M22)=\"\",\"\",SUM(N18:O22))","v":0}]

{"sheet":"16","index":16,"n_rows":23,"n_cols":26,"rows_kept":23,"cut":false,"hidden":false,"merged":[[14,12,14,14],[22,3,22,4],[22,13,22,14],[17,7,17,9],[18,7,18,9],[14,7,16,9],[22,6,23,9],[19,7,19,9],[20,7,20,9],[14,2,14,4],[21,7,21,9],[0,1,1,15],[2,12,2,14],[3,12,3,14],[11,13,11,14],[13,2,13,4],[13,7,13,9],[13,12,13,14],[2,7,2,9],[3,7,3,9],[11,8,11,9],[11,3,11,4],[2,2,2,4],[3,2,3,4]]}
[null,{"$f":"IF(HM!M26=\"\",\"Welcher Verein ?\",HM!M26)","v":"SV-Verein 16"}]
[null,null,null,null,null,null,null,null,null,null,null,null,null,null,null,null,{"$f":"IF(C4=\"\",\"\",IF(C7=\"\",\"\",IF(C8=\"\",\"\",IF(C9=\"\",\"\",IF(C10=\"\",\"\",IF(C11=\"\",\"\",1))))))","v":""},{"$f":"IF(H4=\"\",\"\",IF(H7=\"\",\"\",IF(H8=\"\",\"\",IF(H9=\"\",\"\",IF(H10=\"\",\"\",IF(H11=\"\",\"\",1))))))","v":""},{"$f":"IF(M4=\"\",\"\",IF(M7=\"\",\"\",IF(M8=\"\",\"\",IF(M9=\"\",\"\",IF(M10=\"\",\"\",IF(M11=\"\",\"\",1))))))","v":""},null,null,null,null,null,null,"N"]
[null,"Info","König:",null,null,null,null,"Adjutant:",null,null,null,null,"Präsident:",null,null,null,{"$f":"IF(C15=\"\",\"\",IF(C18=\"\",\"\",IF(C19=\"\",\"\",IF(C20=\"\",\"\",IF(C21=\"\",\"\",IF(C22=\"\",\"\",1))))))","v":""},{"$f":"IF(SUM(Q2:S2,Q3,S3)=5,1,0)","v":0},{"$f":"IF(M15=\"\",\"\",IF(M18=\"\",\"\",IF(M19=\"\",\"\",IF(M20=\"\",\"\",IF(M21=\"\",\"\",IF(M22=\"\",\"\",1))))))","v":""},null,null,null,null,null,null,1]
[null,null,null,null,null,null,null,null,null,null,null,null,null,null,null,null,null,null,null,null,null,null,null,null,null,2]
[null,null,null,null,null,null,null,null,null,null,null,null,null,null,null,null,null,null,null,null,null,null,null,null,null,3]
[null,null,"Ringe:","Punkte:","Teiler:",null,null,"Ringe:","Punkte:","Teiler:",null,null,"Ringe:","Punkte:","Teiler:",null,null,null,null,null,null,null,null,null,null,4]
[null,"1.",null,{"$f":"IF(C7=\"n\",10500)+IF(C7=1,9500)+IF(C7=2,8500)+IF(C7=3,7500)+IF(C7=4,6500)+IF(C7=5,5500)+IF(C7=6,4500)+IF(C7=7,3500)+IF(C7=8,2500)+IF(C7=9,1500)","v":0},null,null,"1.",null,{"$f":"IF(H7=\"n\",10500)+IF(H7=1,9500)+IF(H7=2,8500)+IF(H7=3,7500)+IF(H7=4,6500)+IF(H7=5,5500)+IF(H7=6,4500)+IF(H7=7,3500)+IF(H7=8,2500)+IF(H7=9,1500)","v":0},null,null,"1.",null,{"$f":"IF(M7=\"n\",10500)+IF(M7=1,9500)+IF(M7=2,8500)+IF(M7=3,7500)+IF(M7=4,6500)+IF(M7=5,5500)+IF(M7=6,4500)+IF(M7=7,3500)+IF(M7=8,2500)+IF(M7=9,1500)","v":0},null,null,null,null,null,null,null,null,null,null,null,5]
[null,"2.",null,{"$f":"IF(C8=\"n\",10500)+IF(C8=1,9500)+IF(C8=2,8500)+IF(C8=3,7500)+IF(C8=4,6500)+IF(C8=5,5500)+IF(C8=6,4500)+IF(C8=7,3500)+IF(C8=8,2500)+IF(C8=9,1500)","v":0},null,null,"2.",null,{"$f":"IF(H8=\"n\",10500)+IF(H8=1,9500)+IF(H8=2,8500)+IF(H8=3,7500)+IF(H8=4,6500)+IF(H8=5,5500)+IF(H8=6,4500)+IF(H8=7,3500)+IF(H8=8,2500)+IF(H8=9,1500)","v":0},null,null,"2.",null,{"$f":"IF(M8=\"n\",10500)+IF(M8=1,9500)+IF(M8=2,8500)+IF(M8=3,7500)+IF(M8=4,6500)+IF(M8=5,5500)+IF(M8=6,4500)+IF(M8=7,3500)+IF(M8=8,2500)+IF(M8=9,1500)","v":0},null,null,null,null,null,null,null,null,null,null,null,6]
[null,"3.",null,{"$f":"IF(C9=\"n\",10500)+IF(C9=1,9500)+IF(C9=2,8500)+IF(C9=3,7500)+IF(C9=4,6500)+IF(C9=5,5500)+IF(C9=6,4500)+IF(C9=7,3500)+IF(C9=8,2500)+IF(C9=9,1500)","v":0},null,null,"3.",null,{"$f":"IF(H9=\"n\",10500)+IF(H9=1,9500)+IF(H9=2,8500)+IF(H9=3,7500)+IF(H9=4,6500)+IF(H9=5,5500)+IF(H9=6,4500)+IF(H9=7,3500)+IF(H9=8,2500)+IF(H9=9,1500)","v":0},null,null,"3.",null,{"$f":"IF(M9=\"n\",10500)+IF(M9=1,9500)+IF(M9=2,8500)+IF(M9=3,7500)+IF(M9=4,6500)+IF(M9=5,5500)+IF(M9=6,4500)+IF(M9=7,3500)+IF(M9=8,2500)+IF(M9=9,1500)","v":0},null,null,null,null,null,null,null,null,null,null,null,7]
[null,"4.",null,{"$f":"IF(C10=\"n\",10500)+IF(C10=1,9500)+IF(C10=2,8500)+IF(C10=3,7500)+IF(C10=4,6500)+IF(C10=5,5500)+IF(C10=6,4500)+IF(C10=7,3500)+IF(C10=8,2500)+IF(C10=9,1500)","v":0},null,null,"4.",null,{"$f":"IF(H10=\"n\",10500)+IF(H10=1,9500)+IF(H10=2,8500)+IF(H10=3,7500)+IF(H10=4,6500)+IF(H10=5,5500)+IF(H10=6,4500)+IF(H10=7,3500)+IF(H10=8,2500)+IF(H10=9,1500)","v":0},null,null,"4.",null,{"$f":"IF(M10=\"n\",10500)+IF(M10=1,9500)+IF(M10=2,8500)+IF(M10=3,7500)+IF(M10=4,6500)+IF(M10=5,5500)+IF(M10=6,4500)+IF(M10=7,3500)+IF(M10=8,2500)+IF(M10=9,1500)","v":0},null,null,null,null,null,null,null,null,null,null,null,8]
[null,"5.",null,{"$f":"IF(C11=\"n\",10500)+IF(C11=1,9500)+IF(C11=2,8500)+IF(C11=3,7500)+IF(C11=4,6500)+IF(C11=5,5500)+IF(C11=6,4500)+IF(C11=7,3500)+IF(C11=8,2500)+IF(C11=9,1500)","v":0},null,null,"5.",null,{"$f":"IF(H11=\"n\",10500)+IF(H11=1,9500)+IF(H11=2,8500)+IF(H11=3,7500)+IF(H11=4,6500)+IF(H11=5,5500)+IF(H11=6,4500)+IF(H11=7,3500)+IF(H11=8,2500)+IF(H11=9,1500)","v":0},null,null,"5.",null,{"$f":"IF(M11=\"n\",10500)+IF(M11=1,9500)+IF(M11=2,8500)+IF(M11=3,7500)+IF(M11=4,6500)+IF(M11=5,5500)+IF(M11=6,4500)+IF(M11=7,3500)+IF(M11=8,2500)+IF(M11=9,1500)","v":0},null,null,null,null,null,null,null,null,null,null,null,9]
[null,null,"Punkte:",{"$f":"IF(SUM(C7:C11)=\"\",\"\",SUM(D7:E11))","v":0},null,null,null,"Punkte:",{"$f":"IF(SUM(H7:H11)=\"\",\"\",SUM(I7:J11))","v":0},null,null,null,"Punkte:",{"$f":"IF(SUM(M7:M11)=\"\",\"\",SUM(N7:O11))","v":0},null,null,null,null,null,null,null,null,null,null,null,10]
[]
[null,null,"Schütze - 1",null,null,null,null,"gesamt Punkte:",null,null,null,null,"Schütze - 2"]
[null,null,null,null,null,null,null,{"$f":"SUM(D12,I12,N12,D23,N23)","v":0}]
[]
[null,null,"Ringe:","Punkte:","Teiler:",null,null,null,null,null,null,null,"Ringe:","Punkte:","Teiler:"]
[null,"1.",null,{"$f":"IF(C18=\"n\",10500)+IF(C18=1,9500)+IF(C18=2,8500)+IF(C18=3,7500)+IF(C18=4,6500)+IF(C18=5,5500)+IF(C18=6,4500)+IF(C18=7,3500)+IF(C18=8,2500)+IF(C18=9,1500)","v":0},null,null,null,null,null,null,null,"1.",null,{"$f":"IF(M18=\"n\",10500)+IF(M18=1,9500)+IF(M18=2,8500)+IF(M18=3,7500)+IF(M18=4,6500)+IF(M18=5,5500)+IF(M18=6,4500)+IF(M18=7,3500)+IF(M18=8,2500)+IF(M18=9,1500)","v":0}]
[null,"2.",null,{"$f":"IF(C19=\"n\",10500)+IF(C19=1,9500)+IF(C19=2,8500)+IF(C19=3,7500)+IF(C19=4,6500)+IF(C19=5,5500)+IF(C19=6,4500)+IF(C19=7,3500)+IF(C19=8,2500)+IF(C19=9,1500)","v":0},null,null,null,null,null,null,null,"2.",null,{"$f":"IF(M19=\"n\",10500)+IF(M19=1,9500)+IF(M19=2,8500)+IF(M19=3,7500)+IF(M19=4,6500)+IF(M19=5,5500)+IF(M19=6,4500)+IF(M19=7,3500)+IF(M19=8,2500)+IF(M19=9,1500)","v":0}]
[null,"3.",null,{"$f":"IF(C20=\"n\",10500)+IF(C20=1,9500)+IF(C20=2,8500)+IF(C20=3,7500)+IF(C20=4,6500)+IF(C20=5,5500)+IF(C20=6,4500)+IF(C20=7,3500)+IF(C20=8,2500)+IF(C20=9,1500)","v":0},null,null,null,null,null,null,null,"3.",null,{"$f":"IF(M20=\"n\",10500)+IF(M20=1,9500)+IF(M20=2,8500)+IF(M20=3,7500)+IF(M20=4,6500)+IF(M20=5,5500)+IF(M20=6,4500)+IF(M20=7,3500)+IF(M20=8,2500)+IF(M20=9,1500)","v":0}]
[null,"4.",null,{"$f":"IF(C21=\"n\",10500)+IF(C21=1,9500)+IF(C21=2,8500)+IF(C21=3,7500)+IF(C21=4,6500)+IF(C21=5,5500)+IF(C21=6,4500)+IF(C21=7,3500)+IF(C21=8,2500)+IF(C21=9,1500)","v":0},null,null,null,null,null,null,null,"4.",null,{"$f":"IF(M21=\"n\",10500)+IF(M21=1,9500)+IF(M21=2,8500)+IF(M21=3,7500)+IF(M21=4,6500)+IF(M21=5,5500)+IF(M21=6,4500)+IF(M21=7,3500)+IF(M21=8,2500)+IF(M21=9,1500)","v":0}]
[null,"5.",null,{"$f":"IF(C22=\"n\",10500)+IF(C22=1,9500)+IF(C22=2,8500)+IF(C22=3,7500)+IF(C22=4,6500)+IF(C22=5,5500)+IF(C22=6,4500)+IF(C22=7,3500)+IF(C22=8,2500)+IF(C22=9,1500)","v":0},null,null,null,null,null,null,null,"5.",null,{"$f":"IF(M22=\"n\",10500)+IF(M22=1,9500)+IF(M22=2,8500)+IF(M22=3,7500)+IF(M22=4,6500)+IF(M22=5,5500)+IF(M22=6,4500)+IF(M22=7,3500)+IF(M22=8,2500)+IF(M22=9,1500)","v":0}]
[null,null,"Punkte:",{"$f":"IF(SUM(C18:C22)=\"\",\"\",SUM(D18:E22))","v":0},null,null,"* = Ersatzschütze",null,null,null,null,null,"Punkte:",{"$f":"IF(SUM(M18:M22)=\"\",\"\",SUM(N18:O22))","v":0}]

{"sheet":"17","index":17,"n_rows":23,"n_cols":26,"rows_kept":23,"cut":false,"hidden":false,"merged":[[0,1,1,15],[2,12,2,14],[3,12,3,14],[11,13,11,14],[13,2,13,4],[13,7,13,9],[13,12,13,14],[3,2,3,4],[2,7,2,9],[3,7,3,9],[11,8,11,9],[14,7,16,9],[11,3,11,4],[2,2,2,4],[14,12,14,14],[22,3,22,4],[22,13,22,14],[17,7,17,9],[18,7,18,9],[19,7,19,9],[20,7,20,9],[14,2,14,4],[21,7,21,9],[22,6,23,9]]}
[null,{"$f":"IF(HM!M29=\"\",\"Welcher Verein ?\",HM!M29)","v":"SV-Verein 17"}]
[null,null,null,null,null,null,null,null,null,null,null,null,null,null,null,null,{"$f":"IF(C4=\"\",\"\",IF(C7=\"\",\"\",IF(C8=\"\",\"\",IF(C9=\"\",\"\",IF(C10=\"\",\"\",IF(C11=\"\",\"\",1))))))","v":""},{"$f":"IF(H4=\"\",\"\",IF(H7=\"\",\"\",IF(H8=\"\",\"\",IF(H9=\"\",\"\",IF(H10=\"\",\"\",IF(H11=\"\",\"\",1))))))","v":""},{"$f":"IF(M4=\"\",\"\",IF(M7=\"\",\"\",IF(M8=\"\",\"\",IF(M9=\"\",\"\",IF(M10=\"\",\"\",IF(M11=\"\",\"\",1))))))","v":""},null,null,null,null,null,null,"N"]
[null,"Info","König:",null,null,null,null,"Adjutant:",null,null,null,null,"Präsident:",null,null,null,{"$f":"IF(C15=\"\",\"\",IF(C18=\"\",\"\",IF(C19=\"\",\"\",IF(C20=\"\",\"\",IF(C21=\"\",\"\",IF(C22=\"\",\"\",1))))))","v":""},{"$f":"IF(SUM(Q2:S2,Q3,S3)=5,1,0)","v":0},{"$f":"IF(M15=\"\",\"\",IF(M18=\"\",\"\",IF(M19=\"\",\"\",IF(M20=\"\",\"\",IF(M21=\"\",\"\",IF(M22=\"\",\"\",1))))))","v":""},null,null,null,null,null,null,1]
[null,null,null,null,null,null,null,null,null,null,null,null,null,null,null,null,null,null,null,null,null,null,null,null,null,2]
[null,null,null,null,null,null,null,null,null,null,null,null,null,null,null,null,null,null,null,null,null,null,null,null,null,3]
[null,null,"Ringe:","Punkte:","Teiler:",null,null,"Ringe:","Punkte:","Teiler:",null,null,"Ringe:","Punkte:","Teiler:",null,null,null,null,null,null,null,null,null,null,4]
[null,"1.",null,{"$f":"IF(C7=\"n\",10500)+IF(C7=1,9500)+IF(C7=2,8500)+IF(C7=3,7500)+IF(C7=4,6500)+IF(C7=5,5500)+IF(C7=6,4500)+IF(C7=7,3500)+IF(C7=8,2500)+IF(C7=9,1500)","v":0},null,null,"1.",null,{"$f":"IF(H7=\"n\",10500)+IF(H7=1,9500)+IF(H7=2,8500)+IF(H7=3,7500)+IF(H7=4,6500)+IF(H7=5,5500)+IF(H7=6,4500)+IF(H7=7,3500)+IF(H7=8,2500)+IF(H7=9,1500)","v":0},null,null,"1.",null,{"$f":"IF(M7=\"n\",10500)+IF(M7=1,9500)+IF(M7=2,8500)+IF(M7=3,7500)+IF(M7=4,6500)+IF(M7=5,5500)+IF(M7=6,4500)+IF(M7=7,3500)+IF(M7=8,2500)+IF(M7=9,1500)","v":0},null,null,null,null,null,null,null,null,null,null,null,5]
[null,"2.",null,{"$f":"IF(C8=\"n\",10500)+IF(C8=1,9500)+IF(C8=2,8500)+IF(C8=3,7500)+IF(C8=4,6500)+IF(C8=5,5500)+IF(C8=6,4500)+IF(C8=7,3500)+IF(C8=8,2500)+IF(C8=9,1500)","v":0},null,null,"2.",null,{"$f":"IF(H8=\"n\",10500)+IF(H8=1,9500)+IF(H8=2,8500)+IF(H8=3,7500)+IF(H8=4,6500)+IF(H8=5,5500)+IF(H8=6,4500)+IF(H8=7,3500)+IF(H8=8,2500)+IF(H8=9,1500)","v":0},null,null,"2.",null,{"$f":"IF(M8=\"n\",10500)+IF(M8=1,9500)+IF(M8=2,8500)+IF(M8=3,7500)+IF(M8=4,6500)+IF(M8=5,5500)+IF(M8=6,4500)+IF(M8=7,3500)+IF(M8=8,2500)+IF(M8=9,1500)","v":0},null,null,null,null,null,null,null,null,null,null,null,6]
[null,"3.",null,{"$f":"IF(C9=\"n\",10500)+IF(C9=1,9500)+IF(C9=2,8500)+IF(C9=3,7500)+IF(C9=4,6500)+IF(C9=5,5500)+IF(C9=6,4500)+IF(C9=7,3500)+IF(C9=8,2500)+IF(C9=9,1500)","v":0},null,null,"3.",null,{"$f":"IF(H9=\"n\",10500)+IF(H9=1,9500)+IF(H9=2,8500)+IF(H9=3,7500)+IF(H9=4,6500)+IF(H9=5,5500)+IF(H9=6,4500)+IF(H9=7,3500)+IF(H9=8,2500)+IF(H9=9,1500)","v":0},null,null,"3.",null,{"$f":"IF(M9=\"n\",10500)+IF(M9=1,9500)+IF(M9=2,8500)+IF(M9=3,7500)+IF(M9=4,6500)+IF(M9=5,5500)+IF(M9=6,4500)+IF(M9=7,3500)+IF(M9=8,2500)+IF(M9=9,1500)","v":0},null,null,null,null,null,null,null,null,null,null,null,7]
[null,"4.",null,{"$f":"IF(C10=\"n\",10500)+IF(C10=1,9500)+IF(C10=2,8500)+IF(C10=3,7500)+IF(C10=4,6500)+IF(C10=5,5500)+IF(C10=6,4500)+IF(C10=7,3500)+IF(C10=8,2500)+IF(C10=9,1500)","v":0},null,null,"4.",null,{"$f":"IF(H10=\"n\",10500)+IF(H10=1,9500)+IF(H10=2,8500)+IF(H10=3,7500)+IF(H10=4,6500)+IF(H10=5,5500)+IF(H10=6,4500)+IF(H10=7,3500)+IF(H10=8,2500)+IF(H10=9,1500)","v":0},null,null,"4.",null,{"$f":"IF(M10=\"n\",10500)+IF(M10=1,9500)+IF(M10=2,8500)+IF(M10=3,7500)+IF(M10=4,6500)+IF(M10=5,5500)+IF(M10=6,4500)+IF(M10=7,3500)+IF(M10=8,2500)+IF(M10=9,1500)","v":0},null,null,null,null,null,null,null,null,null,null,null,8]
[null,"5.",null,{"$f":"IF(C11=\"n\",10500)+IF(C11=1,9500)+IF(C11=2,8500)+IF(C11=3,7500)+IF(C11=4,6500)+IF(C11=5,5500)+IF(C11=6,4500)+IF(C11=7,3500)+IF(C11=8,2500)+IF(C11=9,1500)","v":0},null,null,"5.",null,{"$f":"IF(H11=\"n\",10500)+IF(H11=1,9500)+IF(H11=2,8500)+IF(H11=3,7500)+IF(H11=4,6500)+IF(H11=5,5500)+IF(H11=6,4500)+IF(H11=7,3500)+IF(H11=8,2500)+IF(H11=9,1500)","v":0},null,null,"5.",null,{"$f":"IF(M11=\"n\",10500)+IF(M11=1,9500)+IF(M11=2,8500)+IF(M11=3,7500)+IF(M11=4,6500)+IF(M11=5,5500)+IF(M11=6,4500)+IF(M11=7,3500)+IF(M11=8,2500)+IF(M11=9,1500)","v":0},null,null,null,null,null,null,null,null,null,null,null,9]
[null,null,"Punkte:",{"$f":"IF(SUM(C7:C11)=\"\",\"\",SUM(D7:E11))","v":0},null,null,null,"Punkte:",{"$f":"IF(SUM(H7:H11)=\"\",\"\",SUM(I7:J11))","v":0},null,null,null,"Punkte:",{"$f":"IF(SUM(M7:M11)=\"\",\"\",SUM(N7:O11))","v":0},null,null,null,null,null,null,null,null,null,null,null,10]
[]
[null,null,"Schütze - 1",null,null,null,null,"gesamt Punkte:",null,null,null,null,"Schütze - 2"]
[null,null,null,null,null,null,null,{"$f":"SUM(D12,I12,N12,D23,N23)","v":0}]
[]
[null,null,"Ringe:","Punkte:","Teiler:",null,null,null,null,null,null,null,"Ringe:","Punkte:","Teiler:"]
[null,"1.",null,{"$f":"IF(C18=\"n\",10500)+IF(C18=1,9500)+IF(C18=2,8500)+IF(C18=3,7500)+IF(C18=4,6500)+IF(C18=5,5500)+IF(C18=6,4500)+IF(C18=7,3500)+IF(C18=8,2500)+IF(C18=9,1500)","v":0},null,null,null,null,null,null,null,"1.",null,{"$f":"IF(M18=\"n\",10500)+IF(M18=1,9500)+IF(M18=2,8500)+IF(M18=3,7500)+IF(M18=4,6500)+IF(M18=5,5500)+IF(M18=6,4500)+IF(M18=7,3500)+IF(M18=8,2500)+IF(M18=9,1500)","v":0}]
[null,"2.",null,{"$f":"IF(C19=\"n\",10500)+IF(C19=1,9500)+IF(C19=2,8500)+IF(C19=3,7500)+IF(C19=4,6500)+IF(C19=5,5500)+IF(C19=6,4500)+IF(C19=7,3500)+IF(C19=8,2500)+IF(C19=9,1500)","v":0},null,null,null,null,null,null,null,"2.",null,{"$f":"IF(M19=\"n\",10500)+IF(M19=1,9500)+IF(M19=2,8500)+IF(M19=3,7500)+IF(M19=4,6500)+IF(M19=5,5500)+IF(M19=6,4500)+IF(M19=7,3500)+IF(M19=8,2500)+IF(M19=9,1500)","v":0}]
[null,"3.",null,{"$f":"IF(C20=\"n\",10500)+IF(C20=1,9500)+IF(C20=2,8500)+IF(C20=3,7500)+IF(C20=4,6500)+IF(C20=5,5500)+IF(C20=6,4500)+IF(C20=7,3500)+IF(C20=8,2500)+IF(C20=9,1500)","v":0},null,null,null,null,null,null,null,"3.",null,{"$f":"IF(M20=\"n\",10500)+IF(M20=1,9500)+IF(M20=2,8500)+IF(M20=3,7500)+IF(M20=4,6500)+IF(M20=5,5500)+IF(M20=6,4500)+IF(M20=7,3500)+IF(M20=8,2500)+IF(M20=9,1500)","v":0}]
[null,"4.",null,{"$f":"IF(C21=\"n\",10500)+IF(C21=1,9500)+IF(C21=2,8500)+IF(C21=3,7500)+IF(C21=4,6500)+IF(C21=5,5500)+IF(C21=6,4500)+IF(C21=7,3500)+IF(C21=8,2500)+IF(C21=9,1500)","v":0},null,null,null,null,null,null,null,"4.",null,{"$f":"IF(M21=\"n\",10500)+IF(M21=1,9500)+IF(M21=2,8500)+IF(M21=3,7500)+IF(M21=4,6500)+IF(M21=5,5500)+IF(M21=6,4500)+IF(M21=7,3500)+IF(M21=8,2500)+IF(M21=9,1500)","v":0}]
[null,"5.",null,{"$f":"IF(C22=\"n\",10500)+IF(C22=1,9500)+IF(C22=2,8500)+IF(C22=3,7500)+IF(C22=4,6500)+IF(C22=5,5500)+IF(C22=6,4500)+IF(C22=7,3500)+IF(C22=8,2500)+IF(C22=9,1500)","v":0},null,null,null,null,null,null,null,"5.",null,{"$f":"IF(M22=\"n\",10500)+IF(M22=1,9500)+IF(M22=2,8500)+IF(M22=3,7500)+IF(M22=4,6500)+IF(M22=5,5500)+IF(M22=6,4500)+IF(M22=7,3500)+IF(M22=8,2500)+IF(M22=9,1500)","v":0}]
[null,null,"Punkte:",{"$f":"IF(SUM(C18:C22)=\"\",\"\",SUM(D18:E22))","v":0},null,null,"* = Ersatzschütze",null,null,null,null,null,"Punkte:",{"$f":"IF(SUM(M18:M22)=\"\",\"\",SUM(N18:O22))","v":0}]

{"sheet":"18","index":18,"n_rows":23,"n_cols":26,"rows_kept":23,"cut":false,"hidden":false,"merged":[[14,12,14,14],[22,3,22,4],[22,13,22,14],[17,7,17,9],[18,7,18,9],[14,7,16,9],[22,6,23,9],[19,7,19,9],[20,7,20,9],[14,2,14,4],[21,7,21,9],[0,1,1,15],[2,12,2,14],[3,12,3,14],[11,13,11,14],[13,2,13,4],[13,7,13,9],[13,12,13,14],[2,7,2,9],[3,7,3,9],[11,8,11,9],[11,3,11,4],[2,2,2,4],[3,2,3,4]]}
[null,{"$f":"IF(HM!M32=\"\",\"Welcher Verein ?\",HM!M32)","v":"SV-Verein 18"}]
[null,null,null,null,null,null,null,null,null,null,null,null,null,null,null,null,{"$f":"IF(C4=\"\",\"\",IF(C7=\"\",\"\",IF(C8=\"\",\"\",IF(C9=\"\",\"\",IF(C10=\"\",\"\",IF(C11=\"\",\"\",1))))))","v":""},{"$f":"IF(H4=\"\",\"\",IF(H7=\"\",\"\",IF(H8=\"\",\"\",IF(H9=\"\",\"\",IF(H10=\"\",\"\",IF(H11=\"\",\"\",1))))))","v":""},{"$f":"IF(M4=\"\",\"\",IF(M7=\"\",\"\",IF(M8=\"\",\"\",IF(M9=\"\",\"\",IF(M10=\"\",\"\",IF(M11=\"\",\"\",1))))))","v":""},null,null,null,null,null,null,"N"]
[null,"Info","König:",null,null,null,null,"Adjutant:",null,null,null,null,"Präsident:",null,null,null,{"$f":"IF(C15=\"\",\"\",IF(C18=\"\",\"\",IF(C19=\"\",\"\",IF(C20=\"\",\"\",IF(C21=\"\",\"\",IF(C22=\"\",\"\",1))))))","v":""},{"$f":"IF(SUM(Q2:S2,Q3,S3)=5,1,0)","v":0},{"$f":"IF(M15=\"\",\"\",IF(M18=\"\",\"\",IF(M19=\"\",\"\",IF(M20=\"\",\"\",IF(M21=\"\",\"\",IF(M22=\"\",\"\",1))))))","v":""},null,null,null,null,null,null,1]
[null,null,null,null,null,null,null,null,null,null,null,null,null,null,null,null,null,null,null,null,null,null,null,null,null,2]
[null,null,null,null,null,null,null,null,null,null,null,null,null,null,null,null,null,null,null,null,null,null,null,null,null,3]
[null,null,"Ringe:","Punkte:","Teiler:",null,null,"Ringe:","Punkte:","Teiler:",null,null,"Ringe:","Punkte:","Teiler:",null,null,null,null,null,null,null,null,null,null,4]
[null,"1.",null,{"$f":"IF(C7=\"n\",10500)+IF(C7=1,9500)+IF(C7=2,8500)+IF(C7=3,7500)+IF(C7=4,6500)+IF(C7=5,5500)+IF(C7=6,4500)+IF(C7=7,3500)+IF(C7=8,2500)+IF(C7=9,1500)","v":0},null,null,"1.",null,{"$f":"IF(H7=\"n\",10500)+IF(H7=1,9500)+IF(H7=2,8500)+IF(H7=3,7500)+IF(H7=4,6500)+IF(H7=5,5500)+IF(H7=6,4500)+IF(H7=7,3500)+IF(H7=8,2500)+IF(H7=9,1500)","v":0},null,null,"1.",null,{"$f":"IF(M7=\"n\",10500)+IF(M7=1,9500)+IF(M7=2,8500)+IF(M7=3,7500)+IF(M7=4,6500)+IF(M7=5,5500)+IF(M7=6,4500)+IF(M7=7,3500)+IF(M7=8,2500)+IF(M7=9,1500)","v":0},null,null,null,null,null,null,null,null,null,null,null,5]
[null,"2.",null,{"$f":"IF(C8=\"n\",10500)+IF(C8=1,9500)+IF(C8=2,8500)+IF(C8=3,7500)+IF(C8=4,6500)+IF(C8=5,5500)+IF(C8=6,4500)+IF(C8=7,3500)+IF(C8=8,2500)+IF(C8=9,1500)","v":0},null,null,"2.",null,{"$f":"IF(H8=\"n\",10500)+IF(H8=1,9500)+IF(H8=2,8500)+IF(H8=3,7500)+IF(H8=4,6500)+IF(H8=5,5500)+IF(H8=6,4500)+IF(H8=7,3500)+IF(H8=8,2500)+IF(H8=9,1500)","v":0},null,null,"2.",null,{"$f":"IF(M8=\"n\",10500)+IF(M8=1,9500)+IF(M8=2,8500)+IF(M8=3,7500)+IF(M8=4,6500)+IF(M8=5,5500)+IF(M8=6,4500)+IF(M8=7,3500)+IF(M8=8,2500)+IF(M8=9,1500)","v":0},null,null,null,null,null,null,null,null,null,null,null,6]
[null,"3.",null,{"$f":"IF(C9=\"n\",10500)+IF(C9=1,9500)+IF(C9=2,8500)+IF(C9=3,7500)+IF(C9=4,6500)+IF(C9=5,5500)+IF(C9=6,4500)+IF(C9=7,3500)+IF(C9=8,2500)+IF(C9=9,1500)","v":0},null,null,"3.",null,{"$f":"IF(H9=\"n\",10500)+IF(H9=1,9500)+IF(H9=2,8500)+IF(H9=3,7500)+IF(H9=4,6500)+IF(H9=5,5500)+IF(H9=6,4500)+IF(H9=7,3500)+IF(H9=8,2500)+IF(H9=9,1500)","v":0},null,null,"3.",null,{"$f":"IF(M9=\"n\",10500)+IF(M9=1,9500)+IF(M9=2,8500)+IF(M9=3,7500)+IF(M9=4,6500)+IF(M9=5,5500)+IF(M9=6,4500)+IF(M9=7,3500)+IF(M9=8,2500)+IF(M9=9,1500)","v":0},null,null,null,null,null,null,null,null,null,null,null,7]
[null,"4.",null,{"$f":"IF(C10=\"n\",10500)+IF(C10=1,9500)+IF(C10=2,8500)+IF(C10=3,7500)+IF(C10=4,6500)+IF(C10=5,5500)+IF(C10=6,4500)+IF(C10=7,3500)+IF(C10=8,2500)+IF(C10=9,1500)","v":0},null,null,"4.",null,{"$f":"IF(H10=\"n\",10500)+IF(H10=1,9500)+IF(H10=2,8500)+IF(H10=3,7500)+IF(H10=4,6500)+IF(H10=5,5500)+IF(H10=6,4500)+IF(H10=7,3500)+IF(H10=8,2500)+IF(H10=9,1500)","v":0},null,null,"4.",null,{"$f":"IF(M10=\"n\",10500)+IF(M10=1,9500)+IF(M10=2,8500)+IF(M10=3,7500)+IF(M10=4,6500)+IF(M10=5,5500)+IF(M10=6,4500)+IF(M10=7,3500)+IF(M10=8,2500)+IF(M10=9,1500)","v":0},null,null,null,null,null,null,null,null,null,null,null,8]
[null,"5.",null,{"$f":"IF(C11=\"n\",10500)+IF(C11=1,9500)+IF(C11=2,8500)+IF(C11=3,7500)+IF(C11=4,6500)+IF(C11=5,5500)+IF(C11=6,4500)+IF(C11=7,3500)+IF(C11=8,2500)+IF(C11=9,1500)","v":0},null,null,"5.",null,{"$f":"IF(H11=\"n\",10500)+IF(H11=1,9500)+IF(H11=2,8500)+IF(H11=3,7500)+IF(H11=4,6500)+IF(H11=5,5500)+IF(H11=6,4500)+IF(H11=7,3500)+IF(H11=8,2500)+IF(H11=9,1500)","v":0},null,null,"5.",null,{"$f":"IF(M11=\"n\",10500)+IF(M11=1,9500)+IF(M11=2,8500)+IF(M11=3,7500)+IF(M11=4,6500)+IF(M11=5,5500)+IF(M11=6,4500)+IF(M11=7,3500)+IF(M11=8,2500)+IF(M11=9,1500)","v":0},null,null,null,null,null,null,null,null,null,null,null,9]
[null,null,"Punkte:",{"$f":"IF(SUM(C7:C11)=\"\",\"\",SUM(D7:E11))","v":0},null,null,null,"Punkte:",{"$f":"IF(SUM(H7:H11)=\"\",\"\",SUM(I7:J11))","v":0},null,null,null,"Punkte:",{"$f":"IF(SUM(M7:M11)=\"\",\"\",SUM(N7:O11))","v":0},null,null,null,null,null,null,null,null,null,null,null,10]
[]
[null,null,"Schütze - 1",null,null,null,null,"gesamt Punkte:",null,null,null,null,"Schütze - 2"]
[null,null,null,null,null,null,null,{"$f":"SUM(D12,I12,N12,D23,N23)","v":0}]
[]
[null,null,"Ringe:","Punkte:","Teiler:",null,null,null,null,null,null,null,"Ringe:","Punkte:","Teiler:"]
[null,"1.",null,{"$f":"IF(C18=\"n\",10500)+IF(C18=1,9500)+IF(C18=2,8500)+IF(C18=3,7500)+IF(C18=4,6500)+IF(C18=5,5500)+IF(C18=6,4500)+IF(C18=7,3500)+IF(C18=8,2500)+IF(C18=9,1500)","v":0},null,null,null,null,null,null,null,"1.",null,{"$f":"IF(M18=\"n\",10500)+IF(M18=1,9500)+IF(M18=2,8500)+IF(M18=3,7500)+IF(M18=4,6500)+IF(M18=5,5500)+IF(M18=6,4500)+IF(M18=7,3500)+IF(M18=8,2500)+IF(M18=9,1500)","v":0}]
[null,"2.",null,{"$f":"IF(C19=\"n\",10500)+IF(C19=1,9500)+IF(C19=2,8500)+IF(C19=3,7500)+IF(C19=4,6500)+IF(C19=5,5500)+IF(C19=6,4500)+IF(C19=7,3500)+IF(C19=8,2500)+IF(C19=9,1500)","v":0},null,null,null,null,null,null,null,"2.",null,{"$f":"IF(M19=\"n\",10500)+IF(M19=1,9500)+IF(M19=2,8500)+IF(M19=3,7500)+IF(M19=4,6500)+IF(M19=5,5500)+IF(M19=6,4500)+IF(M19=7,3500)+IF(M19=8,2500)+IF(M19=9,1500)","v":0}]
[null,"3.",null,{"$f":"IF(C20=\"n\",10500)+IF(C20=1,9500)+IF(C20=2,8500)+IF(C20=3,7500)+IF(C20=4,6500)+IF(C20=5,5500)+IF(C20=6,4500)+IF(C20=7,3500)+IF(C20=8,2500)+IF(C20=9,1500)","v":0},null,null,null,null,null,null,null,"3.",null,{"$f":"IF(M20=\"n\",10500)+IF(M20=1,9500)+IF(M20=2,8500)+IF(M20=3,7500)+IF(M20=4,6500)+IF(M20=5,5500)+IF(M20=6,4500)+IF(M20=7,3500)+IF(M20=8,2500)+IF(M20=9,1500)","v":0}]
[null,"4.",null,{"$f":"IF(C21=\"n\",10500)+IF(C21=1,9500)+IF(C21=2,8500)+IF(C21=3,7500)+IF(C21=4,6500)+IF(C21=5,5500)+IF(C21=6,4500)+IF(C21=7,3500)+IF(C21=8,2500)+IF(C21=9,1500)","v":0},null,null,null,null,null,null,null,"4.",null,{"$f":"IF(M21=\"n\",10500)+IF(M21=1,9500)+IF(M21=2,8500)+IF(M21=3,7500)+IF(M21=4,6500)+IF(M21=5,5500)+IF(M21=6,4500)+IF(M21=7,3500)+IF(M21=8,2500)+IF(M21=9,1500)","v":0}]
[null,"5.",null,{"$f":"IF(C22=\"n\",10500)+IF(C22=1,9500)+IF(C22=2,8500)+IF(C22=3,7500)+IF(C22=4,6500)+IF(C22=5,5500)+IF(C22=6,4500)+IF(C22=7,3500)+IF(C22=8,2500)+IF(C22=9,1500)","v":0},null,null,null,null,null,null,null,"5.",null,{"$f":"IF(M22=\"n\",10500)+IF(M22=1,9500)+IF(M22=2,8500)+IF(M22=3,7500)+IF(M22=4,6500)+IF(M22=5,5500)+IF(M22=6,4500)+IF(M22=7,3500)+IF(M22=8,2500)+IF(M22=9,1500)","v":0}]
[null,null,"Punkte:",{"$f":"IF(SUM(C18:C22)=\"\",\"\",SUM(D18:E22))","v":0},null,null,"* = Ersatzschütze",null,null,null,null,null,"Punkte:",{"$f":"IF(SUM(M18:M22)=\"\",\"\",SUM(N18:O22))","v":0}]

{"sheet":"D","index":19,"n_rows":91,"n_cols":15,"rows_kept":91,"cut":false,"hidden":false,"merged":[]}
[null,null,"Verein:","Vor- und Nachname:","Punkte:",null,null,"Verein:","gesamt\nPunkte:","Gewinn-\nberechtigt?",null,"Könige:","Verein:","Name:","Punkte:"]
["01.","König","SV-Verein 01","","",null,"01.","SV-Verein 01","","",null,"01.","","",""]
["02.","Adjutant","SV-Verein 01","","",null,"02.","SV-Verein 02","","",null,"02.","","",""]
["03.","Präsident","SV-Verein 01","","",null,"03.","SV-Verein 03","","",null,"03.","","",""]
["04.","Schütze-1","SV-Verein 01","","",null,"04.","SV-Verein 04","","",null,"04.","","",""]
["05.","Schütze-2","SV-Verein 01","","",null,"05.","SV-Verein 05","","",null,"05.","","",""]
["01.","König","SV-Verein 02","","",null,"06.","SV-Verein 06","","",null,"06.","","",""]
["02.","Adjutant","SV-Verein 02","","",null,"07.","SV-Verein 07","","",null,"07.","","",""]
["03.","Präsident","SV-Verein 02","","",null,"08.","SV-Verein 08","","",null,"08.","","",""]
["04.","Schütze-1","SV-Verein 02","","",null,"09.","SV-Verein 09","","",null,"09.","","",""]
["05.","Schütze-2","SV-Verein 02","","",null,"10.","SV-Verein 10","","",null,"10.","","",""]
["01.","König","SV-Verein 03","","",null,"11.","SV-Verein 11","","",null,"11.","","",""]
["02.","Adjutant","SV-Verein 03","","",null,"12.","SV-Verein 12","","",null,"12.","","",""]
["03.","Präsident","SV-Verein 03","","",null,"13.","SV-Verein 13","","",null,"13.","","",""]
["04.","Schütze-1","SV-Verein 03","","",null,"14.","SV-Verein 14","","",null,"14.","","",""]
["05.","Schütze-2","SV-Verein 03","","",null,"15.","SV-Verein 15","","",null,"15.","","",""]
["01.","König","SV-Verein 04","","",null,"16.","SV-Verein 16","","",null,"16.","","",""]
["02.","Adjutant","SV-Verein 04","","",null,"17.","SV-Verein 17","","",null,"17.","","",""]
["03.","Präsident","SV-Verein 04","","",null,"18.","SV-Verein 18","","",null,"18.","","",""]
["04.","Schütze-1","SV-Verein 04","",""]
["05.","Schütze-2","SV-Verein 04","","",null,null,"Adjutanten:",null,null,null,null,"Präsidenten:"]
["01.","König","SV-Verein 05","","",null,null,"Verein:","Name:","Punkte:",null,null,"Verein:","Name:","Punkte:"]
["02.","Adjutant","SV-Verein 05","","",null,"01.","","","",null,"01.","","",""]
["03.","Präsident","SV-Verein 05","","",null,"02.","","","",null,"02.","","",""]
["04.","Schütze-1","SV-Verein 05","","",null,"03.","","","",null,"03.","","",""]
["05.","Schütze-2","SV-Verein 05","","",null,"04.","","","",null,"04.","","",""]
["01.","König","SV-Verein 06","","",null,"05.","","","",null,"05.","","",""]
["02.","Adjutant","SV-Verein 06","","",null,"06.","","","",null,"06.","","",""]
["03.","Präsident","SV-Verein 06","","",null,"07.","","","",null,"07.","","",""]
["04.","Schütze-1","SV-Verein 06","","",null,"08.","","","",null,"08.","","",""]
["05.","Schütze-2","SV-Verein 06","","",null,"09.","","","",null,"09.","","",""]
["01.","König","SV-Verein 07","","",null,"10.","","","",null,"10.","","",""]
["02.","Adjutant","SV-Verein 07","","",null,"11.","","","",null,"11.","","",""]
["03.","Präsident","SV-Verein 07","","",null,"12.","","","",null,"12.","","",""]
["04.","Schütze-1","SV-Verein 07","","",null,"13.","","","",null,"13.","","",""]
["05.","Schütze-2","SV-Verein 07","","",null,"14.","","","",null,"14.","","",""]
["01.","König","SV-Verein 08","","",null,"15.","","","",null,"15.","","",""]
["02.","Adjutant","SV-Verein 08","","",null,"16.","","","",null,"16.","","",""]
["03.","Präsident","SV-Verein 08","","",null,"17.","","","",null,"17.","","",""]
["04.","Schütze-1","SV-Verein 08","","",null,"18.","","","",null,"18.","","",""]
["05.","Schütze-2","SV-Verein 08","",""]
["01.","König","SV-Verein 09","","",null,null,null,null,null,null,null,"Schützen"]
["02.","Adjutant","SV-Verein 09","","",null,null,null,null,null,null,null,"Verein:","Name:","Punkte:"]
["03.","Präsident","SV-Verein 09","","",null,null,null,null,null,null,"01.","","",""]
["04.","Schütze-1","SV-Verein 09","","",null,null,null,null,null,null,"02.","","",""]
["05.","Schütze-2","SV-Verein 09","","",null,null,null,null,null,null,"03.","","",""]
["01.","König","SV-Verein 10","","",null,null,null,null,null,null,"04.","","",""]
["02.","Adjutant","SV-Verein 10","","",null,null,null,null,null,null,"05.","","",""]
["03.","Präsident","SV-Verein 10","","",null,null,null,null,null,null,"06.","","",""]
["04.","Schütze-1","SV-Verein 10","","",null,null,null,null,null,null,"07.","","",""]
["05.","Schütze-2","SV-Verein 10","","",null,null,null,null,null,null,"08.","","",""]
["01.","König","SV-Verein 11","","",null,null,null,null,null,null,"09.","","",""]
["02.","Adjutant","SV-Verein 11","","",null,null,null,null,null,null,"10.","","",""]
["03.","Präsident","SV-Verein 11","","",null,null,null,null,null,null,"11.","","",""]
["04.","Schütze-1","SV-Verein 11","","",null,null,null,null,null,null,"12.","","",""]
["05.","Schütze-2","SV-Verein 11","","",null,null,null,null,null,null,"13.","","",""]
["01.","König","SV-Verein 12","","",null,null,null,null,null,null,"14.","","",""]
["02.","Adjutant","SV-Verein 12","","",null,null,null,null,null,null,"15.","","",""]
["03.","Präsident","SV-Verein 12","","",null,null,null,null,null,null,"16.","","",""]
["04.","Schütze-1","SV-Verein 12","","",null,null,null,null,null,null,"17.","","",""]
["05.","Schütze-2","SV-Verein 12","","",null,null,null,null,null,null,"18.","","",""]
["01.","König","SV-Verein 13","","",null,null,null,null,null,null,"19.","","",""]
["02.","Adjutant","SV-Verein 13","","",null,null,null,null,null,null,"20.","","",""]
["03.","Präsident","SV-Verein 13","","",null,null,null,null,null,null,"21.","","",""]
["04.","Schütze-1","SV-Verein 13","","",null,null,null,null,null,null,"22.","","",""]
["05.","Schütze-2","SV-Verein 13","","",null,null,null,null,null,null,"23.","","",""]
["01.","König","SV-Verein 14","","",null,null,null,null,null,null,"24.","","",""]
["02.","Adjutant","SV-Verein 14","","",null,null,null,null,null,null,"25.","","",""]
["03.","Präsident","SV-Verein 14","","",null,null,null,null,null,null,"26.","","",""]
["04.","Schütze-1","SV-Verein 14","","",null,null,null,null,null,null,"27.","","",""]
["05.","Schütze-2","SV-Verein 14","","",null,null,null,null,null,null,"28.","","",""]
["01.","König","SV-Verein 15","","",null,null,null,null,null,null,"29.","","",""]
["02.","Adjutant","SV-Verein 15","","",null,null,null,null,null,null,"30.","","",""]
["03.","Präsident","SV-Verein 15","","",null,null,null,null,null,null,"31.","","",""]
["04.","Schütze-1","SV-Verein 15","","",null,null,null,null,null,null,"32.","","",""]
["05.","Schütze-2","SV-Verein 15","","",null,null,null,null,null,null,"33.","","",""]
["01.","König","SV-Verein 16","","",null,null,null,null,null,null,"34.","","",""]
["02.","Adjutant","SV-Verein 16","","",null,null,null,null,null,null,"35.","","",""]
["03.","Präsident","SV-Verein 16","","",null,null,null,null,null,null,"36.","","",""]
["04.","Schütze-1","SV-Verein 16","",""]
["05.","Schütze-2","SV-Verein 16","",""]
["01.","König","SV-Verein 17","",""]
["02.","Adjutant","SV-Verein 17","",""]
["03.","Präsident","SV-Verein 17","",""]
["04.","Schütze-1","SV-Verein 17","",""]
["05.","Schütze-2","SV-Verein 17","",""]
["01.","König","SV-Verein 18","",""]
["02.","Adjutant","SV-Verein 18","",""]
["03.","Präsident","SV-Verein 18","",""]
["04.","Schütze-1","SV-Verein 18","",""]
["05.","Schütze-2","SV-Verein 18","",""]

{"sheet":"Sammler","index":20,"n_rows":91,"n_cols":15,"rows_kept":91,"cut":false,"hidden":false,"merged":[[20,7,20,9],[20,12,20,14],[41,12,41,14]]}
[null,null,"Verein:","Name:","Punkte:",null,null,"Verein:","gesamt\nPunkte:","Gewinn-\nberechtigt?",null,"Könige:","Verein:","Name:","Punkte:"]
["01.","König",{"$f":"IF(HM!E8=\"\",\"\",HM!E8)","v":"SV-Verein 01"},{"$f":"IF('1'!$D$12=0,\"\",'1'!$C$4)","v":""},{"$f":"IF('1'!$D$12=0,\"\",'1'!$D$12)","v":""},null,"01.",{"$f":"IF(HM!E8=\"\",\"\",HM!E8)","v":"SV-Verein 01"},{"$f":"IF('1'!$H$15=0,\"\",'1'!$H$15)","v":""},{"$f":"IF(AND(HM!B8=\"x\",HM!C8=\"x\"),\"J/N angekreuzt\",IF(HM!B8=\"x\",\"Ja\",IF(HM!C8=\"x\",\"Nein\",\"\")))","v":""},null,"01.",{"$f":"IF(N2=\"\",\"\",C2)","v":""},{"$f":"D2","v":""},{"$f":"E2","v":""}]
["02.","Adjutant",{"$f":"$C$2","v":"SV-Verein 01"},{"$f":"IF('1'!$I$12=0,\"\",'1'!$H$4)","v":""},{"$f":"IF('1'!$I$12=0,\"\",'1'!$I$12)","v":""},null,"02.",{"$f":"IF(HM!E11=\"\",\"\",HM!E11)","v":"SV-Verein 02"},{"$f":"IF('2'!$H$15=0,\"\",'2'!$H$15)","v":""},{"$f":"IF(AND(HM!B11=\"x\",HM!C11=\"x\"),\"J/N angekreuzt\",IF(HM!B11=\"x\",\"Ja\",IF(HM!C11=\"x\",\"Nein\",\"\")))","v":""},null,"02.",{"$f":"IF(N3=\"\",\"\",C7)","v":""},{"$f":"D7","v":""},{"$f":"E7","v":""}]
["03.","Präsident",{"$f":"$C$2","v":"SV-Verein 01"},{"$f":"IF('1'!$N$12=0,\"\",'1'!$M$4)","v":""},{"$f":"IF('1'!$N$12=0,\"\",'1'!$N$12)","v":""},null,"03.",{"$f":"IF(HM!E14=\"\",\"\",HM!E14)","v":"SV-Verein 03"},{"$f":"IF('3'!$H$15=0,\"\",'3'!$H$15)","v":""},{"$f":"IF(AND(HM!B14=\"x\",HM!C14=\"x\"),\"J/N angekreuzt\",IF(HM!B14=\"x\",\"Ja\",IF(HM!C14=\"x\",\"Nein\",\"\")))","v":""},null,"03.",{"$f":"IF(N4=\"\",\"\",C12)","v":""},{"$f":"D12","v":""},{"$f":"E12","v":""}]
["04.","Schütze-1",{"$f":"$C$2","v":"SV-Verein 01"},{"$f":"IF('1'!$D$23=0,\"\",'1'!$C$15)","v":""},{"$f":"IF('1'!$D$23=0,\"\",'1'!$D$23)","v":""},null,"04.",{"$f":"IF(HM!E17=\"\",\"\",HM!E17)","v":"SV-Verein 04"},{"$f":"IF('4'!$H$15=0,\"\",'4'!$H$15)","v":""},{"$f":"IF(AND(HM!B17=\"x\",HM!C17=\"x\"),\"J/N angekreuzt\",IF(HM!B17=\"x\",\"Ja\",IF(HM!C17=\"x\",\"Nein\",\"\")))","v":""},null,"04.",{"$f":"IF(N5=\"\",\"\",C17)","v":""},{"$f":"D17","v":""},{"$f":"E17","v":""}]
["05.","Schütze-2",{"$f":"$C$2","v":"SV-Verein 01"},{"$f":"IF('1'!$N$23=0,\"\",'1'!$M$15)","v":""},{"$f":"IF('1'!$N$23=0,\"\",'1'!$N$23)","v":""},null,"05.",{"$f":"IF(HM!E20=\"\",\"\",HM!E20)","v":"SV-Verein 05"},{"$f":"IF('5'!$H$15=0,\"\",'5'!$H$15)","v":""},{"$f":"IF(AND(HM!B20=\"x\",HM!C20=\"x\"),\"J/N angekreuzt\",IF(HM!B20=\"x\",\"Ja\",IF(HM!C20=\"x\",\"Nein\",\"\")))","v":""},null,"05.",{"$f":"IF(N6=\"\",\"\",C22)","v":""},{"$f":"D22","v":""},{"$f":"E22","v":""}]
["01.","König",{"$f":"IF(HM!E11=\"\",\"\",HM!E11)","v":"SV-Verein 02"},{"$f":"IF('2'!$D$12=0,\"\",'2'!$C$4)","v":""},{"$f":"IF('2'!$D$12=0,\"\",'2'!$D$12)","v":""},null,"06.",{"$f":"IF(HM!E23=\"\",\"\",HM!E23)","v":"SV-Verein 06"},{"$f":"IF('6'!$H$15=0,\"\",'6'!$H$15)","v":""},{"$f":"IF(AND(HM!B23=\"x\",HM!C23=\"x\"),\"J/N angekreuzt\",IF(HM!B23=\"x\",\"Ja\",IF(HM!C23=\"x\",\"Nein\",\"\")))","v":""},null,"06.",{"$f":"IF(N7=\"\",\"\",C27)","v":""},{"$f":"D27","v":""},{"$f":"E27","v":""}]
["02.","Adjutant",{"$f":"$C$7","v":"SV-Verein 02"},{"$f":"IF('2'!$I$12=0,\"\",'2'!$H$4)","v":""},{"$f":"IF('2'!$I$12=0,\"\",'2'!$I$12)","v":""},null,"07.",{"$f":"IF(HM!E26=\"\",\"\",HM!E26)","v":"SV-Verein 07"},{"$f":"IF('7'!$H$15=0,\"\",'7'!$H$15)","v":""},{"$f":"IF(AND(HM!B26=\"x\",HM!C26=\"x\"),\"J/N angekreuzt\",IF(HM!B26=\"x\",\"Ja\",IF(HM!C26=\"x\",\"Nein\",\"\")))","v":""},null,"07.",{"$f":"IF(N8=\"\",\"\",C32)","v":""},{"$f":"D32","v":""},{"$f":"E32","v":""}]
["03.","Präsident",{"$f":"$C$7","v":"SV-Verein 02"},{"$f":"IF('2'!$N$12=0,\"\",'2'!$M$4)","v":""},{"$f":"IF('2'!$N$12=0,\"\",'2'!$N$12)","v":""},null,"08.",{"$f":"IF(HM!E29=\"\",\"\",HM!E29)","v":"SV-Verein 08"},{"$f":"IF('8'!$H$15=0,\"\",'8'!$H$15)","v":""},{"$f":"IF(AND(HM!B29=\"x\",HM!C29=\"x\"),\"J/N angekreuzt\",IF(HM!B29=\"x\",\"Ja\",IF(HM!C29=\"x\",\"Nein\",\"\")))","v":""},null,"08.",{"$f":"IF(N9=\"\",\"\",C37)","v":""},{"$f":"D37","v":""},{"$f":"E37","v":""}]
["04.","Schütze-1",{"$f":"$C$7","v":"SV-Verein 02"},{"$f":"IF('2'!$D$23=0,\"\",'2'!$C$15)","v":""},{"$f":"IF('2'!$D$23=0,\"\",'2'!$D$23)","v":""},null,"09.",{"$f":"IF(HM!E32=\"\",\"\",HM!E32)","v":"SV-Verein 09"},{"$f":"IF('9'!$H$15=0,\"\",'9'!$H$15)","v":""},{"$f":"IF(AND(HM!B32=\"x\",HM!C32=\"x\"),\"J/N angekreuzt\",IF(HM!B32=\"x\",\"Ja\",IF(HM!C32=\"x\",\"Nein\",\"\")))","v":""},null,"09.",{"$f":"IF(N10=\"\",\"\",C42)","v":""},{"$f":"D42","v":""},{"$f":"E42","v":""}]
["05.","Schütze-2",{"$f":"$C$7","v":"SV-Verein 02"},{"$f":"IF('2'!$N$23=0,\"\",'2'!$M$15)","v":""},{"$f":"IF('2'!$N$23=0,\"\",'2'!$N$23)","v":""},null,"10.",{"$f":"IF(HM!M8=\"\",\"\",HM!M8)","v":"SV-Verein 10"},{"$f":"IF('10'!$H$15=0,\"\",'10'!$H$15)","v":""},{"$f":"IF(AND(HM!J8=\"x\",HM!K8=\"x\"),\"J/N angekreuzt\",IF(HM!J8=\"x\",\"Ja\",IF(HM!K8=\"x\",\"Nein\",\"\")))","v":""},null,"10.",{"$f":"IF(N11=\"\",\"\",C47)","v":""},{"$f":"D47","v":""},{"$f":"E47","v":""}]
["01.","König",{"$f":"IF(HM!E14=\"\",\"\",HM!E14)","v":"SV-Verein 03"},{"$f":"IF('3'!$D$12=0,\"\",'3'!$C$4)","v":""},{"$f":"IF('3'!$D$12=0,\"\",'3'!$D$12)","v":""},null,"11.",{"$f":"IF(HM!M11=\"\",\"\",HM!M11)","v":"SV-Verein 11"},{"$f":"IF('11'!$H$15=0,\"\",'11'!$H$15)","v":""},{"$f":"IF(AND(HM!J11=\"x\",HM!K11=\"x\"),\"J/N angekreuzt\",IF(HM!J11=\"x\",\"Ja\",IF(HM!K11=\"x\",\"Nein\",\"\")))","v":""},null,"11.",{"$f":"IF(N12=\"\",\"\",C52)","v":""},{"$f":"D52","v":""},{"$f":"E52","v":""}]
["02.","Adjutant",{"$f":"$C$12","v":"SV-Verein 03"},{"$f":"IF('3'!$I$12=0,\"\",'3'!$H$4)","v":""},{"$f":"IF('3'!$I$12=0,\"\",'3'!$I$12)","v":""},null,"12.",{"$f":"IF(HM!M14=\"\",\"\",HM!M14)","v":"SV-Verein 12"},{"$f":"IF('12'!$H$15=0,\"\",'12'!$H$15)","v":""},{"$f":"IF(AND(HM!J14=\"x\",HM!K14=\"x\"),\"J/N angekreuzt\",IF(HM!J14=\"x\",\"Ja\",IF(HM!K14=\"x\",\"Nein\",\"\")))","v":""},null,"12.",{"$f":"IF(N13=\"\",\"\",C57)","v":""},{"$f":"D57","v":""},{"$f":"E57","v":""}]
["03.","Präsident",{"$f":"$C$12","v":"SV-Verein 03"},{"$f":"IF('3'!$N$12=0,\"\",'3'!$M$4)","v":""},{"$f":"IF('3'!$N$12=0,\"\",'3'!$N$12)","v":""},null,"13.",{"$f":"IF(HM!M17=\"\",\"\",HM!M17)","v":"SV-Verein 13"},{"$f":"IF('13'!$H$15=0,\"\",'13'!$H$15)","v":""},{"$f":"IF(AND(HM!J17=\"x\",HM!K17=\"x\"),\"J/N angekreuzt\",IF(HM!J17=\"x\",\"Ja\",IF(HM!K17=\"x\",\"Nein\",\"\")))","v":""},null,"13.",{"$f":"IF(N14=\"\",\"\",C62)","v":""},{"$f":"D62","v":""},{"$f":"E62","v":""}]
["04.","Schütze-1",{"$f":"$C$12","v":"SV-Verein 03"},{"$f":"IF('3'!$D$23=0,\"\",'3'!$C$15)","v":""},{"$f":"IF('3'!$D$23=0,\"\",'3'!$D$23)","v":""},null,"14.",{"$f":"IF(HM!M20=\"\",\"\",HM!M20)","v":"SV-Verein 14"},{"$f":"IF('14'!$H$15=0,\"\",'14'!$H$15)","v":""},{"$f":"IF(AND(HM!J20=\"x\",HM!K20=\"x\"),\"J/N angekreuzt\",IF(HM!J20=\"x\",\"Ja\",IF(HM!K20=\"x\",\"Nein\",\"\")))","v":""},null,"14.",{"$f":"IF(N15=\"\",\"\",C67)","v":""},{"$f":"D67","v":""},{"$f":"E67","v":""}]
["05.","Schütze-2",{"$f":"$C$12","v":"SV-Verein 03"},{"$f":"IF('3'!$N$23=0,\"\",'3'!$M$15)","v":""},{"$f":"IF('3'!$N$23=0,\"\",'3'!$N$23)","v":""},null,"15.",{"$f":"IF(HM!M23=\"\",\"\",HM!M23)","v":"SV-Verein 15"},{"$f":"IF('15'!$H$15=0,\"\",'15'!$H$15)","v":""},{"$f":"IF(AND(HM!J23=\"x\",HM!K23=\"x\"),\"J/N angekreuzt\",IF(HM!J23=\"x\",\"Ja\",IF(HM!K23=\"x\",\"Nein\",\"\")))","v":""},null,"15.",{"$f":"IF(N16=\"\",\"\",C72)","v":""},{"$f":"D72","v":""},{"$f":"E72","v":""}]
["01.","König",{"$f":"IF(HM!E17=\"\",\"\",HM!E17)","v":"SV-Verein 04"},{"$f":"IF('4'!$D$12=0,\"\",'4'!$C$4)","v":""},{"$f":"IF('4'!$D$12=0,\"\",'4'!$D$12)","v":""},null,"16.",{"$f":"IF(HM!M26=\"\",\"\",HM!M26)","v":"SV-Verein 16"},{"$f":"IF('16'!$H$15=0,\"\",'16'!$H$15)","v":""},{"$f":"IF(AND(HM!J26=\"x\",HM!K26=\"x\"),\"J/N angekreuzt\",IF(HM!J26=\"x\",\"Ja\",IF(HM!K26=\"x\",\"Nein\",\"\")))","v":""},null,"16.",{"$f":"IF(N17=\"\",\"\",C77)","v":""},{"$f":"D77","v":""},{"$f":"E77","v":""}]
["02.","Adjutant",{"$f":"$C$17","v":"SV-Verein 04"},{"$f":"IF('4'!$I$12=0,\"\",'4'!$H$4)","v":""},{"$f":"IF('4'!$I$12=0,\"\",'4'!$I$12)","v":""},null,"17.",{"$f":"IF(HM!M29=\"\",\"\",HM!M29)","v":"SV-Verein 17"},{"$f":"IF('17'!$H$15=0,\"\",'17'!$H$15)","v":""},{"$f":"IF(AND(HM!J29=\"x\",HM!K29=\"x\"),\"J/N angekreuzt\",IF(HM!J29=\"x\",\"Ja\",IF(HM!K29=\"x\",\"Nein\",\"\")))","v":""},null,"17.",{"$f":"IF(N18=\"\",\"\",C82)","v":""},{"$f":"D82","v":""},{"$f":"E82","v":""}]
["03.","Präsident",{"$f":"$C$17","v":"SV-Verein 04"},{"$f":"IF('4'!$N$12=0,\"\",'4'!$M$4)","v":""},{"$f":"IF('4'!$N$12=0,\"\",'4'!$N$12)","v":""},null,"18.",{"$f":"IF(HM!M32=\"\",\"\",HM!M32)","v":"SV-Verein 18"},{"$f":"IF('18'!$H$15=0,\"\",'18'!$H$15)","v":""},{"$f":"IF(AND(HM!J32=\"x\",HM!K32=\"x\"),\"J/N angekreuzt\",IF(HM!J32=\"x\",\"Ja\",IF(HM!K32=\"x\",\"Nein\",\"\")))","v":""},null,"18.",{"$f":"IF(N19=\"\",\"\",C87)","v":""},{"$f":"D87","v":""},{"$f":"E87","v":""}]
["04.","Schütze-1",{"$f":"$C$17","v":"SV-Verein 04"},{"$f":"IF('4'!$D$23=0,\"\",'4'!$C$15)","v":""},{"$f":"IF('4'!$D$23=0,\"\",'4'!$D$23)","v":""}]
["05.","Schütze-2",{"$f":"$C$17","v":"SV-Verein 04"},{"$f":"IF('4'!$N$23=0,\"\",'4'!$M$15)","v":""},{"$f":"IF('4'!$N$23=0,\"\",'4'!$N$23)","v":""},null,null,"Adjutanten:",null,null,null,null,"Präsidenten:"]
["01.","König",{"$f":"IF(HM!E20=\"\",\"\",HM!E20)","v":"SV-Verein 05"},{"$f":"IF('5'!$D$12=0,\"\",'5'!$C$4)","v":""},{"$f":"IF('5'!$D$12=0,\"\",'5'!$D$12)","v":""},null,null,"Verein:","Name:","Punkte:",null,null,"Verein:","Name:","Punkte:"]
["02.","Adjutant",{"$f":"$C$22","v":"SV-Verein 05"},{"$f":"IF('5'!$I$12=0,\"\",'5'!$H$4)","v":""},{"$f":"IF('5'!$I$12=0,\"\",'5'!$I$12)","v":""},null,"01.",{"$f":"IF(I23=\"\",\"\",C3)","v":""},{"$f":"D3","v":""},{"$f":"E3","v":""},null,"01.",{"$f":"IF(N23=\"\",\"\",C4)","v":""},{"$f":"D4","v":""},{"$f":"E4","v":""}]
["03.","Präsident",{"$f":"$C$22","v":"SV-Verein 05"},{"$f":"IF('5'!$N$12=0,\"\",'5'!$M$4)","v":""},{"$f":"IF('5'!$N$12=0,\"\",'5'!$N$12)","v":""},null,"02.",{"$f":"IF(I24=\"\",\"\",C8)","v":""},{"$f":"D8","v":""},{"$f":"E8","v":""},null,"02.",{"$f":"IF(N24=\"\",\"\",C9)","v":""},{"$f":"D9","v":""},{"$f":"E9","v":""}]
["04.","Schütze-1",{"$f":"$C$22","v":"SV-Verein 05"},{"$f":"IF('5'!$D$23=0,\"\",'5'!$C$15)","v":""},{"$f":"IF('5'!$D$23=0,\"\",'5'!$D$23)","v":""},null,"03.",{"$f":"IF(I25=\"\",\"\",C13)","v":""},{"$f":"D13","v":""},{"$f":"E13","v":""},null,"03.",{"$f":"IF(N25=\"\",\"\",C14)","v":""},{"$f":"D14","v":""},{"$f":"E14","v":""}]
["05.","Schütze-2",{"$f":"$C$22","v":"SV-Verein 05"},{"$f":"IF('5'!$N$23=0,\"\",'5'!$M$15)","v":""},{"$f":"IF('5'!$N$23=0,\"\",'5'!$N$23)","v":""},null,"04.",{"$f":"IF(I26=\"\",\"\",C18)","v":""},{"$f":"D18","v":""},{"$f":"E18","v":""},null,"04.",{"$f":"IF(N26=\"\",\"\",C19)","v":""},{"$f":"D19","v":""},{"$f":"E19","v":""}]
["01.","König",{"$f":"IF(HM!E23=\"\",\"\",HM!E23)","v":"SV-Verein 06"},{"$f":"IF('6'!$D$12=0,\"\",'6'!$C$4)","v":""},{"$f":"IF('6'!$D$12=0,\"\",'6'!$D$12)","v":""},null,"05.",{"$f":"IF(I27=\"\",\"\",C23)","v":""},{"$f":"D23","v":""},{"$f":"E23","v":""},null,"05.",{"$f":"IF(N27=\"\",\"\",C24)","v":""},{"$f":"D24","v":""},{"$f":"E24","v":""}]
["02.","Adjutant",{"$f":"$C$27","v":"SV-Verein 06"},{"$f":"IF('6'!$I$12=0,\"\",'6'!$H$4)","v":""},{"$f":"IF('6'!$I$12=0,\"\",'6'!$I$12)","v":""},null,"06.",{"$f":"IF(I28=\"\",\"\",C28)","v":""},{"$f":"D28","v":""},{"$f":"E28","v":""},null,"06.",{"$f":"IF(N28=\"\",\"\",C29)","v":""},{"$f":"D29","v":""},{"$f":"E29","v":""}]
["03.","Präsident",{"$f":"$C$27","v":"SV-Verein 06"},{"$f":"IF('6'!$N$12=0,\"\",'6'!$M$4)","v":""},{"$f":"IF('6'!$N$12=0,\"\",'6'!$N$12)","v":""},null,"07.",{"$f":"IF(I29=\"\",\"\",C33)","v":""},{"$f":"D33","v":""},{"$f":"E33","v":""},null,"07.",{"$f":"IF(N29=\"\",\"\",C34)","v":""},{"$f":"D34","v":""},{"$f":"E34","v":""}]
["04.","Schütze-1",{"$f":"$C$27","v":"SV-Verein 06"},{"$f":"IF('6'!$D$23=0,\"\",'6'!$C$15)","v":""},{"$f":"IF('6'!$D$23=0,\"\",'6'!$D$23)","v":""},null,"08.",{"$f":"IF(I30=\"\",\"\",C38)","v":""},{"$f":"D38","v":""},{"$f":"E38","v":""},null,"08.",{"$f":"IF(N30=\"\",\"\",C39)","v":""},{"$f":"D39","v":""},{"$f":"E39","v":""}]
["05.","Schütze-2",{"$f":"$C$27","v":"SV-Verein 06"},{"$f":"IF('6'!$N$23=0,\"\",'6'!$M$15)","v":""},{"$f":"IF('6'!$N$23=0,\"\",'6'!$N$23)","v":""},null,"09.",{"$f":"IF(I31=\"\",\"\",C43)","v":""},{"$f":"D43","v":""},{"$f":"E43","v":""},null,"09.",{"$f":"IF(N31=\"\",\"\",C44)","v":""},{"$f":"D44","v":""},{"$f":"E44","v":""}]
["01.","König",{"$f":"IF(HM!E26=\"\",\"\",HM!E26)","v":"SV-Verein 07"},{"$f":"IF('7'!$D$12=0,\"\",'7'!$C$4)","v":""},{"$f":"IF('7'!$D$12=0,\"\",'7'!$D$12)","v":""},null,"10.",{"$f":"IF(I32=\"\",\"\",C48)","v":""},{"$f":"D48","v":""},{"$f":"E48","v":""},null,"10.",{"$f":"IF(N32=\"\",\"\",C49)","v":""},{"$f":"D49","v":""},{"$f":"E49","v":""}]
["02.","Adjutant",{"$f":"$C$32","v":"SV-Verein 07"},{"$f":"IF('7'!$I$12=0,\"\",'7'!$H$4)","v":""},{"$f":"IF('7'!$I$12=0,\"\",'7'!$I$12)","v":""},null,"11.",{"$f":"IF(I33=\"\",\"\",C53)","v":""},{"$f":"D53","v":""},{"$f":"E53","v":""},null,"11.",{"$f":"IF(N33=\"\",\"\",C54)","v":""},{"$f":"D54","v":""},{"$f":"E54","v":""}]
["03.","Präsident",{"$f":"$C$32","v":"SV-Verein 07"},{"$f":"IF('7'!$N$12=0,\"\",'7'!$M$4)","v":""},{"$f":"IF('7'!$N$12=0,\"\",'7'!$N$12)","v":""},null,"12.",{"$f":"IF(I34=\"\",\"\",C58)","v":""},{"$f":"D58","v":""},{"$f":"E58","v":""},null,"12.",{"$f":"IF(N34=\"\",\"\",C59)","v":""},{"$f":"D59","v":""},{"$f":"E59","v":""}]
["04.","Schütze-1",{"$f":"$C$32","v":"SV-Verein 07"},{"$f":"IF('7'!$D$23=0,\"\",'7'!$C$15)","v":""},{"$f":"IF('7'!$D$23=0,\"\",'7'!$D$23)","v":""},null,"13.",{"$f":"IF(I35=\"\",\"\",C63)","v":""},{"$f":"D63","v":""},{"$f":"E63","v":""},null,"13.",{"$f":"IF(N35=\"\",\"\",C64)","v":""},{"$f":"D64","v":""},{"$f":"E64","v":""}]
["05.","Schütze-2",{"$f":"$C$32","v":"SV-Verein 07"},{"$f":"IF('7'!$N$23=0,\"\",'7'!$M$15)","v":""},{"$f":"IF('7'!$N$23=0,\"\",'7'!$N$23)","v":""},null,"14.",{"$f":"IF(I36=\"\",\"\",C68)","v":""},{"$f":"D68","v":""},{"$f":"E68","v":""},null,"14.",{"$f":"IF(N36=\"\",\"\",C69)","v":""},{"$f":"D69","v":""},{"$f":"E69","v":""}]
["01.","König",{"$f":"IF(HM!E29=\"\",\"\",HM!E29)","v":"SV-Verein 08"},{"$f":"IF('8'!$D$12=0,\"\",'8'!$C$4)","v":""},{"$f":"IF('8'!$D$12=0,\"\",'8'!$D$12)","v":""},null,"15.",{"$f":"IF(I37=\"\",\"\",C73)","v":""},{"$f":"D73","v":""},{"$f":"E73","v":""},null,"15.",{"$f":"IF(N37=\"\",\"\",C74)","v":""},{"$f":"D74","v":""},{"$f":"E74","v":""}]
["02.","Adjutant",{"$f":"$C$37","v":"SV-Verein 08"},{"$f":"IF('8'!$I$12=0,\"\",'8'!$H$4)","v":""},{"$f":"IF('8'!$I$12=0,\"\",'8'!$I$12)","v":""},null,"16.",{"$f":"IF(I38=\"\",\"\",C78)","v":""},{"$f":"D78","v":""},{"$f":"E78","v":""},null,"16.",{"$f":"IF(N38=\"\",\"\",C79)","v":""},{"$f":"D79","v":""},{"$f":"E79","v":""}]
["03.","Präsident",{"$f":"$C$37","v":"SV-Verein 08"},{"$f":"IF('8'!$N$12=0,\"\",'8'!$M$4)","v":""},{"$f":"IF('8'!$N$12=0,\"\",'8'!$N$12)","v":""},null,"17.",{"$f":"IF(I39=\"\",\"\",C83)","v":""},{"$f":"D83","v":""},{"$f":"E83","v":""},null,"17.",{"$f":"IF(N39=\"\",\"\",C84)","v":""},{"$f":"D84","v":""},{"$f":"E84","v":""}]
["04.","Schütze-1",{"$f":"$C$37","v":"SV-Verein 08"},{"$f":"IF('8'!$D$23=0,\"\",'8'!$C$15)","v":""},{"$f":"IF('8'!$D$23=0,\"\",'8'!$D$23)","v":""},null,"18.",{"$f":"IF(I40=\"\",\"\",C88)","v":""},{"$f":"D88","v":""},{"$f":"E88","v":""},null,"18.",{"$f":"IF(N40=\"\",\"\",C89)","v":""},{"$f":"D89","v":""},{"$f":"E89","v":""}]
["05.","Schütze-2",{"$f":"$C$37","v":"SV-Verein 08"},{"$f":"IF('8'!$N$23=0,\"\",'8'!$M$15)","v":""},{"$f":"IF('8'!$N$23=0,\"\",'8'!$N$23)","v":""}]
["01.","König",{"$f":"IF(HM!E32=\"\",\"\",HM!E32)","v":"SV-Verein 09"},{"$f":"IF('9'!$D$12=0,\"\",'9'!$C$4)","v":""},{"$f":"IF('9'!$D$12=0,\"\",'9'!$D$12)","v":""},null,null,null,null,null,null,null,"Schützen"]
["02.","Adjutant",{"$f":"$C$42","v":"SV-Verein 09"},{"$f":"IF('9'!$I$12=0,\"\",'9'!$H$4)","v":""},{"$f":"IF('9'!$I$12=0,\"\",'9'!$I$12)","v":""},null,null,null,null,null,null,null,"Verein:","Name:","Punkte:"]
["03.","Präsident",{"$f":"$C$42","v":"SV-Verein 09"},{"$f":"IF('9'!$N$12=0,\"\",'9'!$M$4)","v":""},{"$f":"IF('9'!$N$12=0,\"\",'9'!$N$12)","v":""},null,null,null,null,null,null,"01.",{"$f":"IF(N44=\"\",\"\",C5)","v":""},{"$f":"D5","v":""},{"$f":"E5","v":""}]
["04.","Schütze-1",{"$f":"$C$42","v":"SV-Verein 09"},{"$f":"IF('9'!$D$23=0,\"\",'9'!$C$15)","v":""},{"$f":"IF('9'!$D$23=0,\"\",'9'!$D$23)","v":""},null,null,null,null,null,null,"02.",{"$f":"IF(N45=\"\",\"\",C6)","v":""},{"$f":"D6","v":""},{"$f":"E6","v":""}]
["05.","Schütze-2",{"$f":"$C$42","v":"SV-Verein 09"},{"$f":"IF('9'!$N$23=0,\"\",'9'!$M$15)","v":""},{"$f":"IF('9'!$N$23=0,\"\",'9'!$N$23)","v":""},null,null,null,null,null,null,"03.",{"$f":"IF(N46=\"\",\"\",C10)","v":""},{"$f":"D10","v":""},{"$f":"E10","v":""}]
["01.","König",{"$f":"IF(HM!M8=\"\",\"\",HM!M8)","v":"SV-Verein 10"},{"$f":"IF('10'!$D$12=0,\"\",'10'!$C$4)","v":""},{"$f":"IF('10'!$D$12=0,\"\",'10'!$D$12)","v":""},null,null,null,null,null,null,"04.",{"$f":"IF(N47=\"\",\"\",C11)","v":""},{"$f":"D11","v":""},{"$f":"E11","v":""}]
["02.","Adjutant",{"$f":"$C$47","v":"SV-Verein 10"},{"$f":"IF('10'!$I$12=0,\"\",'10'!$H$4)","v":""},{"$f":"IF('10'!$I$12=0,\"\",'10'!$I$12)","v":""},null,null,null,null,null,null,"05.",{"$f":"IF(N48=\"\",\"\",C15)","v":""},{"$f":"D15","v":""},{"$f":"E15","v":""}]
["03.","Präsident",{"$f":"$C$47","v":"SV-Verein 10"},{"$f":"IF('10'!$N$12=0,\"\",'10'!$M$4)","v":""},{"$f":"IF('10'!$N$12=0,\"\",'10'!$N$12)","v":""},null,null,null,null,null,null,"06.",{"$f":"IF(N49=\"\",\"\",C16)","v":""},{"$f":"D16","v":""},{"$f":"E16","v":""}]
["04.","Schütze-1",{"$f":"$C$47","v":"SV-Verein 10"},{"$f":"IF('10'!$D$23=0,\"\",'10'!$C$15)","v":""},{"$f":"IF('10'!$D$23=0,\"\",'10'!$D$23)","v":""},null,null,null,null,null,null,"07.",{"$f":"IF(N50=\"\",\"\",C20)","v":""},{"$f":"D20","v":""},{"$f":"E20","v":""}]
["05.","Schütze-2",{"$f":"$C$47","v":"SV-Verein 10"},{"$f":"IF('10'!$N$23=0,\"\",'10'!$M$15)","v":""},{"$f":"IF('10'!$N$23=0,\"\",'10'!$N$23)","v":""},null,null,null,null,null,null,"08.",{"$f":"IF(N51=\"\",\"\",C21)","v":""},{"$f":"D21","v":""},{"$f":"E21","v":""}]
["01.","König",{"$f":"IF(HM!M11=\"\",\"\",HM!M11)","v":"SV-Verein 11"},{"$f":"IF('11'!$D$12=0,\"\",'11'!$C$4)","v":""},{"$f":"IF('11'!$D$12=0,\"\",'11'!$D$12)","v":""},null,null,null,null,null,null,"09.",{"$f":"IF(N52=\"\",\"\",C25)","v":""},{"$f":"D25","v":""},{"$f":"E25","v":""}]
["02.","Adjutant",{"$f":"$C$52","v":"SV-Verein 11"},{"$f":"IF('11'!$I$12=0,\"\",'11'!$H$4)","v":""},{"$f":"IF('11'!$I$12=0,\"\",'11'!$I$12)","v":""},null,null,null,null,null,null,"10.",{"$f":"IF(N53=\"\",\"\",C26)","v":""},{"$f":"D26","v":""},{"$f":"E26","v":""}]
["03.","Präsident",{"$f":"$C$52","v":"SV-Verein 11"},{"$f":"IF('11'!$N$12=0,\"\",'11'!$M$4)","v":""},{"$f":"IF('11'!$N$12=0,\"\",'11'!$N$12)","v":""},null,null,null,null,null,null,"11.",{"$f":"IF(N54=\"\",\"\",C30)","v":""},{"$f":"D30","v":""},{"$f":"E30","v":""}]
["04.","Schütze-1",{"$f":"$C$52","v":"SV-Verein 11"},{"$f":"IF('11'!$D$23=0,\"\",'11'!$C$15)","v":""},{"$f":"IF('11'!$D$23=0,\"\",'11'!$D$23)","v":""},null,null,null,null,null,null,"12.",{"$f":"IF(N55=\"\",\"\",C31)","v":""},{"$f":"D31","v":""},{"$f":"E31","v":""}]
["05.","Schütze-2",{"$f":"$C$52","v":"SV-Verein 11"},{"$f":"IF('11'!$N$23=0,\"\",'11'!$M$15)","v":""},{"$f":"IF('11'!$N$23=0,\"\",'11'!$N$23)","v":""},null,null,null,null,null,null,"13.",{"$f":"IF(N56=\"\",\"\",C35)","v":""},{"$f":"D35","v":""},{"$f":"E35","v":""}]
["01.","König",{"$f":"IF(HM!M14=\"\",\"\",HM!M14)","v":"SV-Verein 12"},{"$f":"IF('12'!$D$12=0,\"\",'12'!$C$4)","v":""},{"$f":"IF('12'!$D$12=0,\"\",'12'!$D$12)","v":""},null,null,null,null,null,null,"14.",{"$f":"IF(N57=\"\",\"\",C36)","v":""},{"$f":"D36","v":""},{"$f":"E36","v":""}]
["02.","Adjutant",{"$f":"$C$57","v":"SV-Verein 12"},{"$f":"IF('12'!$I$12=0,\"\",'12'!$H$4)","v":""},{"$f":"IF('12'!$I$12=0,\"\",'12'!$I$12)","v":""},null,null,null,null,null,null,"15.",{"$f":"IF(N58=\"\",\"\",C40)","v":""},{"$f":"D40","v":""},{"$f":"E40","v":""}]
["03.","Präsident",{"$f":"$C$57","v":"SV-Verein 12"},{"$f":"IF('12'!$N$12=0,\"\",'12'!$M$4)","v":""},{"$f":"IF('12'!$N$12=0,\"\",'12'!$N$12)","v":""},null,null,null,null,null,null,"16.",{"$f":"IF(N59=\"\",\"\",C41)","v":""},{"$f":"D41","v":""},{"$f":"E41","v":""}]
["04.","Schütze-1",{"$f":"$C$57","v":"SV-Verein 12"},{"$f":"IF('12'!$D$23=0,\"\",'12'!$C$15)","v":""},{"$f":"IF('12'!$D$23=0,\"\",'12'!$D$23)","v":""},null,null,null,null,null,null,"17.",{"$f":"IF(N60=\"\",\"\",C45)","v":""},{"$f":"D45","v":""},{"$f":"E45","v":""}]
["05.","Schütze-2",{"$f":"$C$57","v":"SV-Verein 12"},{"$f":"IF('12'!$N$23=0,\"\",'12'!$M$15)","v":""},{"$f":"IF('12'!$N$23=0,\"\",'12'!$N$23)","v":""},null,null,null,null,null,null,"18.",{"$f":"IF(N61=\"\",\"\",C46)","v":""},{"$f":"D46","v":""},{"$f":"E46","v":""}]
["01.","König",{"$f":"IF(HM!M17=\"\",\"\",HM!M17)","v":"SV-Verein 13"},{"$f":"IF('13'!$D$12=0,\"\",'13'!$C$4)","v":""},{"$f":"IF('13'!$D$12=0,\"\",'13'!$D$12)","v":""},null,null,null,null,null,null,"19.",{"$f":"IF(N62=\"\",\"\",C50)","v":""},{"$f":"D50","v":""},{"$f":"E50","v":""}]
["02.","Adjutant",{"$f":"$C$62","v":"SV-Verein 13"},{"$f":"IF('13'!$I$12=0,\"\",'13'!$H$4)","v":""},{"$f":"IF('13'!$I$12=0,\"\",'13'!$I$12)","v":""},null,null,null,null,null,null,"20.",{"$f":"IF(N63=\"\",\"\",C51)","v":""},{"$f":"D51","v":""},{"$f":"E51","v":""}]
["03.","Präsident",{"$f":"$C$62","v":"SV-Verein 13"},{"$f":"IF('13'!$N$12=0,\"\",'13'!$M$4)","v":""},{"$f":"IF('13'!$N$12=0,\"\",'13'!$N$12)","v":""},null,null,null,null,null,null,"21.",{"$f":"IF(N64=\"\",\"\",C55)","v":""},{"$f":"D55","v":""},{"$f":"E55","v":""}]
["04.","Schütze-1",{"$f":"$C$62","v":"SV-Verein 13"},{"$f":"IF('13'!$D$23=0,\"\",'13'!$C$15)","v":""},{"$f":"IF('13'!$D$23=0,\"\",'13'!$D$23)","v":""},null,null,null,null,null,null,"22.",{"$f":"IF(N65=\"\",\"\",C56)","v":""},{"$f":"D56","v":""},{"$f":"E56","v":""}]
["05.","Schütze-2",{"$f":"$C$62","v":"SV-Verein 13"},{"$f":"IF('13'!$N$23=0,\"\",'13'!$M$15)","v":""},{"$f":"IF('13'!$N$23=0,\"\",'13'!$N$23)","v":""},null,null,null,null,null,null,"23.",{"$f":"IF(N66=\"\",\"\",C60)","v":""},{"$f":"D60","v":""},{"$f":"E60","v":""}]
["01.","König",{"$f":"IF(HM!M20=\"\",\"\",HM!M20)","v":"SV-Verein 14"},{"$f":"IF('14'!$D$12=0,\"\",'14'!$C$4)","v":""},{"$f":"IF('14'!$D$12=0,\"\",'14'!$D$12)","v":""},null,null,null,null,null,null,"24.",{"$f":"IF(N67=\"\",\"\",C61)","v":""},{"$f":"D61","v":""},{"$f":"E61","v":""}]
["02.","Adjutant",{"$f":"$C$67","v":"SV-Verein 14"},{"$f":"IF('14'!$I$12=0,\"\",'14'!$H$4)","v":""},{"$f":"IF('14'!$I$12=0,\"\",'14'!$I$12)","v":""},null,null,null,null,null,null,"25.",{"$f":"IF(N68=\"\",\"\",C65)","v":""},{"$f":"D65","v":""},{"$f":"E65","v":""}]
["03.","Präsident",{"$f":"$C$67","v":"SV-Verein 14"},{"$f":"IF('14'!$N$12=0,\"\",'14'!$M$4)","v":""},{"$f":"IF('14'!$N$12=0,\"\",'14'!$N$12)","v":""},null,null,null,null,null,null,"26.",{"$f":"IF(N69=\"\",\"\",C66)","v":""},{"$f":"D66","v":""},{"$f":"E66","v":""}]
["04.","Schütze-1",{"$f":"$C$67","v":"SV-Verein 14"},{"$f":"IF('14'!$D$23=0,\"\",'14'!$C$15)","v":""},{"$f":"IF('14'!$D$23=0,\"\",'14'!$D$23)","v":""},null,null,null,null,null,null,"27.",{"$f":"IF(N70=\"\",\"\",C70)","v":""},{"$f":"D70","v":""},{"$f":"E70","v":""}]
["05.","Schütze-2",{"$f":"$C$67","v":"SV-Verein 14"},{"$f":"IF('14'!$N$23=0,\"\",'14'!$M$15)","v":""},{"$f":"IF('14'!$N$23=0,\"\",'14'!$N$23)","v":""},null,null,null,null,null,null,"28.",{"$f":"IF(N71=\"\",\"\",C71)","v":""},{"$f":"D71","v":""},{"$f":"E71","v":""}]
["01.","König",{"$f":"IF(HM!M23=\"\",\"\",HM!M23)","v":"SV-Verein 15"},{"$f":"IF('15'!$D$12=0,\"\",'15'!$C$4)","v":""},{"$f":"IF('15'!$D$12=0,\"\",'15'!$D$12)","v":""},null,null,null,null,null,null,"29.",{"$f":"IF(N72=\"\",\"\",C75)","v":""},{"$f":"D75","v":""},{"$f":"E75","v":""}]
["02.","Adjutant",{"$f":"$C$72","v":"SV-Verein 15"},{"$f":"IF('15'!$I$12=0,\"\",'15'!$H$4)","v":""},{"$f":"IF('15'!$I$12=0,\"\",'15'!$I$12)","v":""},null,null,null,null,null,null,"30.",{"$f":"IF(N73=\"\",\"\",C76)","v":""},{"$f":"D76","v":""},{"$f":"E76","v":""}]
["03.","Präsident",{"$f":"$C$72","v":"SV-Verein 15"},{"$f":"IF('15'!$N$12=0,\"\",'15'!$M$4)","v":""},{"$f":"IF('15'!$N$12=0,\"\",'15'!$N$12)","v":""},null,null,null,null,null,null,"31.",{"$f":"IF(N74=\"\",\"\",C80)","v":""},{"$f":"D80","v":""},{"$f":"E80","v":""}]
["04.","Schütze-1",{"$f":"$C$72","v":"SV-Verein 15"},{"$f":"IF('15'!$D$23=0,\"\",'15'!$C$15)","v":""},{"$f":"IF('15'!$D$23=0,\"\",'15'!$D$23)","v":""},null,null,null,null,null,null,"32.",{"$f":"IF(N75=\"\",\"\",C81)","v":""},{"$f":"D81","v":""},{"$f":"E81","v":""}]
["05.","Schütze-2",{"$f":"$C$72","v":"SV-Verein 15"},{"$f":"IF('15'!$N$23=0,\"\",'15'!$M$15)","v":""},{"$f":"IF('15'!$N$23=0,\"\",'15'!$N$23)","v":""},null,null,null,null,null,null,"33.",{"$f":"IF(N76=\"\",\"\",C85)","v":""},{"$f":"D85","v":""},{"$f":"E85","v":""}]
["01.","König",{"$f":"IF(HM!M26=\"\",\"\",HM!M26)","v":"SV-Verein 16"},{"$f":"IF('16'!$D$12=0,\"\",'16'!$C$4)","v":""},{"$f":"IF('16'!$D$12=0,\"\",'16'!$D$12)","v":""},null,null,null,null,null,null,"34.",{"$f":"IF(N77=\"\",\"\",C86)","v":""},{"$f":"D86","v":""},{"$f":"E86","v":""}]
["02.","Adjutant",{"$f":"$C$77","v":"SV-Verein 16"},{"$f":"IF('16'!$I$12=0,\"\",'16'!$H$4)","v":""},{"$f":"IF('16'!$I$12=0,\"\",'16'!$I$12)","v":""},null,null,null,null,null,null,"35.",{"$f":"IF(N78=\"\",\"\",C90)","v":""},{"$f":"D90","v":""},{"$f":"E90","v":""}]
["03.","Präsident",{"$f":"$C$77","v":"SV-Verein 16"},{"$f":"IF('16'!$N$12=0,\"\",'16'!$M$4)","v":""},{"$f":"IF('16'!$N$12=0,\"\",'16'!$N$12)","v":""},null,null,null,null,null,null,"36.",{"$f":"IF(N79=\"\",\"\",C91)","v":""},{"$f":"D91","v":""},{"$f":"E91","v":""}]
["04.","Schütze-1",{"$f":"$C$77","v":"SV-Verein 16"},{"$f":"IF('16'!$D$23=0,\"\",'16'!$C$15)","v":""},{"$f":"IF('16'!$D$23=0,\"\",'16'!$D$23)","v":""}]
["05.","Schütze-2",{"$f":"$C$77","v":"SV-Verein 16"},{"$f":"IF('16'!$N$23=0,\"\",'16'!$M$15)","v":""},{"$f":"IF('16'!$N$23=0,\"\",'16'!$N$23)","v":""}]
["01.","König",{"$f":"IF(HM!M29=\"\",\"\",HM!M29)","v":"SV-Verein 17"},{"$f":"IF('17'!$D$12=0,\"\",'17'!$C$4)","v":""},{"$f":"IF('17'!$D$12=0,\"\",'17'!$D$12)","v":""}]
["02.","Adjutant",{"$f":"$C$82","v":"SV-Verein 17"},{"$f":"IF('17'!$I$12=0,\"\",'17'!$H$4)","v":""},{"$f":"IF('17'!$I$12=0,\"\",'17'!$I$12)","v":""}]
["03.","Präsident",{"$f":"$C$82","v":"SV-Verein 17"},{"$f":"IF('17'!$N$12=0,\"\",'17'!$M$4)","v":""},{"$f":"IF('17'!$N$12=0,\"\",'17'!$N$12)","v":""}]
["04.","Schütze-1",{"$f":"$C$82","v":"SV-Verein 17"},{"$f":"IF('17'!$D$23=0,\"\",'17'!$C$15)","v":""},{"$f":"IF('17'!$D$23=0,\"\",'17'!$D$23)","v":""}]
["05.","Schütze-2",{"$f":"$C$82","v":"SV-Verein 17"},{"$f":"IF('17'!$N$23=0,\"\",'17'!$M$15)","v":""},{"$f":"IF('17'!$N$23=0,\"\",'17'!$N$23)","v":""}]
["01.","König",{"$f":"IF(HM!M32=\"\",\"\",HM!M32)","v":"SV-Verein 18"},{"$f":"IF('18'!$D$12=0,\"\",'18'!$C$4)","v":""},{"$f":"IF('18'!$D$12=0,\"\",'18'!$D$12)","v":""}]
["02.","Adjutant",{"$f":"$C$87","v":"SV-Verein 18"},{"$f":"IF('18'!$I$12=0,\"\",'18'!$H$4)","v":""},{"$f":"IF('18'!$I$12=0,\"\",'18'!$I$12)","v":""}]
["03.","Präsident",{"$f":"$C$87","v":"SV-Verein 18"},{"$f":"IF('18'!$N$12=0,\"\",'18'!$M$4)","v":""},{"$f":"IF('18'!$N$12=0,\"\",'18'!$N$12)","v":""}]
["04.","Schütze-1",{"$f":"$C$87","v":"SV-Verein 18"},{"$f":"IF('18'!$D$23=0,\"\",'18'!$C$15)","v":""},{"$f":"IF('18'!$D$23=0,\"\",'18'!$D$23)","v":""}]
["05.","Schütze-2",{"$f":"$C$87","v":"SV-Verein 18"},{"$f":"IF('18'!$N$23=0,\"\",'18'!$M$15)","v":""},{"$f":"IF('18'!$N$23=0,\"\",'18'!$N$23)","v":""}]

{"sheet":"EM","index":21,"n_rows":45,"n_cols":9,"rows_kept":45,"cut":false,"hidden":false,"merged":[[29,0,29,3],[0,0,0,9],[28,5,28,8],[23,0,24,3],[25,2,25,3],[26,2,26,3],[2,0,2,3],[2,5,2,8],[10,5,11,8],[19,5,20,8]]}
[{"$f":"CONCATENATE(\"Volksbankschießen\",\" \",\"vom\",\" \",HM!A1&CHAR(10), \" in \",HM!A2)","v":"Volksbankschießen vom 23.04.2023\n in Kirchgellersen"}]
[]
["Mannschaftswertung",null,null,null,null,"Top 5 der Könige"]
["Platz:","Verein:","Punkte:","Gewinnberechtigt\n\"Gewehr\"",null,"Platz:","Name:","Verein:","Punkte:"]
["1.",{"$f":"IF(D!I2=\"\",\"\",D!H2)","v":""},{"$f":"D!I2","v":""},{"$f":"IF(D!I2=\"\",\"\",D!J2)","v":""},null,"1.",{"$f":"IF(D!N2=\"\",\"\",D!N2)","v":""},{"$f":"IF(D!N2=\"\",\"\",D!M2)","v":""},{"$f":"IF(D!O2=\"\",\"\",D!O2)","v":""}]
["2.",{"$f":"IF(D!I3=\"\",\"\",D!H3)","v":""},{"$f":"D!I3","v":""},{"$f":"IF(D!I3=\"\",\"\",D!J3)","v":""},null,"2.",{"$f":"IF(D!N3=\"\",\"\",D!N3)","v":""},{"$f":"IF(D!N3=\"\",\"\",D!M3)","v":""},{"$f":"IF(D!O3=\"\",\"\",D!O3)","v":""}]
["3.",{"$f":"IF(D!I4=\"\",\"\",D!H4)","v":""},{"$f":"D!I4","v":""},{"$f":"IF(D!I4=\"\",\"\",D!J4)","v":""},null,"3.",{"$f":"IF(D!N4=\"\",\"\",D!N4)","v":""},{"$f":"IF(D!N4=\"\",\"\",D!M4)","v":""},{"$f":"IF(D!O4=\"\",\"\",D!O4)","v":""}]
["4.",{"$f":"IF(D!I5=\"\",\"\",D!H5)","v":""},{"$f":"D!I5","v":""},{"$f":"IF(D!I5=\"\",\"\",D!J5)","v":""},null,"4.",{"$f":"IF(D!N5=\"\",\"\",D!N5)","v":""},{"$f":"IF(D!N5=\"\",\"\",D!M5)","v":""},{"$f":"IF(D!O5=\"\",\"\",D!O5)","v":""}]
["5.",{"$f":"IF(D!I6=\"\",\"\",D!H6)","v":""},{"$f":"D!I6","v":""},{"$f":"IF(D!I6=\"\",\"\",D!J6)","v":""},null,"5.",{"$f":"IF(D!N6=\"\",\"\",D!N6)","v":""},{"$f":"IF(D!N6=\"\",\"\",D!M6)","v":""},{"$f":"IF(D!O6=\"\",\"\",D!O6)","v":""}]
["6.",{"$f":"IF(D!I7=\"\",\"\",D!H7)","v":""},{"$f":"D!I7","v":""},{"$f":"IF(D!I7=\"\",\"\",D!J7)","v":""}]
["7.",{"$f":"IF(D!I8=\"\",\"\",D!H8)","v":""},{"$f":"D!I8","v":""},{"$f":"IF(D!I8=\"\",\"\",D!J8)","v":""},null,"Top 5 der Adjutanten"]
["8.",{"$f":"IF(D!I9=\"\",\"\",D!H9)","v":""},{"$f":"D!I9","v":""},{"$f":"IF(D!I9=\"\",\"\",D!J9)","v":""}]
["9.",{"$f":"IF(D!I10=\"\",\"\",D!H10)","v":""},{"$f":"D!I10","v":""},{"$f":"IF(D!I10=\"\",\"\",D!J10)","v":""},null,"Platz:","Name:","Verein:","Punkte:"]
["10.",{"$f":"IF(D!I11=\"\",\"\",D!H11)","v":""},{"$f":"D!I11","v":""},{"$f":"IF(D!I11=\"\",\"\",D!J11)","v":""},null,"1.",{"$f":"IF(D!I23=\"\",\"\",D!I23)","v":""},{"$f":"IF(D!I23=\"\",\"\",D!H23)","v":""},{"$f":"IF(D!J23=\"\",\"\",D!J23)","v":""}]
["11.",{"$f":"IF(D!I12=\"\",\"\",D!H12)","v":""},{"$f":"D!I12","v":""},{"$f":"IF(D!I12=\"\",\"\",D!J12)","v":""},null,"2.",{"$f":"IF(D!I24=\"\",\"\",D!I24)","v":""},{"$f":"IF(D!I24=\"\",\"\",D!H24)","v":""},{"$f":"IF(D!J24=\"\",\"\",D!J24)","v":""}]
["12.",{"$f":"IF(D!I13=\"\",\"\",D!H13)","v":""},{"$f":"D!I13","v":""},{"$f":"IF(D!I13=\"\",\"\",D!J13)","v":""},null,"3.",{"$f":"IF(D!I25=\"\",\"\",D!I25)","v":""},{"$f":"IF(D!I25=\"\",\"\",D!H25)","v":""},{"$f":"IF(D!J25=\"\",\"\",D!J25)","v":""}]
["13.",{"$f":"IF(D!I14=\"\",\"\",D!H14)","v":""},{"$f":"D!I14","v":""},{"$f":"IF(D!I14=\"\",\"\",D!J14)","v":""},null,"4.",{"$f":"IF(D!I26=\"\",\"\",D!I26)","v":""},{"$f":"IF(D!I26=\"\",\"\",D!H26)","v":""},{"$f":"IF(D!J26=\"\",\"\",D!J26)","v":""}]
["14.",{"$f":"IF(D!I15=\"\",\"\",D!H15)","v":""},{"$f":"D!I15","v":""},{"$f":"IF(D!I15=\"\",\"\",D!J15)","v":""},null,"5.",{"$f":"IF(D!I27=\"\",\"\",D!I27)","v":""},{"$f":"IF(D!I27=\"\",\"\",D!H27)","v":""},{"$f":"IF(D!J27=\"\",\"\",D!J27)","v":""}]
["15.",{"$f":"IF(D!I16=\"\",\"\",D!H16)","v":""},{"$f":"D!I16","v":""},{"$f":"IF(D!I16=\"\",\"\",D!J16)","v":""}]
["16.",{"$f":"IF(D!I17=\"\",\"\",D!H17)","v":""},{"$f":"D!I17","v":""},{"$f":"IF(D!I17=\"\",\"\",D!J17)","v":""},null,"Top 5 der Präsidenten"]
["17.",{"$f":"IF(D!I18=\"\",\"\",D!H18)","v":""},{"$f":"D!I18","v":""},{"$f":"IF(D!I18=\"\",\"\",D!J18)","v":""}]
["18.",{"$f":"IF(D!I19=\"\",\"\",D!H19)","v":""},{"$f":"D!I19","v":""},{"$f":"IF(D!I19=\"\",\"\",D!J19)","v":""},null,"Platz:","Name:","Verein:","Punkte:"]
[null,null,null,null,null,"1.",{"$f":"IF(D!N23=\"\",\"\",D!N23)","v":""},{"$f":"IF(D!N23=\"\",\"\",D!M23)","v":""},{"$f":"IF(D!O23=\"\",\"\",D!O23)","v":""}]
["Bester Einzelschütze",null,null,null,null,"2.",{"$f":"IF(D!N24=\"\",\"\",D!N24)","v":""},{"$f":"IF(D!N24=\"\",\"\",D!M24)","v":""},{"$f":"IF(D!O24=\"\",\"\",D!O24)","v":""}]
[null,null,null,null,null,"3.",{"$f":"IF(D!N25=\"\",\"\",D!N25)","v":""},{"$f":"IF(D!N25=\"\",\"\",D!M25)","v":""},{"$f":"IF(D!O25=\"\",\"\",D!O25)","v":""}]
["Punkte:","Name:","Verein:",null,null,"4.",{"$f":"IF(D!N26=\"\",\"\",D!N26)","v":""},{"$f":"IF(D!N26=\"\",\"\",D!M26)","v":""},{"$f":"IF(D!O26=\"\",\"\",D!O26)","v":""}]
[{"$f":"IF(D!E2=\"\",\"\",D!E2)","v":""},{"$f":"IF(D!D2=\"\",\"\",D!D2)","v":""},{"$f":"IF(D!D2=\"\",\"\",D!C2)","v":""},null,null,"5.",{"$f":"IF(D!N27=\"\",\"\",D!N27)","v":""},{"$f":"IF(D!N27=\"\",\"\",D!M27)","v":""},{"$f":"IF(D!O27=\"\",\"\",D!O27)","v":""}]
[]
[null,null,null,null,null,"Top 15 der Schützen"]
["* = Ersatzschütze",null,null,null,null,"Platz:","Name:","Verein:","Punkte:"]
[null,null,null,null,null,"1.",{"$f":"IF(D!N44=\"\",\"\",D!N44)","v":""},{"$f":"IF(D!N44=\"\",\"\",D!M44)","v":""},{"$f":"IF(D!O44=\"\",\"\",D!O44)","v":""}]
[null,null,null,null,null,"2.",{"$f":"IF(D!N45=\"\",\"\",D!N45)","v":""},{"$f":"IF(D!N45=\"\",\"\",D!M45)","v":""},{"$f":"IF(D!O45=\"\",\"\",D!O45)","v":""}]
[null,null,null,null,null,"3.",{"$f":"IF(D!N46=\"\",\"\",D!N46)","v":""},{"$f":"IF(D!N46=\"\",\"\",D!M46)","v":""},{"$f":"IF(D!O46=\"\",\"\",D!O46)","v":""}]
[null,null,null,null,null,"4.",{"$f":"IF(D!N47=\"\",\"\",D!N47)","v":""},{"$f":"IF(D!N47=\"\",\"\",D!M47)","v":""},{"$f":"IF(D!O47=\"\",\"\",D!O47)","v":""}]
[null,null,null,null,null,"5.",{"$f":"IF(D!N48=\"\",\"\",D!N48)","v":""},{"$f":"IF(D!N48=\"\",\"\",D!M48)","v":""},{"$f":"IF(D!O48=\"\",\"\",D!O48)","v":""}]
[null,null,null,null,null,"6.",{"$f":"IF(D!N49=\"\",\"\",D!N49)","v":""},{"$f":"IF(D!N49=\"\",\"\",D!M49)","v":""},{"$f":"IF(D!O49=\"\",\"\",D!O49)","v":""}]
[null,null,null,null,null,"7.",{"$f":"IF(D!N50=\"\",\"\",D!N50)","v":""},{"$f":"IF(D!N50=\"\",\"\",D!M50)","v":""},{"$f":"IF(D!O50=\"\",\"\",D!O50)","v":""}]
[null,null,null,null,null,"8.",{"$f":"IF(D!N51=\"\",\"\",D!N51)","v":""},{"$f":"IF(D!N51=\"\",\"\",D!M51)","v":""},{"$f":"IF(D!O51=\"\",\"\",D!O51)","v":""}]
[null,null,null,null,null,"9.",{"$f":"IF(D!N52=\"\",\"\",D!N52)","v":""},{"$f":"IF(D!N52=\"\",\"\",D!M52)","v":""},{"$f":"IF(D!O52=\"\",\"\",D!O52)","v":""}]
[null,null,null,null,null,"10.",{"$f":"IF(D!N53=\"\",\"\",D!N53)","v":""},{"$f":"IF(D!N53=\"\",\"\",D!M53)","v":""},{"$f":"IF(D!O53=\"\",\"\",D!O53)","v":""}]
[null,null,null,null,null,"11.",{"$f":"IF(D!N54=\"\",\"\",D!N54)","v":""},{"$f":"IF(D!N54=\"\",\"\",D!M54)","v":""},{"$f":"IF(D!O54=\"\",\"\",D!O54)","v":""}]
[null,null,null,null,null,"12.",{"$f":"IF(D!N55=\"\",\"\",D!N55)","v":""},{"$f":"IF(D!N55=\"\",\"\",D!M55)","v":""},{"$f":"IF(D!O55=\"\",\"\",D!O55)","v":""}]
[null,null,null,null,null,"13.",{"$f":"IF(D!N56=\"\",\"\",D!N56)","v":""},{"$f":"IF(D!N56=\"\",\"\",D!M56)","v":""},{"$f":"IF(D!O56=\"\",\"\",D!O56)","v":""}]
[null,null,null,null,null,"14.",{"$f":"IF(D!N57=\"\",\"\",D!N57)","v":""},{"$f":"IF(D!N57=\"\",\"\",D!M57)","v":""},{"$f":"IF(D!O57=\"\",\"\",D!O57)","v":""}]
[null,null,null,null,null,"15.",{"$f":"IF(D!N58=\"\",\"\",D!N58)","v":""},{"$f":"IF(D!N58=\"\",\"\",D!M58)","v":""},{"$f":"IF(D!O58=\"\",\"\",D!O58)","v":""}]

{"sheet":"EW","index":22,"n_rows":49,"n_cols":9,"rows_kept":49,"cut":false,"hidden":false,"merged":[[0,0,0,8],[1,0,1,8],[48,7,49,8]]}
[{"$f":"EM!A1","v":"Volksbankschießen vom 23.04.2023\n in Kirchgellersen"}]
["Einzelauswertung aller Schützen"]
["Platz:","Name:","Verein:","Punkte:",null,"Platz:","Name:","Verein:","Punkte:"]
["1.",{"$f":"IF(D!D2=\"\",\"\",D!D2)","v":""},{"$f":"IF(D!D2=\"\",\"\",D!C2)","v":""},{"$f":"IF(D!E2=\"\",\"\",D!E2)","v":""},null,"46.",{"$f":"IF(D!D47=\"\",\"\",D!D47)","v":""},{"$f":"IF(D!D47=\"\",\"\",D!C47)","v":""},{"$f":"IF(D!E47=\"\",\"\",D!E47)","v":""}]
["2.",{"$f":"IF(D!D3=\"\",\"\",D!D3)","v":""},{"$f":"IF(D!D3=\"\",\"\",D!C3)","v":""},{"$f":"IF(D!E3=\"\",\"\",D!E3)","v":""},null,"47.",{"$f":"IF(D!D48=\"\",\"\",D!D48)","v":""},{"$f":"IF(D!D48=\"\",\"\",D!C48)","v":""},{"$f":"IF(D!E48=\"\",\"\",D!E48)","v":""}]
["3.",{"$f":"IF(D!D4=\"\",\"\",D!D4)","v":""},{"$f":"IF(D!D4=\"\",\"\",D!C4)","v":""},{"$f":"IF(D!E4=\"\",\"\",D!E4)","v":""},null,"48.",{"$f":"IF(D!D49=\"\",\"\",D!D49)","v":""},{"$f":"IF(D!D49=\"\",\"\",D!C49)","v":""},{"$f":"IF(D!E49=\"\",\"\",D!E49)","v":""}]
["4.",{"$f":"IF(D!D5=\"\",\"\",D!D5)","v":""},{"$f":"IF(D!D5=\"\",\"\",D!C5)","v":""},{"$f":"IF(D!E5=\"\",\"\",D!E5)","v":""},null,"49.",{"$f":"IF(D!D50=\"\",\"\",D!D50)","v":""},{"$f":"IF(D!D50=\"\",\"\",D!C50)","v":""},{"$f":"IF(D!E50=\"\",\"\",D!E50)","v":""}]
["5.",{"$f":"IF(D!D6=\"\",\"\",D!D6)","v":""},{"$f":"IF(D!D6=\"\",\"\",D!C6)","v":""},{"$f":"IF(D!E6=\"\",\"\",D!E6)","v":""},null,"50.",{"$f":"IF(D!D51=\"\",\"\",D!D51)","v":""},{"$f":"IF(D!D51=\"\",\"\",D!C51)","v":""},{"$f":"IF(D!E51=\"\",\"\",D!E51)","v":""}]
["6.",{"$f":"IF(D!D7=\"\",\"\",D!D7)","v":""},{"$f":"IF(D!D7=\"\",\"\",D!C7)","v":""},{"$f":"IF(D!E7=\"\",\"\",D!E7)","v":""},null,"51.",{"$f":"IF(D!D52=\"\",\"\",D!D52)","v":""},{"$f":"IF(D!D52=\"\",\"\",D!C52)","v":""},{"$f":"IF(D!E52=\"\",\"\",D!E52)","v":""}]
["7.",{"$f":"IF(D!D8=\"\",\"\",D!D8)","v":""},{"$f":"IF(D!D8=\"\",\"\",D!C8)","v":""},{"$f":"IF(D!E8=\"\",\"\",D!E8)","v":""},null,"52.",{"$f":"IF(D!D53=\"\",\"\",D!D53)","v":""},{"$f":"IF(D!D53=\"\",\"\",D!C53)","v":""},{"$f":"IF(D!E53=\"\",\"\",D!E53)","v":""}]
["8.",{"$f":"IF(D!D9=\"\",\"\",D!D9)","v":""},{"$f":"IF(D!D9=\"\",\"\",D!C9)","v":""},{"$f":"IF(D!E9=\"\",\"\",D!E9)","v":""},null,"53.",{"$f":"IF(D!D54=\"\",\"\",D!D54)","v":""},{"$f":"IF(D!D54=\"\",\"\",D!C54)","v":""},{"$f":"IF(D!E54=\"\",\"\",D!E54)","v":""}]
["9.",{"$f":"IF(D!D10=\"\",\"\",D!D10)","v":""},{"$f":"IF(D!D10=\"\",\"\",D!C10)","v":""},{"$f":"IF(D!E10=\"\",\"\",D!E10)","v":""},null,"54.",{"$f":"IF(D!D55=\"\",\"\",D!D55)","v":""},{"$f":"IF(D!D55=\"\",\"\",D!C55)","v":""},{"$f":"IF(D!E55=\"\",\"\",D!E55)","v":""}]
["10.",{"$f":"IF(D!D11=\"\",\"\",D!D11)","v":""},{"$f":"IF(D!D11=\"\",\"\",D!C11)","v":""},{"$f":"IF(D!E11=\"\",\"\",D!E11)","v":""},null,"55.",{"$f":"IF(D!D56=\"\",\"\",D!D56)","v":""},{"$f":"IF(D!D56=\"\",\"\",D!C56)","v":""},{"$f":"IF(D!E56=\"\",\"\",D!E56)","v":""}]
["11.",{"$f":"IF(D!D12=\"\",\"\",D!D12)","v":""},{"$f":"IF(D!D12=\"\",\"\",D!C12)","v":""},{"$f":"IF(D!E12=\"\",\"\",D!E12)","v":""},null,"56.",{"$f":"IF(D!D57=\"\",\"\",D!D57)","v":""},{"$f":"IF(D!D57=\"\",\"\",D!C57)","v":""},{"$f":"IF(D!E57=\"\",\"\",D!E57)","v":""}]
["12.",{"$f":"IF(D!D13=\"\",\"\",D!D13)","v":""},{"$f":"IF(D!D13=\"\",\"\",D!C13)","v":""},{"$f":"IF(D!E13=\"\",\"\",D!E13)","v":""},null,"57.",{"$f":"IF(D!D58=\"\",\"\",D!D58)","v":""},{"$f":"IF(D!D58=\"\",\"\",D!C58)","v":""},{"$f":"IF(D!E58=\"\",\"\",D!E58)","v":""}]
["13.",{"$f":"IF(D!D14=\"\",\"\",D!D14)","v":""},{"$f":"IF(D!D14=\"\",\"\",D!C14)","v":""},{"$f":"IF(D!E14=\"\",\"\",D!E14)","v":""},null,"58.",{"$f":"IF(D!D59=\"\",\"\",D!D59)","v":""},{"$f":"IF(D!D59=\"\",\"\",D!C59)","v":""},{"$f":"IF(D!E59=\"\",\"\",D!E59)","v":""}]
["14.",{"$f":"IF(D!D15=\"\",\"\",D!D15)","v":""},{"$f":"IF(D!D15=\"\",\"\",D!C15)","v":""},{"$f":"IF(D!E15=\"\",\"\",D!E15)","v":""},null,"59.",{"$f":"IF(D!D60=\"\",\"\",D!D60)","v":""},{"$f":"IF(D!D60=\"\",\"\",D!C60)","v":""},{"$f":"IF(D!E60=\"\",\"\",D!E60)","v":""}]
["15.",{"$f":"IF(D!D16=\"\",\"\",D!D16)","v":""},{"$f":"IF(D!D16=\"\",\"\",D!C16)","v":""},{"$f":"IF(D!E16=\"\",\"\",D!E16)","v":""},null,"60.",{"$f":"IF(D!D61=\"\",\"\",D!D61)","v":""},{"$f":"IF(D!D61=\"\",\"\",D!C61)","v":""},{"$f":"IF(D!E61=\"\",\"\",D!E61)","v":""}]
["16.",{"$f":"IF(D!D17=\"\",\"\",D!D17)","v":""},{"$f":"IF(D!D17=\"\",\"\",D!C17)","v":""},{"$f":"IF(D!E17=\"\",\"\",D!E17)","v":""},null,"61.",{"$f":"IF(D!D62=\"\",\"\",D!D62)","v":""},{"$f":"IF(D!D62=\"\",\"\",D!C62)","v":""},{"$f":"IF(D!E62=\"\",\"\",D!E62)","v":""}]
["17.",{"$f":"IF(D!D18=\"\",\"\",D!D18)","v":""},{"$f":"IF(D!D18=\"\",\"\",D!C18)","v":""},{"$f":"IF(D!E18=\"\",\"\",D!E18)","v":""},null,"62.",{"$f":"IF(D!D63=\"\",\"\",D!D63)","v":""},{"$f":"IF(D!D63=\"\",\"\",D!C63)","v":""},{"$f":"IF(D!E63=\"\",\"\",D!E63)","v":""}]
["18.",{"$f":"IF(D!D19=\"\",\"\",D!D19)","v":""},{"$f":"IF(D!D19=\"\",\"\",D!C19)","v":""},{"$f":"IF(D!E19=\"\",\"\",D!E19)","v":""},null,"63.",{"$f":"IF(D!D64=\"\",\"\",D!D64)","v":""},{"$f":"IF(D!D64=\"\",\"\",D!C64)","v":""},{"$f":"IF(D!E64=\"\",\"\",D!E64)","v":""}]
["19.",{"$f":"IF(D!D20=\"\",\"\",D!D20)","v":""},{"$f":"IF(D!D20=\"\",\"\",D!C20)","v":""},{"$f":"IF(D!E20=\"\",\"\",D!E20)","v":""},null,"64.",{"$f":"IF(D!D65=\"\",\"\",D!D65)","v":""},{"$f":"IF(D!D65=\"\",\"\",D!C65)","v":""},{"$f":"IF(D!E65=\"\",\"\",D!E65)","v":""}]
["20.",{"$f":"IF(D!D21=\"\",\"\",D!D21)","v":""},{"$f":"IF(D!D21=\"\",\"\",D!C21)","v":""},{"$f":"IF(D!E21=\"\",\"\",D!E21)","v":""},null,"65.",{"$f":"IF(D!D66=\"\",\"\",D!D66)","v":""},{"$f":"IF(D!D66=\"\",\"\",D!C66)","v":""},{"$f":"IF(D!E66=\"\",\"\",D!E66)","v":""}]
["21.",{"$f":"IF(D!D22=\"\",\"\",D!D22)","v":""},{"$f":"IF(D!D22=\"\",\"\",D!C22)","v":""},{"$f":"IF(D!E22=\"\",\"\",D!E22)","v":""},null,"66.",{"$f":"IF(D!D67=\"\",\"\",D!D67)","v":""},{"$f":"IF(D!D67=\"\",\"\",D!C67)","v":""},{"$f":"IF(D!E67=\"\",\"\",D!E67)","v":""}]
["22.",{"$f":"IF(D!D23=\"\",\"\",D!D23)","v":""},{"$f":"IF(D!D23=\"\",\"\",D!C23)","v":""},{"$f":"IF(D!E23=\"\",\"\",D!E23)","v":""},null,"67.",{"$f":"IF(D!D68=\"\",\"\",D!D68)","v":""},{"$f":"IF(D!D68=\"\",\"\",D!C68)","v":""},{"$f":"IF(D!E68=\"\",\"\",D!E68)","v":""}]
["23.",{"$f":"IF(D!D24=\"\",\"\",D!D24)","v":""},{"$f":"IF(D!D24=\"\",\"\",D!C24)","v":""},{"$f":"IF(D!E24=\"\",\"\",D!E24)","v":""},null,"68.",{"$f":"IF(D!D69=\"\",\"\",D!D69)","v":""},{"$f":"IF(D!D69=\"\",\"\",D!C69)","v":""},{"$f":"IF(D!E69=\"\",\"\",D!E69)","v":""}]
["24.",{"$f":"IF(D!D25=\"\",\"\",D!D25)","v":""},{"$f":"IF(D!D25=\"\",\"\",D!C25)","v":""},{"$f":"IF(D!E25=\"\",\"\",D!E25)","v":""},null,"69.",{"$f":"IF(D!D70=\"\",\"\",D!D70)","v":""},{"$f":"IF(D!D70=\"\",\"\",D!C70)","v":""},{"$f":"IF(D!E70=\"\",\"\",D!E70)","v":""}]
["25.",{"$f":"IF(D!D26=\"\",\"\",D!D26)","v":""},{"$f":"IF(D!D26=\"\",\"\",D!C26)","v":""},{"$f":"IF(D!E26=\"\",\"\",D!E26)","v":""},null,"70.",{"$f":"IF(D!D71=\"\",\"\",D!D71)","v":""},{"$f":"IF(D!D71=\"\",\"\",D!C71)","v":""},{"$f":"IF(D!E71=\"\",\"\",D!E71)","v":""}]
["26.",{"$f":"IF(D!D27=\"\",\"\",D!D27)","v":""},{"$f":"IF(D!D27=\"\",\"\",D!C27)","v":""},{"$f":"IF(D!E27=\"\",\"\",D!E27)","v":""},null,"71.",{"$f":"IF(D!D72=\"\",\"\",D!D72)","v":""},{"$f":"IF(D!D72=\"\",\"\",D!C72)","v":""},{"$f":"IF(D!E72=\"\",\"\",D!E72)","v":""}]
["27.",{"$f":"IF(D!D28=\"\",\"\",D!D28)","v":""},{"$f":"IF(D!D28=\"\",\"\",D!C28)","v":""},{"$f":"IF(D!E28=\"\",\"\",D!E28)","v":""},null,"72.",{"$f":"IF(D!D73=\"\",\"\",D!D73)","v":""},{"$f":"IF(D!D73=\"\",\"\",D!C73)","v":""},{"$f":"IF(D!E73=\"\",\"\",D!E73)","v":""}]
["28.",{"$f":"IF(D!D29=\"\",\"\",D!D29)","v":""},{"$f":"IF(D!D29=\"\",\"\",D!C29)","v":""},{"$f":"IF(D!E29=\"\",\"\",D!E29)","v":""},null,"73.",{"$f":"IF(D!D74=\"\",\"\",D!D74)","v":""},{"$f":"IF(D!D74=\"\",\"\",D!C74)","v":""},{"$f":"IF(D!E74=\"\",\"\",D!E74)","v":""}]
["29.",{"$f":"IF(D!D30=\"\",\"\",D!D30)","v":""},{"$f":"IF(D!D30=\"\",\"\",D!C30)","v":""},{"$f":"IF(D!E30=\"\",\"\",D!E30)","v":""},null,"74.",{"$f":"IF(D!D75=\"\",\"\",D!D75)","v":""},{"$f":"IF(D!D75=\"\",\"\",D!C75)","v":""},{"$f":"IF(D!E75=\"\",\"\",D!E75)","v":""}]
["30.",{"$f":"IF(D!D31=\"\",\"\",D!D31)","v":""},{"$f":"IF(D!D31=\"\",\"\",D!C31)","v":""},{"$f":"IF(D!E31=\"\",\"\",D!E31)","v":""},null,"75.",{"$f":"IF(D!D76=\"\",\"\",D!D76)","v":""},{"$f":"IF(D!D76=\"\",\"\",D!C76)","v":""},{"$f":"IF(D!E76=\"\",\"\",D!E76)","v":""}]
["31.",{"$f":"IF(D!D32=\"\",\"\",D!D32)","v":""},{"$f":"IF(D!D32=\"\",\"\",D!C32)","v":""},{"$f":"IF(D!E32=\"\",\"\",D!E32)","v":""},null,"76.",{"$f":"IF(D!D77=\"\",\"\",D!D77)","v":""},{"$f":"IF(D!D77=\"\",\"\",D!C77)","v":""},{"$f":"IF(D!E77=\"\",\"\",D!E77)","v":""}]
["32.",{"$f":"IF(D!D33=\"\",\"\",D!D33)","v":""},{"$f":"IF(D!D33=\"\",\"\",D!C33)","v":""},{"$f":"IF(D!E33=\"\",\"\",D!E33)","v":""},null,"77.",{"$f":"IF(D!D78=\"\",\"\",D!D78)","v":""},{"$f":"IF(D!D78=\"\",\"\",D!C78)","v":""},{"$f":"IF(D!E78=\"\",\"\",D!E78)","v":""}]
["33.",{"$f":"IF(D!D34=\"\",\"\",D!D34)","v":""},{"$f":"IF(D!D34=\"\",\"\",D!C34)","v":""},{"$f":"IF(D!E34=\"\",\"\",D!E34)","v":""},null,"78.",{"$f":"IF(D!D79=\"\",\"\",D!D79)","v":""},{"$f":"IF(D!D79=\"\",\"\",D!C79)","v":""},{"$f":"IF(D!E79=\"\",\"\",D!E79)","v":""}]
["34.",{"$f":"IF(D!D35=\"\",\"\",D!D35)","v":""},{"$f":"IF(D!D35=\"\",\"\",D!C35)","v":""},{"$f":"IF(D!E35=\"\",\"\",D!E35)","v":""},null,"79.",{"$f":"IF(D!D80=\"\",\"\",D!D80)","v":""},{"$f":"IF(D!D80=\"\",\"\",D!C80)","v":""},{"$f":"IF(D!E80=\"\",\"\",D!E80)","v":""}]
["35.",{"$f":"IF(D!D36=\"\",\"\",D!D36)","v":""},{"$f":"IF(D!D36=\"\",\"\",D!C36)","v":""},{"$f":"IF(D!E36=\"\",\"\",D!E36)","v":""},null,"80.",{"$f":"IF(D!D81=\"\",\"\",D!D81)","v":""},{"$f":"IF(D!D81=\"\",\"\",D!C81)","v":""},{"$f":"IF(D!E81=\"\",\"\",D!E81)","v":""}]
["36.",{"$f":"IF(D!D37=\"\",\"\",D!D37)","v":""},{"$f":"IF(D!D37=\"\",\"\",D!C37)","v":""},{"$f":"IF(D!E37=\"\",\"\",D!E37)","v":""},null,"81.",{"$f":"IF(D!D82=\"\",\"\",D!D82)","v":""},{"$f":"IF(D!D82=\"\",\"\",D!C82)","v":""},{"$f":"IF(D!E82=\"\",\"\",D!E82)","v":""}]
["37.",{"$f":"IF(D!D38=\"\",\"\",D!D38)","v":""},{"$f":"IF(D!D38=\"\",\"\",D!C38)","v":""},{"$f":"IF(D!E38=\"\",\"\",D!E38)","v":""},null,"82.",{"$f":"IF(D!D83=\"\",\"\",D!D83)","v":""},{"$f":"IF(D!D83=\"\",\"\",D!C83)","v":""},{"$f":"IF(D!E83=\"\",\"\",D!E83)","v":""}]
["38.",{"$f":"IF(D!D39=\"\",\"\",D!D39)","v":""},{"$f":"IF(D!D39=\"\",\"\",D!C39)","v":""},{"$f":"IF(D!E39=\"\",\"\",D!E39)","v":""},null,"83.",{"$f":"IF(D!D84=\"\",\"\",D!D84)","v":""},{"$f":"IF(D!D84=\"\",\"\",D!C84)","v":""},{"$f":"IF(D!E84=\"\",\"\",D!E84)","v":""}]
["39.",{"$f":"IF(D!D40=\"\",\"\",D!D40)","v":""},{"$f":"IF(D!D40=\"\",\"\",D!C40)","v":""},{"$f":"IF(D!E40=\"\",\"\",D!E40)","v":""},null,"84.",{"$f":"IF(D!D85=\"\",\"\",D!D85)","v":""},{"$f":"IF(D!D85=\"\",\"\",D!C85)","v":""},{"$f":"IF(D!E85=\"\",\"\",D!E85)","v":""}]
["40.",{"$f":"IF(D!D41=\"\",\"\",D!D41)","v":""},{"$f":"IF(D!D41=\"\",\"\",D!C41)","v":""},{"$f":"IF(D!E41=\"\",\"\",D!E41)","v":""},null,"85.",{"$f":"IF(D!D86=\"\",\"\",D!D86)","v":""},{"$f":"IF(D!D86=\"\",\"\",D!C86)","v":""},{"$f":"IF(D!E86=\"\",\"\",D!E86)","v":""}]
["41.",{"$f":"IF(D!D42=\"\",\"\",D!D42)","v":""},{"$f":"IF(D!D42=\"\",\"\",D!C42)","v":""},{"$f":"IF(D!E42=\"\",\"\",D!E42)","v":""},null,"86.",{"$f":"IF(D!D87=\"\",\"\",D!D87)","v":""},{"$f":"IF(D!D87=\"\",\"\",D!C87)","v":""},{"$f":"IF(D!E87=\"\",\"\",D!E87)","v":""}]
["42.",{"$f":"IF(D!D43=\"\",\"\",D!D43)","v":""},{"$f":"IF(D!D43=\"\",\"\",D!C43)","v":""},{"$f":"IF(D!E43=\"\",\"\",D!E43)","v":""},null,"87.",{"$f":"IF(D!D88=\"\",\"\",D!D88)","v":""},{"$f":"IF(D!D88=\"\",\"\",D!C88)","v":""},{"$f":"IF(D!E88=\"\",\"\",D!E88)","v":""}]
["43.",{"$f":"IF(D!D44=\"\",\"\",D!D44)","v":""},{"$f":"IF(D!D44=\"\",\"\",D!C44)","v":""},{"$f":"IF(D!E44=\"\",\"\",D!E44)","v":""},null,"88.",{"$f":"IF(D!D89=\"\",\"\",D!D89)","v":""},{"$f":"IF(D!D89=\"\",\"\",D!C89)","v":""},{"$f":"IF(D!E89=\"\",\"\",D!E89)","v":""}]
["44.",{"$f":"IF(D!D45=\"\",\"\",D!D45)","v":""},{"$f":"IF(D!D45=\"\",\"\",D!C45)","v":""},{"$f":"IF(D!E45=\"\",\"\",D!E45)","v":""},null,"89.",{"$f":"IF(D!D90=\"\",\"\",D!D90)","v":""},{"$f":"IF(D!D90=\"\",\"\",D!C90)","v":""},{"$f":"IF(D!E90=\"\",\"\",D!E90)","v":""}]
["45.",{"$f":"IF(D!D46=\"\",\"\",D!D46)","v":""},{"$f":"IF(D!D46=\"\",\"\",D!C46)","v":""},{"$f":"IF(D!E46=\"\",\"\",D!E46)","v":""},null,"90.",{"$f":"IF(D!D91=\"\",\"\",D!D91)","v":""},{"$f":"IF(D!D91=\"\",\"\",D!C91)","v":""},{"$f":"IF(D!E91=\"\",\"\",D!E91)","v":""}]
[null,null,null,null,null,null,null,"* = Ersatzschütze"]

{"sheet":"Hilfe","index":23,"n_rows":33,"n_cols":1,"rows_kept":33,"cut":false,"hidden":false,"merged":[[32,0,41,6]]}
[]
[]
[]
[]
[]
[]
[]
[]
[]
[]
[]
[]
[]
[]
[]
[]
[]
[]
[]
[]
[]
[]
[]
[]
[]
[]
[]
[]
[]
[]
[]
[]
["\"Achtung bei der Teiler - Eingabe bei den Mannschaften\"\nBei der Teiler Eingabe ist unbedigt darauf zu achten,\ndas die Teiler (z.B. 157,6) mit einem \"Komma\" \nund nicht mit einem \"Punkt\" (z.B 157.6) eigegeben werden!\nSonst werden diese Teiler nicht mitgezählt…\n\nDie Eingabe der Ringe erfolgt als ganze Zahl ohne Komma."]